{"text_format":"1","workbook":"xlsx","n_sheets":21,"sheets":["KATILIM","KIZ GRUP","On_Eleme","32DE","32DE(16)","16","16DE","16(8DE)","KIZ ANA TABLO","8DE","8TE","Cift_Mix","SIRALAMA","Ferdi","Puan","5_Mac","Olimpik","Yeni_Olimpik","5_Mac_KC","Olimpik_KC","Yeni_Olimpik_KC"],"not_rendered":{"charts":0,"images":8,"macros":1,"external_links":0,"defined_names":14,"comments":0,"pivot_tables":0},"unopened":[],"bounds":{"document_bytes":16777216,"sheet_cells":100000,"rows_first":2000,"rows_last":500,"rows_between":2000,"halvings":0,"cell_chars":16384,"cell_head_chars":4096},"cells_cut":0,"cells_raw":0,"read":"whole","date_system":"1900"}

{"sheet":"KATILIM","index":0,"n_rows":313,"n_cols":32,"rows_kept":313,"cut":false,"hidden":false,"merged":[[1,34,2,35],[0,0,0,8],[1,0,1,8]]}
["TÜRKİYE MASA TENİSİ FEDERASYONU\nYILDIZLAR KUZEYDOĞU BÖLGE YARIŞMALARI",null,null,null,null,null,null,null,null,null,null,null,null,null,null,null,null,null,null,null,null,null,null,null,null,null,null,"Ferdi","TÜRKİYE MASA TENİSİ FEDERASYONU\nYILDIZLAR KUZEYDOĞU BÖLGE YARIŞMALARI"]
["KIZ TAKIM  [01-02 Mart 2025 SİVAS]",null,null,null,null,null,null,null,null,null,null,null,null,null,null,null,null,null,null,null,null,null,null,null,null,null,null,"Grup","KIZ TAKIM  [01-02 Mart 2025 SİVAS]"]
["No",null,"Puan","Sporcu","İl","İl",null,"TŞ","Grup",null,null,null,null,null,null,null,null,null,null,null,null,null,null,null,null,null,null,1,"[ Ön Eleme ]","[ Eleme ]","[ Ana Tablo ]","[ Grup ]"]
[1,null,null,"ŞAFAKTEPE SPOR KULÜBÜ","ANK","ANKARA",null,2,"Kız","KDB",null,null,null,null,null,null,null,null,null,null,null,null,null,null,null,"ŞAFAKTEPE SPOR KULÜBÜ (ANK)","ŞAFAKTEPE SPOR KULÜBÜ"]
[2,null,null,"YALIKÖY ŞEHİT BARIŞ ÇAKIR (A)","GRS","GİRESUN","",7,"Kız","KDB",null,null,null,null,null,null,null,null,null,null,null,null,null,null,null,"YALIKÖY ŞEHİT BARIŞ ÇAKIR (A) (GRS)","YALIKÖY ŞEHİT BARIŞ ÇAKIR (A)"]
[3,0.36401867866516113,null,"ÇORUM ARENA SPOR (A)","ÇRM","ÇORUM","","9","Kız","KDB",null,null,null,null,null,null,null,null,null,null,null,null,null,null,null,"ÇORUM ARENA SPOR (A) (ÇRM)","ÇORUM ARENA SPOR (A)"]
[4,0.5248684287071228,null,"KUTLUBEY OKULLARI (A)","AMS","AMASYA","",9,"Kız","KDB",null,null,null,null,null,null,null,null,null,null,null,null,null,null,null,"KUTLUBEY OKULLARI (A) (AMS)","KUTLUBEY OKULLARI (A)"]
[5,0.94955664873123169,null,"KUTLUBEY OKULLARI (B)","AMS","AMASYA","",9,"Kız","KDB",null,null,null,null,null,null,null,null,null,null,null,null,null,null,null,"KUTLUBEY OKULLARI (B) (AMS)","KUTLUBEY OKULLARI (B)"]
[15,2.4121999740600586E-4,null,"AĞRI GSK (A)","AĞR","AĞRI","","","Kız","KDB",null,null,null,null,null,null,null,null,null,null,null,null,null,null,null,"AĞRI GSK (A) (AĞR)","AĞRI GSK (A)"]
[6,1.875835657119751E-2,null,"KUTLUBEY OKULLARI (C)","AMS","AMASYA","","","Kız","KDB",null,null,null,null,null,null,null,null,null,null,null,null,null,null,null,"KUTLUBEY OKULLARI (C) (AMS)","KUTLUBEY OKULLARI (C)"]
[10,7.3953330516815186E-2,null,"ANKARA B. ŞEH. BLD. SPOR","ANK","ANKARA",null,null,"Kız","KDB",null,null,null,null,null,null,null,null,null,null,null,null,null,null,null,"ANKARA B. ŞEH. BLD. SPOR (ANK)","ANKARA B. ŞEH. BLD. SPOR"]
[13,0.10545265674591064,null,"MASA-DER (A)","ANK","ANKARA","","","Kız","KDB",null,null,null,null,null,null,null,null,null,null,null,null,null,null,null,"MASA-DER (A) (ANK)","MASA-DER (A)"]
[14,0.10737532377243042,null,"ŞEKER 06 SPOR  KULÜBÜ (A)","ANK","ANKARA","","","Kız","KDB",null,null,null,null,null,null,null,null,null,null,null,null,null,null,null,"ŞEKER 06 SPOR  KULÜBÜ (A) (ANK)","ŞEKER 06 SPOR  KULÜBÜ (A)"]
[12,0.1282498836517334,null,"BAYBURT GMSK (A)","BYB","BAYBURT","","","Kız","KDB",null,null,null,null,null,null,null,null,null,null,null,null,null,null,null,"BAYBURT GMSK (A) (BYB)","BAYBURT GMSK (A)"]
[7,0.21036863327026367,null,"ÇORUM SPOR İHTİSAS (A)","ÇRM","ÇORUM","","","Kız","KDB",null,null,null,null,null,null,null,null,null,null,null,null,null,null,null,"ÇORUM SPOR İHTİSAS (A) (ÇRM)","ÇORUM SPOR İHTİSAS (A)"]
[11,0.33169442415237427,null,"GİRESUN GSK (A)","GRS","GİRESUN","","","Kız","KDB",null,null,null,null,null,null,null,null,null,null,null,null,null,null,null,"GİRESUN GSK (A) (GRS)","GİRESUN GSK (A)"]
[20,0.39047145843505859,null,"KIRIKKALE YURDUM SPOR (A)","KRK","KIRIKKALE","","","Kız","KDB",null,null,null,null,null,null,null,null,null,null,null,null,null,null,null,"KIRIKKALE YURDUM SPOR (A) (KRK)","KIRIKKALE YURDUM SPOR (A)"]
[16,0.45964080095291138,null,"FINDIKLI 1974 SPOR (A)","RİZ","RİZE","","","Kız","KDB",null,null,null,null,null,null,null,null,null,null,null,null,null,null,null,"FINDIKLI 1974 SPOR (A) (RİZ)","FINDIKLI 1974 SPOR (A)"]
[17,0.53679406642913818,null,"GENÇLİK SPOR (A)","SVS","SİVAS","","","Kız","KDB",null,null,null,null,null,null,null,null,null,null,null,null,null,null,null,"GENÇLİK SPOR (A) (SVS)","GENÇLİK SPOR (A)"]
[8,0.59609454870223999,null,"GENÇLİK SPOR (B)","SVS","SİVAS","","","Kız","KDB",null,null,null,null,null,null,null,null,null,null,null,null,null,null,null,"GENÇLİK SPOR (B) (SVS)","GENÇLİK SPOR (B)"]
[18,0.75368809700012207,null,"SİVAS DANİŞMENT 1967 SPOR (A)","SVS","SİVAS","","","Kız","KDB",null,null,null,null,null,null,null,null,null,null,null,null,null,null,null,"SİVAS DANİŞMENT 1967 SPOR (A) (SVS)","SİVAS DANİŞMENT 1967 SPOR (A)"]
[9,0.78399527072906494,null,"SİVAS OKÇULUK SPOR (A)","SVS","SİVAS","","","Kız","KDB",null,null,null,null,null,null,null,null,null,null,null,null,null,null,null,"SİVAS OKÇULUK SPOR (A) (SVS)","SİVAS OKÇULUK SPOR (A)"]
[19,0.83273017406463623,null,"SİVAS OKÇULUK SPOR (B)","SVS","SİVAS","","","Kız","KDB",null,null,null,null,null,null,null,null,null,null,null,null,null,null,null,"SİVAS OKÇULUK SPOR (B) (SVS)","SİVAS OKÇULUK SPOR (B)"]
[21,null,null,null,null,null,null,null,null,null,null,null,null,null,null,null,null,null,null,null,null,null,null,null,null,0,0]
[22,null,null,null,null,null,null,null,null,null,null,null,null,null,null,null,null,null,null,null,null,null,null,null,null,0,0]
[23,null,null,null,null,null,null,null,null,null,null,null,null,null,null,null,null,null,null,null,null,null,null,null,null,0,0]
[24,null,null,null,null,null,null,null,null,null,null,null,null,null,null,null,null,null,null,null,null,null,null,null,null,0,0]
[25,null,null,null,null,null,null,null,null,null,null,null,null,null,null,null,null,null,null,null,null,null,null,null,null,0,0]
[26,null,null,null,null,null,null,null,null,null,null,null,null,null,null,null,null,null,null,null,null,null,null,null,null,0,0]
[27,null,null,null,null,null,null,null,null,null,null,null,null,null,null,null,null,null,null,null,null,null,null,null,null,0,0]
[28,null,null,null,null,null,null,null,null,null,null,null,null,null,null,null,null,null,null,null,null,null,null,null,null,0,0]
[29,null,null,null,null,null,null,null,null,null,null,null,null,null,null,null,null,null,null,null,null,null,null,null,null,0,0]
[30,null,null,null,null,null,null,null,null,null,null,null,null,null,null,null,null,null,null,null,null,null,null,null,null,0,0]
[31,null,null,null,null,null,null,null,null,null,null,null,null,null,null,null,null,null,null,null,null,null,null,null,null,0,0]
[32,null,null,null,null,null,null,null,null,null,null,null,null,null,null,null,null,null,null,null,null,null,null,null,null,0,0]
[33,null,null,null,null,null,null,null,null,null,null,null,null,null,null,null,null,null,null,null,null,null,null,null,null,0,0]
[34,null,null,null,null,null,null,null,null,null,null,null,null,null,null,null,null,null,null,null,null,null,null,null,null,0,0]
[35,null,null,null,null,null,null,null,null,null,null,null,null,null,null,null,null,null,null,null,null,null,null,null,null,0,0]
[36,null,null,null,null,null,null,null,null,null,null,null,null,null,null,null,null,null,null,null,null,null,null,null,null,0,0]
[37,null,null,null,null,null,null,null,null,null,null,null,null,null,null,null,null,null,null,null,null,null,null,null,null,0,0]
[38,null,null,null,null,null,null,null,null,null,null,null,null,null,null,null,null,null,null,null,null,null,null,null,null,0,0]
[39,null,null,null,null,null,null,null,null,null,null,null,null,null,null,null,null,null,null,null,null,null,null,null,null,0,0]
[40,null,null,null,null,null,null,null,null,null,null,null,null,null,null,null,null,null,null,null,null,null,null,null,null,0,0]
[41,null,null,null,null,null,null,null,null,null,null,null,null,null,null,null,null,null,null,null,null,null,null,null,null,0,0]
[42,null,null,null,null,null,null,null,null,null,null,null,null,null,null,null,null,null,null,null,null,null,null,null,null,0,0]
[43,null,null,null,null,null,null,null,null,null,null,null,null,null,null,null,null,null,null,null,null,null,null,null,null,0,0]
[44,null,null,null,null,null,null,null,null,null,null,null,null,null,null,null,null,null,null,null,null,null,null,null,null,0,0]
[45,null,null,null,null,null,null,null,null,null,null,null,null,null,null,null,null,null,null,null,null,null,null,null,null,0,0]
[46,null,null,null,null,null,null,null,null,null,null,null,null,null,null,null,null,null,null,null,null,null,null,null,null,0,0]
[47,null,null,null,null,null,null,null,null,null,null,null,null,null,null,null,null,null,null,null,null,null,null,null,null,0,0]
[48,null,null,null,null,null,null,null,null,null,null,null,null,null,null,null,null,null,null,null,null,null,null,null,null,0,0]
[49,null,null,null,null,null,null,null,null,null,null,null,null,null,null,null,null,null,null,null,null,null,null,null,null,0,0]
[50,null,null,null,null,null,null,null,null,null,null,null,null,null,null,null,null,null,null,null,null,null,null,null,null,0,0]
[51,null,null,null,null,null,null,null,null,null,null,null,null,null,null,null,null,null,null,null,null,null,null,null,null,0,0]
[52,null,null,null,null,null,null,null,null,null,null,null,null,null,null,null,null,null,null,null,null,null,null,null,null,0,0]
[53,null,null,null,null,null,null,null,null,null,null,null,null,null,null,null,null,null,null,null,null,null,null,null,null,0,0]
[54,null,null,null,null,null,null,null,null,null,null,null,null,null,null,null,null,null,null,null,null,null,null,null,null,0,0]
[55,null,null,null,null,null,null,null,null,null,null,null,null,null,null,null,null,null,null,null,null,null,null,null,null,0,0]
[56,null,null,null,null,null,null,null,null,null,null,null,null,null,null,null,null,null,null,null,null,null,null,null,null,0,0]
[57,null,null,null,null,null,null,null,null,null,null,null,null,null,null,null,null,null,null,null,null,null,null,null,null,0,0]
[58,null,null,null,null,null,null,null,null,null,null,null,null,null,null,null,null,null,null,null,null,null,null,null,null,0,0]
[59,null,null,null,null,null,null,null,null,null,null,null,null,null,null,null,null,null,null,null,null,null,null,null,null,0,0]
[60,null,null,null,null,null,null,null,null,null,null,null,null,null,null,null,null,null,null,null,null,null,null,null,null,0,0]
[61,null,null,null,null,null,null,null,null,null,null,null,null,null,null,null,null,null,null,null,null,null,null,null,null,0,0]
[62,null,null,null,null,null,null,null,null,null,null,null,null,null,null,null,null,null,null,null,null,null,null,null,null,0,0]
[63,null,null,null,null,null,null,null,null,null,null,null,null,null,null,null,null,null,null,null,null,null,null,null,null,0,0]
[64,null,null,null,null,null,null,null,null,null,null,null,null,null,null,null,null,null,null,null,null,null,null,null,null,0,0]
[65,null,null,null,null,null,null,null,null,null,null,null,null,null,null,null,null,null,null,null,null,null,null,null,null,0,0]
[66,null,null,null,null,null,null,null,null,null,null,null,null,null,null,null,null,null,null,null,null,null,null,null,null,0,0]
[67,null,null,null,null,null,null,null,null,null,null,null,null,null,null,null,null,null,null,null,null,null,null,null,null,0,0]
[68,null,null,null,null,null,null,null,null,null,null,null,null,null,null,null,null,null,null,null,null,null,null,null,null,0,0]
[69,null,null,null,null,null,null,null,null,null,null,null,null,null,null,null,null,null,null,null,null,null,null,null,null,0,0]
[70,null,null,null,null,null,null,null,null,null,null,null,null,null,null,null,null,null,null,null,null,null,null,null,null,0,0]
[71,null,null,null,null,null,null,null,null,null,null,null,null,null,null,null,null,null,null,null,null,null,null,null,null,0,0]
[72,null,null,null,null,null,null,null,null,null,null,null,null,null,null,null,null,null,null,null,null,null,null,null,null,0,0]
[73,null,null,null,null,null,null,null,null,null,null,null,null,null,null,null,null,null,null,null,null,null,null,null,null,0,0]
[74,null,null,null,null,null,null,null,null,null,null,null,null,null,null,null,null,null,null,null,null,null,null,null,null,0,0]
[75,null,null,null,null,null,null,null,null,null,null,null,null,null,null,null,null,null,null,null,null,null,null,null,null,0,0]
[76,null,null,null,null,null,null,null,null,null,null,null,null,null,null,null,null,null,null,null,null,null,null,null,null,0,0]
[77,null,null,null,null,null,null,null,null,null,null,null,null,null,null,null,null,null,null,null,null,null,null,null,null,0,0]
[78,null,null,null,null,null,null,null,null,null,null,null,null,null,null,null,null,null,null,null,null,null,null,null,null,0,0]
[79,null,null,null,null,null,null,null,null,null,null,null,null,null,null,null,null,null,null,null,null,null,null,null,null,0,0]
[80,null,null,null,null,null,null,null,null,null,null,null,null,null,null,null,null,null,null,null,null,null,null,null,null,0,0]
[81,null,null,null,null,null,null,null,null,null,null,null,null,null,null,null,null,null,null,null,null,null,null,null,null,0,0]
[82,null,null,null,null,null,null,null,null,null,null,null,null,null,null,null,null,null,null,null,null,null,null,null,null,0,0]
[83,null,null,null,null,null,null,null,null,null,null,null,null,null,null,null,null,null,null,null,null,null,null,null,null,0,0]
[84,null,null,null,null,null,null,null,null,null,null,null,null,null,null,null,null,null,null,null,null,null,null,null,null,0,0]
[85,null,null,null,null,null,null,null,null,null,null,null,null,null,null,null,null,null,null,null,null,null,null,null,null,0,0]
[86,null,null,null,null,null,null,null,null,null,null,null,null,null,null,null,null,null,null,null,null,null,null,null,null,0,0]
[87,null,null,null,null,null,null,null,null,null,null,null,null,null,null,null,null,null,null,null,null,null,null,null,null,0,0]
[88,null,null,null,null,null,null,null,null,null,null,null,null,null,null,null,null,null,null,null,null,null,null,null,null,0,0]
[89,null,null,null,null,null,null,null,null,null,null,null,null,null,null,null,null,null,null,null,null,null,null,null,null,0,0]
[90,null,null,null,null,null,null,null,null,null,null,null,null,null,null,null,null,null,null,null,null,null,null,null,null,0,0]
[91,null,null,null,null,null,null,null,null,null,null,null,null,null,null,null,null,null,null,null,null,null,null,null,null,0,0]
[92,null,null,null,null,null,null,null,null,null,null,null,null,null,null,null,null,null,null,null,null,null,null,null,null,0,0]
[93,null,null,null,null,null,null,null,null,null,null,null,null,null,null,null,null,null,null,null,null,null,null,null,null,0,0]
[94,null,null,null,null,null,null,null,null,null,null,null,null,null,null,null,null,null,null,null,null,null,null,null,null,0,0]
[95,null,null,null,null,null,null,null,null,null,null,null,null,null,null,null,null,null,null,null,null,null,null,null,null,0,0]
[96,null,null,null,null,null,null,null,null,null,null,null,null,null,null,null,null,null,null,null,null,null,null,null,null,0,0]
[97,null,null,null,null,null,null,null,null,null,null,null,null,null,null,null,null,null,null,null,null,null,null,null,null,0,0]
[98,null,null,null,null,null,null,null,null,null,null,null,null,null,null,null,null,null,null,null,null,null,null,null,null,0,0]
[99,null,null,null,null,null,null,null,null,null,null,null,null,null,null,null,null,null,null,null,null,null,null,null,null,0,0]
[100,null,null,null,null,null,null,null,null,null,null,null,null,null,null,null,null,null,null,null,null,null,null,null,null,0,0]
[101,null,null,null,null,null,null,null,null,null,null,null,null,null,null,null,null,null,null,null,null,null,null,null,null,0,0]
[102,null,null,null,null,null,null,null,null,null,null,null,null,null,null,null,null,null,null,null,null,null,null,null,null,0,0]
[103,null,null,null,null,null,null,null,null,null,null,null,null,null,null,null,null,null,null,null,null,null,null,null,null,0,0]
[104,null,null,null,null,null,null,null,null,null,null,null,null,null,null,null,null,null,null,null,null,null,null,null,null,0,0]
[105,null,null,null,null,null,null,null,null,null,null,null,null,null,null,null,null,null,null,null,null,null,null,null,null,0,0]
[106,null,null,null,null,null,null,null,null,null,null,null,null,null,null,null,null,null,null,null,null,null,null,null,null,0,0]
[107,null,null,null,null,null,null,null,null,null,null,null,null,null,null,null,null,null,null,null,null,null,null,null,null,0,0]
[108,null,null,null,null,null,null,null,null,null,null,null,null,null,null,null,null,null,null,null,null,null,null,null,null,0,0]
[109,null,null,null,null,null,null,null,null,null,null,null,null,null,null,null,null,null,null,null,null,null,null,null,null,0,0]
[110,null,null,null,null,null,null,null,null,null,null,null,null,null,null,null,null,null,null,null,null,null,null,null,null,0,0]
[111,null,null,null,null,null,null,null,null,null,null,null,null,null,null,null,null,null,null,null,null,null,null,null,null,0,0]
[112,null,null,null,null,null,null,null,null,null,null,null,null,null,null,null,null,null,null,null,null,null,null,null,null,0,0]
[113,null,null,null,null,null,null,null,null,null,null,null,null,null,null,null,null,null,null,null,null,null,null,null,null,0,0]
[114,null,null,null,null,null,null,null,null,null,null,null,null,null,null,null,null,null,null,null,null,null,null,null,null,0,0]
[115,null,null,null,null,null,null,null,null,null,null,null,null,null,null,null,null,null,null,null,null,null,null,null,null,0,0]
[116,null,null,null,null,null,null,null,null,null,null,null,null,null,null,null,null,null,null,null,null,null,null,null,null,0,0]
[117,null,null,null,null,null,null,null,null,null,null,null,null,null,null,null,null,null,null,null,null,null,null,null,null,0,0]
[118,null,null,null,null,null,null,null,null,null,null,null,null,null,null,null,null,null,null,null,null,null,null,null,null,0,0]
[119,null,null,null,null,null,null,null,null,null,null,null,null,null,null,null,null,null,null,null,null,null,null,null,null,0,0]
[120,null,null,null,null,null,null,null,null,null,null,null,null,null,null,null,null,null,null,null,null,null,null,null,null,0,0]
[121,null,null,null,null,null,null,null,null,null,null,null,null,null,null,null,null,null,null,null,null,null,null,null,null,0,0]
[122,null,null,null,null,null,null,null,null,null,null,null,null,null,null,null,null,null,null,null,null,null,null,null,null,0,0]
[123,null,null,null,null,null,null,null,null,null,null,null,null,null,null,null,null,null,null,null,null,null,null,null,null,0,0]
[124,null,null,null,null,null,null,null,null,null,null,null,null,null,null,null,null,null,null,null,null,null,null,null,null,0,0]
[125,null,null,null,null,null,null,null,null,null,null,null,null,null,null,null,null,null,null,null,null,null,null,null,null,0,0]
[126,null,null,null,null,null,null,null,null,null,null,null,null,null,null,null,null,null,null,null,null,null,null,null,null,0,0]
[127,null,null,null,null,null,null,null,null,null,null,null,null,null,null,null,null,null,null,null,null,null,null,null,null,0,0]
[128,null,null,null,null,null,null,null,null,null,null,null,null,null,null,null,null,null,null,null,null,null,null,null,null,0,0]
[129,null,null,null,null,null,null,null,null,null,null,null,null,null,null,null,null,null,null,null,null,null,null,null,null,0,0]
[130,null,null,null,null,null,null,null,null,null,null,null,null,null,null,null,null,null,null,null,null,null,null,null,null,0,0]
[131,null,null,null,null,null,null,null,null,null,null,null,null,null,null,null,null,null,null,null,null,null,null,null,null,0,0]
[132,null,null,null,null,null,null,null,null,null,null,null,null,null,null,null,null,null,null,null,null,null,null,null,null,0,0]
[133,null,null,null,null,null,null,null,null,null,null,null,null,null,null,null,null,null,null,null,null,null,null,null,null,0,0]
[134,null,null,null,null,null,null,null,null,null,null,null,null,null,null,null,null,null,null,null,null,null,null,null,null,0,0]
[135,null,null,null,null,null,null,null,null,null,null,null,null,null,null,null,null,null,null,null,null,null,null,null,null,0,0]
[136,null,null,null,null,null,null,null,null,null,null,null,null,null,null,null,null,null,null,null,null,null,null,null,null,0,0]
[137,null,null,null,null,null,null,null,null,null,null,null,null,null,null,null,null,null,null,null,null,null,null,null,null,0,0]
[138,null,null,null,null,null,null,null,null,null,null,null,null,null,null,null,null,null,null,null,null,null,null,null,null,0,0]
[139,null,null,null,null,null,null,null,null,null,null,null,null,null,null,null,null,null,null,null,null,null,null,null,null,0,0]
[140,null,null,null,null,null,null,null,null,null,null,null,null,null,null,null,null,null,null,null,null,null,null,null,null,0,0]
[141,null,null,null,null,null,null,null,null,null,null,null,null,null,null,null,null,null,null,null,null,null,null,null,null,0,0]
[142,null,null,null,null,null,null,null,null,null,null,null,null,null,null,null,null,null,null,null,null,null,null,null,null,0,0]
[143,null,null,null,null,null,null,null,null,null,null,null,null,null,null,null,null,null,null,null,null,null,null,null,null,0,0]
[144,null,null,null,null,null,null,null,null,null,null,null,null,null,null,null,null,null,null,null,null,null,null,null,null,0,0]
[145,null,null,null,null,null,null,null,null,null,null,null,null,null,null,null,null,null,null,null,null,null,null,null,null,0,0]
[146,null,null,null,null,null,null,null,null,null,null,null,null,null,null,null,null,null,null,null,null,null,null,null,null,0,0]
[147,null,null,null,null,null,null,null,null,null,null,null,null,null,null,null,null,null,null,null,null,null,null,null,null,0,0]
[148,null,null,null,null,null,null,null,null,null,null,null,null,null,null,null,null,null,null,null,null,null,null,null,null,0,0]
[149,null,null,null,null,null,null,null,null,null,null,null,null,null,null,null,null,null,null,null,null,null,null,null,null,0,0]
[150,null,null,null,null,null,null,null,null,null,null,null,null,null,null,null,null,null,null,null,null,null,null,null,null,0,0]
[151,null,null,null,null,null,null,null,null,null,null,null,null,null,null,null,null,null,null,null,null,null,null,null,null,0,0]
[152,null,null,null,null,null,null,null,null,null,null,null,null,null,null,null,null,null,null,null,null,null,null,null,null,0,0]
[153,null,null,null,null,null,null,null,null,null,null,null,null,null,null,null,null,null,null,null,null,null,null,null,null,0,0]
[154,null,null,null,null,null,null,null,null,null,null,null,null,null,null,null,null,null,null,null,null,null,null,null,null,0,0]
[155,null,null,null,null,null,null,null,null,null,null,null,null,null,null,null,null,null,null,null,null,null,null,null,null,0,0]
[156,null,null,null,null,null,null,null,null,null,null,null,null,null,null,null,null,null,null,null,null,null,null,null,null,0,0]
[157,null,null,null,null,null,null,null,null,null,null,null,null,null,null,null,null,null,null,null,null,null,null,null,null,0,0]
[158,null,null,null,null,null,null,null,null,null,null,null,null,null,null,null,null,null,null,null,null,null,null,null,null,0,0]
[159,null,null,null,null,null,null,null,null,null,null,null,null,null,null,null,null,null,null,null,null,null,null,null,null,0,0]
[160,null,null,null,null,null,null,null,null,null,null,null,null,null,null,null,null,null,null,null,null,null,null,null,null,0,0]
[161,null,null,null,null,null,null,null,null,null,null,null,null,null,null,null,null,null,null,null,null,null,null,null,null,0,0]
[162,null,null,null,null,null,null,null,null,null,null,null,null,null,null,null,null,null,null,null,null,null,null,null,null,0,0]
[163,null,null,null,null,null,null,null,null,null,null,null,null,null,null,null,null,null,null,null,null,null,null,null,null,0,0]
[164,null,null,null,null,null,null,null,null,null,null,null,null,null,null,null,null,null,null,null,null,null,null,null,null,0,0]
[165,null,null,null,null,null,null,null,null,null,null,null,null,null,null,null,null,null,null,null,null,null,null,null,null,0,0]
[166,null,null,null,null,null,null,null,null,null,null,null,null,null,null,null,null,null,null,null,null,null,null,null,null,0,0]
[167,null,null,null,null,null,null,null,null,null,null,null,null,null,null,null,null,null,null,null,null,null,null,null,null,0,0]
[168,null,null,null,null,null,null,null,null,null,null,null,null,null,null,null,null,null,null,null,null,null,null,null,null,0,0]
[169,null,null,null,null,null,null,null,null,null,null,null,null,null,null,null,null,null,null,null,null,null,null,null,null,0,0]
[170,null,null,null,null,null,null,null,null,null,null,null,null,null,null,null,null,null,null,null,null,null,null,null,null,0,0]
[171,null,null,null,null,null,null,null,null,null,null,null,null,null,null,null,null,null,null,null,null,null,null,null,null,0,0]
[172,null,null,null,null,null,null,null,null,null,null,null,null,null,null,null,null,null,null,null,null,null,null,null,null,0,0]
[173,null,null,null,null,null,null,null,null,null,null,null,null,null,null,null,null,null,null,null,null,null,null,null,null,0,0]
[174,null,null,null,null,null,null,null,null,null,null,null,null,null,null,null,null,null,null,null,null,null,null,null,null,0,0]
[175,null,null,null,null,null,null,null,null,null,null,null,null,null,null,null,null,null,null,null,null,null,null,null,null,0,0]
[176,null,null,null,null,null,null,null,null,null,null,null,null,null,null,null,null,null,null,null,null,null,null,null,null,0,0]
[177,null,null,null,null,null,null,null,null,null,null,null,null,null,null,null,null,null,null,null,null,null,null,null,null,0,0]
[178,null,null,null,null,null,null,null,null,null,null,null,null,null,null,null,null,null,null,null,null,null,null,null,null,0,0]
[179,null,null,null,null,null,null,null,null,null,null,null,null,null,null,null,null,null,null,null,null,null,null,null,null,0,0]
[180,null,null,null,null,null,null,null,null,null,null,null,null,null,null,null,null,null,null,null,null,null,null,null,null,0,0]
[181,null,null,null,null,null,null,null,null,null,null,null,null,null,null,null,null,null,null,null,null,null,null,null,null,0,0]
[182,null,null,null,null,null,null,null,null,null,null,null,null,null,null,null,null,null,null,null,null,null,null,null,null,0,0]
[183,null,null,null,null,null,null,null,null,null,null,null,null,null,null,null,null,null,null,null,null,null,null,null,null,0,0]
[184,null,null,null,null,null,null,null,null,null,null,null,null,null,null,null,null,null,null,null,null,null,null,null,null,0,0]
[185,null,null,null,null,null,null,null,null,null,null,null,null,null,null,null,null,null,null,null,null,null,null,null,null,0,0]
[186,null,null,null,null,null,null,null,null,null,null,null,null,null,null,null,null,null,null,null,null,null,null,null,null,0,0]
[187,null,null,null,null,null,null,null,null,null,null,null,null,null,null,null,null,null,null,null,null,null,null,null,null,0,0]
[188,null,null,null,null,null,null,null,null,null,null,null,null,null,null,null,null,null,null,null,null,null,null,null,null,0,0]
[189,null,null,null,null,null,null,null,null,null,null,null,null,null,null,null,null,null,null,null,null,null,null,null,null,0,0]
[190,null,null,null,null,null,null,null,null,null,null,null,null,null,null,null,null,null,null,null,null,null,null,null,null,0,0]
[191,null,null,null,null,null,null,null,null,null,null,null,null,null,null,null,null,null,null,null,null,null,null,null,null,0,0]
[192,null,null,null,null,null,null,null,null,null,null,null,null,null,null,null,null,null,null,null,null,null,null,null,null,0,0]
[193,null,null,null,null,null,null,null,null,null,null,null,null,null,null,null,null,null,null,null,null,null,null,null,null,0,0]
[194,null,null,null,null,null,null,null,null,null,null,null,null,null,null,null,null,null,null,null,null,null,null,null,null,0,0]
[195,null,null,null,null,null,null,null,null,null,null,null,null,null,null,null,null,null,null,null,null,null,null,null,null,0,0]
[196,null,null,null,null,null,null,null,null,null,null,null,null,null,null,null,null,null,null,null,null,null,null,null,null,0,0]
[197,null,null,null,null,null,null,null,null,null,null,null,null,null,null,null,null,null,null,null,null,null,null,null,null,0,0]
[198,null,null,null,null,null,null,null,null,null,null,null,null,null,null,null,null,null,null,null,null,null,null,null,null,0,0]
[199,null,null,null,null,null,null,null,null,null,null,null,null,null,null,null,null,null,null,null,null,null,null,null,null,0,0]
[200,null,null,null,null,null,null,null,null,null,null,null,null,null,null,null,null,null,null,null,null,null,null,null,null,0,0]
[201,null,null,null,null,null,null,null,null,null,null,null,null,null,null,null,null,null,null,null,null,null,null,null,null,0,0]
[202,null,null,null,null,null,null,null,null,null,null,null,null,null,null,null,null,null,null,null,null,null,null,null,null,0,0]
[203,null,null,null,null,null,null,null,null,null,null,null,null,null,null,null,null,null,null,null,null,null,null,null,null,0,0]
[204,null,null,null,null,null,null,null,null,null,null,null,null,null,null,null,null,null,null,null,null,null,null,null,null,0,0]
[205,null,null,null,null,null,null,null,null,null,null,null,null,null,null,null,null,null,null,null,null,null,null,null,null,0,0]
[206,null,null,null,null,null,null,null,null,null,null,null,null,null,null,null,null,null,null,null,null,null,null,null,null,0,0]
[207,null,null,null,null,null,null,null,null,null,null,null,null,null,null,null,null,null,null,null,null,null,null,null,null,0,0]
[208,null,null,null,null,null,null,null,null,null,null,null,null,null,null,null,null,null,null,null,null,null,null,null,null,0,0]
[209,null,null,null,null,null,null,null,null,null,null,null,null,null,null,null,null,null,null,null,null,null,null,null,null,0,0]
[210,null,null,null,null,null,null,null,null,null,null,null,null,null,null,null,null,null,null,null,null,null,null,null,null,0,0]
[211,null,null,null,null,null,null,null,null,null,null,null,null,null,null,null,null,null,null,null,null,null,null,null,null,0,0]
[212,null,null,null,null,null,null,null,null,null,null,null,null,null,null,null,null,null,null,null,null,null,null,null,null,0,0]
[213,null,null,null,null,null,null,null,null,null,null,null,null,null,null,null,null,null,null,null,null,null,null,null,null,0,0]
[214,null,null,null,null,null,null,null,null,null,null,null,null,null,null,null,null,null,null,null,null,null,null,null,null,0,0]
[215,null,null,null,null,null,null,null,null,null,null,null,null,null,null,null,null,null,null,null,null,null,null,null,null,0,0]
[216,null,null,null,null,null,null,null,null,null,null,null,null,null,null,null,null,null,null,null,null,null,null,null,null,0,0]
[217,null,null,null,null,null,null,null,null,null,null,null,null,null,null,null,null,null,null,null,null,null,null,null,null,0,0]
[218,null,null,null,null,null,null,null,null,null,null,null,null,null,null,null,null,null,null,null,null,null,null,null,null,0,0]
[219,null,null,null,null,null,null,null,null,null,null,null,null,null,null,null,null,null,null,null,null,null,null,null,null,0,0]
[220,null,null,null,null,null,null,null,null,null,null,null,null,null,null,null,null,null,null,null,null,null,null,null,null,0,0]
[221,null,null,null,null,null,null,null,null,null,null,null,null,null,null,null,null,null,null,null,null,null,null,null,null,0,0]
[222,null,null,null,null,null,null,null,null,null,null,null,null,null,null,null,null,null,null,null,null,null,null,null,null,0,0]
[223,null,null,null,null,null,null,null,null,null,null,null,null,null,null,null,null,null,null,null,null,null,null,null,null,0,0]
[224,null,null,null,null,null,null,null,null,null,null,null,null,null,null,null,null,null,null,null,null,null,null,null,null,0,0]
[225,null,null,null,null,null,null,null,null,null,null,null,null,null,null,null,null,null,null,null,null,null,null,null,null,0,0]
[226,null,null,null,null,null,null,null,null,null,null,null,null,null,null,null,null,null,null,null,null,null,null,null,null,0,0]
[227,null,null,null,null,null,null,null,null,null,null,null,null,null,null,null,null,null,null,null,null,null,null,null,null,0,0]
[228,null,null,null,null,null,null,null,null,null,null,null,null,null,null,null,null,null,null,null,null,null,null,null,null,0,0]
[229,null,null,null,null,null,null,null,null,null,null,null,null,null,null,null,null,null,null,null,null,null,null,null,null,0,0]
[230,null,null,null,null,null,null,null,null,null,null,null,null,null,null,null,null,null,null,null,null,null,null,null,null,0,0]
[231,null,null,null,null,null,null,null,null,null,null,null,null,null,null,null,null,null,null,null,null,null,null,null,null,0,0]
[232,null,null,null,null,null,null,null,null,null,null,null,null,null,null,null,null,null,null,null,null,null,null,null,null,0,0]
[233,null,null,null,null,null,null,null,null,null,null,null,null,null,null,null,null,null,null,null,null,null,null,null,null,0,0]
[234,null,null,null,null,null,null,null,null,null,null,null,null,null,null,null,null,null,null,null,null,null,null,null,null,0,0]
[235,null,null,null,null,null,null,null,null,null,null,null,null,null,null,null,null,null,null,null,null,null,null,null,null,0,0]
[236,null,null,null,null,null,null,null,null,null,null,null,null,null,null,null,null,null,null,null,null,null,null,null,null,0,0]
[237,null,null,null,null,null,null,null,null,null,null,null,null,null,null,null,null,null,null,null,null,null,null,null,null,0,0]
[238,null,null,null,null,null,null,null,null,null,null,null,null,null,null,null,null,null,null,null,null,null,null,null,null,0,0]
[239,null,null,null,null,null,null,null,null,null,null,null,null,null,null,null,null,null,null,null,null,null,null,null,null,0,0]
[240,null,null,null,null,null,null,null,null,null,null,null,null,null,null,null,null,null,null,null,null,null,null,null,null,0,0]
[241,null,null,null,null,null,null,null,null,null,null,null,null,null,null,null,null,null,null,null,null,null,null,null,null,0,0]
[242,null,null,null,null,null,null,null,null,null,null,null,null,null,null,null,null,null,null,null,null,null,null,null,null,0,0]
[243,null,null,null,null,null,null,null,null,null,null,null,null,null,null,null,null,null,null,null,null,null,null,null,null,0,0]
[244,null,null,null,null,null,null,null,null,null,null,null,null,null,null,null,null,null,null,null,null,null,null,null,null,0,0]
[245,null,null,null,null,null,null,null,null,null,null,null,null,null,null,null,null,null,null,null,null,null,null,null,null,0,0]
[246,null,null,null,null,null,null,null,null,null,null,null,null,null,null,null,null,null,null,null,null,null,null,null,null,0,0]
[247,null,null,null,null,null,null,null,null,null,null,null,null,null,null,null,null,null,null,null,null,null,null,null,null,0,0]
[248,null,null,null,null,null,null,null,null,null,null,null,null,null,null,null,null,null,null,null,null,null,null,null,null,0,0]
[249,null,null,null,null,null,null,null,null,null,null,null,null,null,null,null,null,null,null,null,null,null,null,null,null,0,0]
[250,null,null,null,null,null,null,null,null,null,null,null,null,null,null,null,null,null,null,null,null,null,null,null,null,0,0]
[251,null,null,null,null,null,null,null,null,null,null,null,null,null,null,null,null,null,null,null,null,null,null,null,null,0,0]
[252,null,null,null,null,null,null,null,null,null,null,null,null,null,null,null,null,null,null,null,null,null,null,null,null,0,0]
[253,null,null,null,null,null,null,null,null,null,null,null,null,null,null,null,null,null,null,null,null,null,null,null,null,0,0]
[254,null,null,null,null,null,null,null,null,null,null,null,null,null,null,null,null,null,null,null,null,null,null,null,null,0,0]
[255,null,null,null,null,null,null,null,null,null,null,null,null,null,null,null,null,null,null,null,null,null,null,null,null,0,0]
[256,null,null,null,null,null,null,null,null,null,null,null,null,null,null,null,null,null,null,null,null,null,null,null,null,0,0]
[257,null,null,null,null,null,null,null,null,null,null,null,null,null,null,null,null,null,null,null,null,null,null,null,null,0,0]
[258,null,null,null,null,null,null,null,null,null,null,null,null,null,null,null,null,null,null,null,null,null,null,null,null,0,0]
[259,null,null,null,null,null,null,null,null,null,null,null,null,null,null,null,null,null,null,null,null,null,null,null,null,0,0]
[260,null,null,null,null,null,null,null,null,null,null,null,null,null,null,null,null,null,null,null,null,null,null,null,null,0,0]
[261,null,null,null,null,null,null,null,null,null,null,null,null,null,null,null,null,null,null,null,null,null,null,null,null,0,0]
[262,null,null,null,null,null,null,null,null,null,null,null,null,null,null,null,null,null,null,null,null,null,null,null,null,0,0]
[263,null,null,null,null,null,null,null,null,null,null,null,null,null,null,null,null,null,null,null,null,null,null,null,null,0,0]
[264,null,null,null,null,null,null,null,null,null,null,null,null,null,null,null,null,null,null,null,null,null,null,null,null,0,0]
[265,null,null,null,null,null,null,null,null,null,null,null,null,null,null,null,null,null,null,null,null,null,null,null,null,0,0]
[266,null,null,null,null,null,null,null,null,null,null,null,null,null,null,null,null,null,null,null,null,null,null,null,null,0,0]
[267,null,null,null,null,null,null,null,null,null,null,null,null,null,null,null,null,null,null,null,null,null,null,null,null,0,0]
[268,null,null,null,null,null,null,null,null,null,null,null,null,null,null,null,null,null,null,null,null,null,null,null,null,0,0]
[269,null,null,null,null,null,null,null,null,null,null,null,null,null,null,null,null,null,null,null,null,null,null,null,null,0,0]
[270,null,null,null,null,null,null,null,null,null,null,null,null,null,null,null,null,null,null,null,null,null,null,null,null,0,0]
[271,null,null,null,null,null,null,null,null,null,null,null,null,null,null,null,null,null,null,null,null,null,null,null,null,0,0]
[272,null,null,null,null,null,null,null,null,null,null,null,null,null,null,null,null,null,null,null,null,null,null,null,null,0,0]
[273,null,null,null,null,null,null,null,null,null,null,null,null,null,null,null,null,null,null,null,null,null,null,null,null,0,0]
[274,null,null,null,null,null,null,null,null,null,null,null,null,null,null,null,null,null,null,null,null,null,null,null,null,0,0]
[275,null,null,null,null,null,null,null,null,null,null,null,null,null,null,null,null,null,null,null,null,null,null,null,null,0,0]
[276,null,null,null,null,null,null,null,null,null,null,null,null,null,null,null,null,null,null,null,null,null,null,null,null,0,0]
[277,null,null,null,null,null,null,null,null,null,null,null,null,null,null,null,null,null,null,null,null,null,null,null,null,0,0]
[278,null,null,null,null,null,null,null,null,null,null,null,null,null,null,null,null,null,null,null,null,null,null,null,null,0,0]
[279,null,null,null,null,null,null,null,null,null,null,null,null,null,null,null,null,null,null,null,null,null,null,null,null,0,0]
[280,null,null,null,null,null,null,null,null,null,null,null,null,null,null,null,null,null,null,null,null,null,null,null,null,0,0]
[281,null,null,null,null,null,null,null,null,null,null,null,null,null,null,null,null,null,null,null,null,null,null,null,null,0,0]
[282,null,null,null,null,null,null,null,null,null,null,null,null,null,null,null,null,null,null,null,null,null,null,null,null,0,0]
[283,null,null,null,null,null,null,null,null,null,null,null,null,null,null,null,null,null,null,null,null,null,null,null,null,0,0]
[284,null,null,null,null,null,null,null,null,null,null,null,null,null,null,null,null,null,null,null,null,null,null,null,null,0,0]
[285,null,null,null,null,null,null,null,null,null,null,null,null,null,null,null,null,null,null,null,null,null,null,null,null,0,0]
[286,null,null,null,null,null,null,null,null,null,null,null,null,null,null,null,null,null,null,null,null,null,null,null,null,0,0]
[287,null,null,null,null,null,null,null,null,null,null,null,null,null,null,null,null,null,null,null,null,null,null,null,null,0,0]
[288,null,null,null,null,null,null,null,null,null,null,null,null,null,null,null,null,null,null,null,null,null,null,null,null,0,0]
[289,null,null,null,null,null,null,null,null,null,null,null,null,null,null,null,null,null,null,null,null,null,null,null,null,0,0]
[290,null,null,null,null,null,null,null,null,null,null,null,null,null,null,null,null,null,null,null,null,null,null,null,null,0,0]
[291,null,null,null,null,null,null,null,null,null,null,null,null,null,null,null,null,null,null,null,null,null,null,null,null,0,0]
[292,null,null,null,null,null,null,null,null,null,null,null,null,null,null,null,null,null,null,null,null,null,null,null,null,0,0]
[293,null,null,null,null,null,null,null,null,null,null,null,null,null,null,null,null,null,null,null,null,null,null,null,null,0,0]
[294,null,null,null,null,null,null,null,null,null,null,null,null,null,null,null,null,null,null,null,null,null,null,null,null,0,0]
[295,null,null,null,null,null,null,null,null,null,null,null,null,null,null,null,null,null,null,null,null,null,null,null,null,0,0]
[296,null,null,null,null,null,null,null,null,null,null,null,null,null,null,null,null,null,null,null,null,null,null,null,null,0,0]
[297,null,null,null,null,null,null,null,null,null,null,null,null,null,null,null,null,null,null,null,null,null,null,null,null,0,0]
[298,null,null,null,null,null,null,null,null,null,null,null,null,null,null,null,null,null,null,null,null,null,null,null,null,0,0]
[299,null,null,null,null,null,null,null,null,null,null,null,null,null,null,null,null,null,null,null,null,null,null,null,null,0,0]
[300,null,null,null,null,null,null,null,null,null,null,null,null,null,null,null,null,null,null,null,null,null,null,null,null,0,0]
[301,null,null,null,null,null,null,null,null,null,null,null,null,null,null,null,null,null,null,null,null,null,null,null,null,0,0]
[302,null,null,null,null,null,null,null,null,null,null,null,null,null,null,null,null,null,null,null,null,null,null,null,null,0,0]
[303,null,null,null,null,null,null,null,null,null,null,null,null,null,null,null,null,null,null,null,null,null,null,null,null,0,0]
[304,null,null,null,null,null,null,null,null,null,null,null,null,null,null,null,null,null,null,null,null,null,null,null,null,0,0]
[305,null,null,null,null,null,null,null,null,null,null,null,null,null,null,null,null,null,null,null,null,null,null,null,null,0,0]
[306,null,null,null,null,null,null,null,null,null,null,null,null,null,null,null,null,null,null,null,null,null,null,null,null,0,0]
[307,null,null,null,null,null,null,null,null,null,null,null,null,null,null,null,null,null,null,null,null,null,null,null,null,0,0]
[308,null,null,null,null,null,null,null,null,null,null,null,null,null,null,null,null,null,null,null,null,null,null,null,null,0,0]
[309,null,null,null,null,null,null,null,null,null,null,null,null,null,null,null,null,null,null,null,null,null,null,null,null,0,0]
[310,null,null,null,null,null,null,null,null,null,null,null,null,null,null,null,null,null,null,null,null,null,null,null,null,0,0]

{"sheet":"KIZ GRUP","index":1,"n_rows":39,"n_cols":33,"rows_kept":39,"cut":false,"hidden":false,"merged":[[38,1,38,3],[38,4,38,5],[38,6,38,7],[38,8,38,9],[38,10,38,11],[38,28,38,29],[38,30,38,31],[37,1,37,3],[37,4,37,5],[37,6,37,7],[37,8,37,9],[37,10,37,11],[37,28,37,29],[37,30,37,31],[36,30,36,31],[36,1,36,3],[36,4,36,5],[36,6,36,7],[36,8,36,9],[36,10,36,11],[32,1,32,3],[32,4,32,5],[32,6,32,7],[32,8,32,9],[32,10,32,11],[32,28,32,29],[32,30,32,31],[33,30,33,31],[36,28,36,29],[33,1,33,3],[33,4,33,5],[33,6,33,7],[33,8,33,9],[33,10,33,11],[33,28,33,29],[35,1,35,3],[35,4,35,5],[35,6,35,7],[31,1,31,3],[31,4,31,5],[31,6,31,7],[31,8,31,9],[31,10,31,11],[31,28,31,29],[31,30,31,31],[30,1,30,3],[30,4,30,5],[30,6,30,7],[30,8,30,9],[30,10,30,11],[30,22,30,23],[30,24,30,25],[23,30,23,31],[27,8,27,9],[27,10,27,11],[27,28,27,29],[27,30,27,31],[28,1,28,3],[28,4,28,5],[28,6,28,7],[28,8,28,9],[28,10,28,11],[28,28,28,29],[28,30,28,31],[26,30,26,31],[26,1,26,3],[27,1,27,3],[27,4,27,5],[27,6,27,7],[26,8,26,9],[26,10,26,11],[26,28,26,29],[26,4,26,5],[26,6,26,7],[25,1,25,3],[25,4,25,5],[18,28,18,29],[21,1,21,3],[21,4,21,5],[21,6,21,7],[21,8,21,9],[21,10,21,11],[21,28,21,29],[23,8,23,9],[23,10,23,11],[23,28,23,29],[22,28,22,29],[13,8,13,9],[13,10,13,11],[13,26,13,27],[13,28,13,29],[9,1,9,3],[9,4,9,5],[9,6,9,7],[9,8,9,9],[9,10,9,11],[9,26,9,27],[9,28,9,29],[8,24,8,25],[8,26,8,27],[8,28,8,29],[13,1,13,3],[12,8,12,9],[23,4,23,5],[23,6,23,7],[21,30,21,31],[22,30,22,31],[18,26,18,27],[20,1,20,3],[20,4,20,5],[20,6,20,7],[20,8,20,9],[20,10,20,11],[20,22,20,23],[20,24,20,25],[20,26,20,27],[20,28,20,29],[20,30,20,31],[14,26,14,27],[14,28,14,29],[17,8,17,9],[22,4,22,5],[22,6,22,7],[22,8,22,9],[22,10,22,11],[6,26,6,27],[6,28,6,29],[23,1,23,3],[22,1,22,3],[13,4,13,5],[13,6,13,7],[10,26,10,27],[10,28,10,29],[12,1,12,3],[12,4,12,5],[12,6,12,7],[12,10,12,11],[12,22,12,23],[12,24,12,25],[12,26,12,27],[12,28,12,29],[8,4,8,5],[8,6,8,7],[8,10,8,11],[8,1,8,3],[8,8,8,9],[8,22,8,23],[17,10,17,11],[17,28,17,29],[17,1,17,3],[17,4,17,5],[17,6,17,7],[16,1,16,3],[16,4,16,5],[16,6,16,7],[16,8,16,9],[16,10,16,11],[16,22,16,23],[16,24,16,25],[16,26,16,27],[16,28,16,29],[17,26,17,27],[5,1,5,3],[5,4,5,5],[5,6,5,7],[4,26,4,27],[4,28,4,29],[5,8,5,9],[5,10,5,11],[5,26,5,27],[5,28,5,29],[0,1,1,32],[2,1,2,32],[4,1,4,3],[4,4,4,5],[4,6,4,7],[4,8,4,9],[4,10,4,11],[4,22,4,23],[4,24,4,25],[25,6,25,7],[25,8,25,9],[25,10,25,11],[25,22,25,23],[25,24,25,25],[25,26,25,27],[25,28,25,29],[25,30,25,31],[30,26,30,27],[30,28,30,29],[30,30,30,31],[35,8,35,9],[35,10,35,11],[35,22,35,23],[35,24,35,25],[35,26,35,27],[35,28,35,29],[35,30,35,31]]}
[1,"TÜRKİYE MASA TENİSİ FEDERASYONU\nYILDIZLAR KUZEYDOĞU BÖLGE YARIŞMALARI"]
[]
[null,"KIZ TAKIM  [01-02 Mart 2025 SİVAS] [ Grup ]"]
[]
[2,"Tarih",null,null,"Saat",null,"Tur",null,"Maç",null,"Masa",null,null,3,"Grup",null,1,null,null,null,null,null,1,null,2,null,"Puan",null,"Sıralama"]
[null,"2025-03-01",null,null,"09:30:00",null,1,null,"1 - 2",null,null,null,1,"G1.1",1,"ŞAFAKTEPE SPOR KULÜBÜ (ANK)",null,null,null,null,null,null,null,null,3,0,2,null,1,null,3]
[null,".",null,null,null,null,null,null,null,null,null,null,16,"G1.2",2,"FINDIKLI 1974 SPOR (A) (RİZ)",null,null,null,null,null,null,0,3,null,null,1,null,2,null,3]
[]
[2,"Tarih",null,null,"Saat",null,"Tur",null,"Maç",null,"Masa",null,null,3,"Grup",null,2,null,null,null,null,null,1,null,2,null,"Puan",null,"Sıralama"]
[null,"2025-03-01",null,null,"09:30:00",null,1,null,"1 - 2",null,null,null,2,"G2.1",1,"YALIKÖY ŞEHİT BARIŞ ÇAKIR (A) (GRS)",null,null,null,null,null,null,null,null,3,0,2,null,1,null,3]
[null,".",null,null,null,null,null,null,null,null,null,null,15,"G2.2",2,"AĞRI GSK (A) (AĞR)",null,null,null,null,null,null,0,3,null,null,1,null,2,null,3]
[]
[2,"Tarih",null,null,"Saat",null,"Tur",null,"Maç",null,"Masa",null,null,3,"Grup",null,3,null,null,null,null,null,1,null,2,null,"Puan",null,"Sıralama"]
[null,"2025-03-01",null,null,"09:30:00",null,1,null,"1 - 2",null,null,null,3,"G3.1",1,"ÇORUM ARENA SPOR (A) (ÇRM)",null,null,null,null,null,null,null,null,3,0,2,null,1,null,3]
[null,".",null,null,null,null,null,null,null,null,null,null,14,"G3.2",2,"ŞEKER 06 SPOR  KULÜBÜ (A) (ANK)",null,null,null,null,null,null,0,3,null,null,1,null,2,null,3]
[]
[2,"Tarih",null,null,"Saat",null,"Tur",null,"Maç",null,"Masa",null,null,3,"Grup",null,4,null,null,null,null,null,1,null,2,null,"Puan",null,"Sıralama"]
[null,"2025-03-01",null,null,"09:30:00",null,1,null,"1 - 2",null,null,null,4,"G4.1",1,"KUTLUBEY OKULLARI (A) (AMS)",null,null,null,null,null,null,null,null,3,1,2,null,1,null,4]
[null,".",null,null,null,null,null,null,null,null,null,null,13,"G4.2",2,"MASA-DER (A) (ANK)",null,null,null,null,null,null,1,3,null,null,1,null,2,null,4]
[]
[3,"Tarih",null,null,"Saat",null,"Tur",null,"Maç",null,"Masa",null,null,3,"Grup",null,5,null,null,null,null,null,1,null,2,null,3,null,"Puan",null,"Sıralama"]
[null,"2025-03-01",null,null,"09:30:00",null,1,null,"1 - 3",null,null,null,5,"G5.1",1,"KUTLUBEY OKULLARI (B) (AMS)",null,null,null,null,null,null,null,null,3,1,3,0,4,null,1,null,7]
[null,"2025-03-01",null,null,"10:30:00",null,2,null,"1 - 2",null,null,null,12,"G5.3",2,"BAYBURT GMSK (A) (BYB)",null,null,null,null,null,null,1,3,null,null,1,3,2,null,3,null,8]
[null,"2025-03-01",null,null,"11:30:00",null,3,null,"2 - 3",null,null,null,17,"G5.2",3,"GENÇLİK SPOR (A) (SVS)",null,null,null,null,null,null,0,3,3,1,null,null,3,null,2,null,7]
[]
[3,"Tarih",null,null,"Saat",null,"Tur",null,"Maç",null,"Masa",null,null,3,"Grup",null,6,null,null,null,null,null,1,null,2,null,3,null,"Puan",null,"Sıralama"]
[null,"2025-03-01",null,null,"09:30:00",null,1,null,"1 - 3",null,null,null,6,"G6.2",1,"KUTLUBEY OKULLARI (C) (AMS)",null,null,null,null,null,null,null,null,1,3,3,0,3,null,2,null,7]
[null,"2025-03-01",null,null,"10:30:00",null,2,null,"1 - 2",null,null,null,11,"G6.1",2,"GİRESUN GSK (A) (GRS)",null,null,null,null,null,null,3,1,null,null,3,0,4,null,1,null,7]
[null,"2025-03-01",null,null,"11:30:00",null,3,null,"2 - 3",null,null,null,18,"G6.3",3,"SİVAS DANİŞMENT 1967 SPOR (A) (SVS)",null,null,null,null,null,null,0,3,0,3,null,null,2,null,3,null,6]
[]
[3,"Tarih",null,null,"Saat",null,"Tur",null,"Maç",null,"Masa",null,null,3,"Grup",null,7,null,null,null,null,null,1,null,2,null,3,null,"Puan",null,"Sıralama"]
[null,"2025-03-01",null,null,"09:30:00",null,1,null,"1 - 3",null,null,null,7,"G7.1",1,"ÇORUM SPOR İHTİSAS (A) (ÇRM)",null,null,null,null,null,null,null,null,3,2,3,0,4,null,1,null,8]
[null,"2025-03-01",null,null,"10:30:00",null,2,null,"1 - 2",null,null,null,10,"G7.2",2,"ANKARA B. ŞEH. BLD. SPOR (ANK)",null,null,null,null,null,null,2,3,null,null,3,0,3,null,2,null,8]
[null,"2025-03-01",null,null,"11:30:00",null,3,null,"2 - 3",null,null,null,19,"G7.3",3,"SİVAS OKÇULUK SPOR (B) (SVS)",null,null,null,null,null,null,0,3,0,3,null,null,2,null,3,null,6]
[]
[3,"Tarih",null,null,"Saat",null,"Tur",null,"Maç",null,"Masa",null,null,3,"Grup",null,8,null,null,null,null,null,1,null,2,null,3,null,"Puan",null,"Sıralama"]
[null,"2025-03-01",null,null,"09:30:00",null,1,null,"1 - 3",null,null,null,8,"G8.3",1,"GENÇLİK SPOR (B) (SVS)",null,null,null,null,null,null,null,null,0,3,0,3,2,null,3,null,6]
[null,"2025-03-01",null,null,"10:30:00",null,2,null,"1 - 2",null,null,null,9,"G8.1",2,"SİVAS OKÇULUK SPOR (A) (SVS)",null,null,null,null,null,null,3,0,null,null,3,0,4,null,1,null,6]
[null,"2025-03-01",null,null,"11:30:00",null,3,null,"2 - 3",null,null,null,20,"G8.2",3,"KIRIKKALE YURDUM SPOR (A) (KRK)",null,null,null,null,null,null,3,0,0,3,null,null,3,null,2,null,6]

{"sheet":"On_Eleme","index":2,"n_rows":195,"n_cols":52,"rows_kept":195,"cut":false,"hidden":true,"merged":[[0,4,1,7],[2,4,2,7],[3,47,3,48],[3,49,3,50],[3,51,3,52],[3,41,3,42],[3,43,3,44],[3,45,3,46]]}
[null,null,null,null,{"$f":"KATILIM!AC1","v":"TÜRKİYE MASA TENİSİ FEDERASYONU\nYILDIZLAR KUZEYDOĞU BÖLGE YARIŞMALARI"},null,null,null,null,null,null,null,null,null,null,null,null,null,null,null,null,null,null,null,null,null,null,null,null,null,null,null,null,null,null,null,null,null,null,{"$f":"COUNTIF(AN5:AN68,\"<>0\")","v":8}]
[]
[null,null,null,null,{"$f":"KATILIM!A2&\" \"&KATILIM!AC3","v":"KIZ TAKIM  [01-02 Mart 2025 SİVAS] [ Ön Eleme ]"}]
[null,null,null,null,"Sporcu","Skor","Galip",null,"Külüp Adı",null,null,"Eleme tablosu ilk turda denk gelip gelmediğinin kontrolü yapılır",null,null,null,null,null,null,null,null,null,null,null,null,null,null,null,null,null,null,null,null,null,null,"#","Date","Time","Table","Competition","Player-A","Player-B","Set1",null,"Set2",null,"Set3",null,"Set4",null,"Set5",null,"Result"]
[1,"E1",9,null,{"$f":"IFERROR(VLOOKUP(C5,KATILIM!$A$4:$Z$301,26,0),0)","v":"SİVAS OKÇULUK SPOR (A) (SVS)"},{"$f":"AZ5","v":0},{"$f":"IF(AND(F5=0,F6=0),\"\",IF(F5>F6,E5,E6))","v":""},null,{"$f":"IFERROR(VLOOKUP(C5,KATILIM!$A$4:$G$301,6,0),0)","v":"SİVAS"},null,null,"E1",1,{"$f":"OFFSET(#REF!,M5,#REF!)","v":{"$error":"#REF!"}},{"$f":"IFERROR(VLOOKUP(N5,KATILIM!$A$4:$Z$301,26,0),0)","v":0},{"$f":"IFERROR(VLOOKUP(N5,KATILIM!$A$4:$G$301,6,0),0)","v":0},null,null,null,null,null,null,null,null,null,null,null,null,null,null,null,null,null,null,1,null,null,null,null,{"$f":"E5","v":"SİVAS OKÇULUK SPOR (A) (SVS)"},{"$f":"E6","v":"GENÇLİK SPOR (A) (SVS)"}]
["1.1",null,17,null,{"$f":"IFERROR(VLOOKUP(C6,KATILIM!$A$4:$Z$301,26,0),0)","v":"GENÇLİK SPOR (A) (SVS)"},{"$f":"BA5","v":0},null,null,{"$f":"IFERROR(VLOOKUP(C6,KATILIM!$A$4:$G$301,6,0),0)","v":"SİVAS"},null,null,null,null,null,null,null,null,null,null,null,null,null,null,null,null,null,null,null,null,null,null,null,null,null,2,null,null,null,null,{"$f":"E8","v":"ANKARA B. ŞEH. BLD. SPOR (ANK)"},{"$f":"E9","v":"SİVAS DANİŞMENT 1967 SPOR (A) (SVS)"}]
[null,null,null,null,null,null,null,null,null,null,null,null,null,null,null,null,null,null,null,null,null,null,null,null,null,null,null,null,null,null,null,null,null,null,3,null,null,null,null,{"$f":"E11","v":"GİRESUN GSK (A) (GRS)"},{"$f":"E12","v":"SİVAS OKÇULUK SPOR (B) (SVS)"}]
[2,"E2",10,null,{"$f":"IFERROR(VLOOKUP(C8,KATILIM!$A$4:$Z$301,26,0),0)","v":"ANKARA B. ŞEH. BLD. SPOR (ANK)"},{"$f":"AZ6","v":0},{"$f":"IF(AND(F8=0,F9=0),\"\",IF(F8>F9,E8,E9))","v":""},null,{"$f":"IFERROR(VLOOKUP(C8,KATILIM!$A$4:$G$301,6,0),0)","v":"ANKARA"},null,null,"E2",2,{"$f":"OFFSET(#REF!,M8,#REF!)","v":{"$error":"#REF!"}},{"$f":"IFERROR(VLOOKUP(N8,KATILIM!$A$4:$Z$301,26,0),0)","v":0},{"$f":"IFERROR(VLOOKUP(N8,KATILIM!$A$4:$G$301,6,0),0)","v":0},null,null,null,null,null,null,null,null,null,null,null,null,null,null,null,null,null,null,4,null,null,null,null,{"$f":"E14","v":"BAYBURT GMSK (A) (BYB)"},{"$f":"E15","v":"KIRIKKALE YURDUM SPOR (A) (KRK)"}]
["2.2",null,18,null,{"$f":"IFERROR(VLOOKUP(C9,KATILIM!$A$4:$Z$301,26,0),0)","v":"SİVAS DANİŞMENT 1967 SPOR (A) (SVS)"},{"$f":"BA6","v":0},null,null,{"$f":"IFERROR(VLOOKUP(C9,KATILIM!$A$4:$G$301,6,0),0)","v":"SİVAS"},null,null,null,null,null,null,null,null,null,null,null,null,null,null,null,null,null,null,null,null,null,null,null,null,null,5,null,null,null,null,{"$f":"E17","v":"MASA-DER (A) (ANK)"},{"$f":"E18","v":0}]
[null,null,null,null,null,null,null,null,null,null,null,null,null,null,null,null,null,null,null,null,null,null,null,null,null,null,null,null,null,null,null,null,null,null,6,null,null,null,null,{"$f":"E20","v":"ŞEKER 06 SPOR  KULÜBÜ (A) (ANK)"},{"$f":"E21","v":0}]
[3,"E3",11,null,{"$f":"IFERROR(VLOOKUP(C11,KATILIM!$A$4:$Z$301,26,0),0)","v":"GİRESUN GSK (A) (GRS)"},{"$f":"AZ7","v":0},{"$f":"IF(AND(F11=0,F12=0),\"\",IF(F11>F12,E11,E12))","v":""},null,{"$f":"IFERROR(VLOOKUP(C11,KATILIM!$A$4:$G$301,6,0),0)","v":"GİRESUN"},null,null,"E3",3,{"$f":"OFFSET(#REF!,M11,#REF!)","v":{"$error":"#REF!"}},{"$f":"IFERROR(VLOOKUP(N11,KATILIM!$A$4:$Z$301,26,0),0)","v":0},{"$f":"IFERROR(VLOOKUP(N11,KATILIM!$A$4:$G$301,6,0),0)","v":0},null,null,null,null,null,null,null,null,null,null,null,null,null,null,null,null,null,null,7,null,null,null,null,{"$f":"E23","v":"AĞRI GSK (A) (AĞR)"},{"$f":"E24","v":0}]
["3.3",null,19,null,{"$f":"IFERROR(VLOOKUP(C12,KATILIM!$A$4:$Z$301,26,0),0)","v":"SİVAS OKÇULUK SPOR (B) (SVS)"},{"$f":"BA7","v":0},null,null,{"$f":"IFERROR(VLOOKUP(C12,KATILIM!$A$4:$G$301,6,0),0)","v":"SİVAS"},null,null,null,null,null,null,null,null,null,null,null,null,null,null,null,null,null,null,null,null,null,null,null,null,null,8,null,null,null,null,{"$f":"E26","v":"FINDIKLI 1974 SPOR (A) (RİZ)"},{"$f":"E27","v":0}]
[null,null,null,null,null,null,null,null,null,null,null,null,null,null,null,null,null,null,null,null,null,null,null,null,null,null,null,null,null,null,null,null,null,null,9,null,null,null,null,{"$f":"E29","v":0},{"$f":"E30","v":0}]
[4,"E4",12,null,{"$f":"IFERROR(VLOOKUP(C14,KATILIM!$A$4:$Z$301,26,0),0)","v":"BAYBURT GMSK (A) (BYB)"},{"$f":"AZ8","v":0},{"$f":"IF(AND(F14=0,F15=0),\"\",IF(F14>F15,E14,E15))","v":""},null,{"$f":"IFERROR(VLOOKUP(C14,KATILIM!$A$4:$G$301,6,0),0)","v":"BAYBURT"},null,null,"E4",4,{"$f":"OFFSET(#REF!,M14,#REF!)","v":{"$error":"#REF!"}},{"$f":"IFERROR(VLOOKUP(N14,KATILIM!$A$4:$Z$301,26,0),0)","v":0},{"$f":"IFERROR(VLOOKUP(N14,KATILIM!$A$4:$G$301,6,0),0)","v":0},null,null,null,null,null,null,null,null,null,null,null,null,null,null,null,null,null,null,10,null,null,null,null,{"$f":"E32","v":0},{"$f":"E33","v":0}]
["4.4",null,20,null,{"$f":"IFERROR(VLOOKUP(C15,KATILIM!$A$4:$Z$301,26,0),0)","v":"KIRIKKALE YURDUM SPOR (A) (KRK)"},{"$f":"BA8","v":0},null,null,{"$f":"IFERROR(VLOOKUP(C15,KATILIM!$A$4:$G$301,6,0),0)","v":"KIRIKKALE"},null,null,null,null,null,null,null,null,null,null,null,null,null,null,null,null,null,null,null,null,null,null,null,null,null,11,null,null,null,null,{"$f":"E35","v":0},{"$f":"E36","v":0}]
[null,null,null,null,null,null,null,null,null,null,null,null,null,null,null,null,null,null,null,null,null,null,null,null,null,null,null,null,null,null,null,null,null,null,12,null,null,null,null,{"$f":"E38","v":0},{"$f":"E39","v":0}]
[5,"E5",13,null,{"$f":"IFERROR(VLOOKUP(C17,KATILIM!$A$4:$Z$301,26,0),0)","v":"MASA-DER (A) (ANK)"},{"$f":"AZ9","v":0},{"$f":"IF(AND(F17=0,F18=0),\"\",IF(F17>F18,E17,E18))","v":""},null,{"$f":"IFERROR(VLOOKUP(C17,KATILIM!$A$4:$G$301,6,0),0)","v":"ANKARA"},null,null,"E5",5,{"$f":"OFFSET(#REF!,M17,#REF!)","v":{"$error":"#REF!"}},{"$f":"IFERROR(VLOOKUP(N17,KATILIM!$A$4:$Z$301,26,0),0)","v":0},{"$f":"IFERROR(VLOOKUP(N17,KATILIM!$A$4:$G$301,6,0),0)","v":0},null,null,null,null,null,null,null,null,null,null,null,null,null,null,null,null,null,null,13,null,null,null,null,{"$f":"E41","v":0},{"$f":"E42","v":0}]
["5.5",null,21,null,{"$f":"IFERROR(VLOOKUP(C18,KATILIM!$A$4:$Z$301,26,0),0)","v":0},{"$f":"BA9","v":0},null,null,{"$f":"IFERROR(VLOOKUP(C18,KATILIM!$A$4:$G$301,6,0),0)","v":0},null,null,null,null,null,null,null,null,null,null,null,null,null,null,null,null,null,null,null,null,null,null,null,null,null,14,null,null,null,null,{"$f":"E44","v":0},{"$f":"E45","v":0}]
[null,null,null,null,null,null,null,null,null,null,null,null,null,null,null,null,null,null,null,null,null,null,null,null,null,null,null,null,null,null,null,null,null,null,15,null,null,null,null,{"$f":"E47","v":0},{"$f":"E48","v":0}]
[6,"E6",14,null,{"$f":"IFERROR(VLOOKUP(C20,KATILIM!$A$4:$Z$301,26,0),0)","v":"ŞEKER 06 SPOR  KULÜBÜ (A) (ANK)"},{"$f":"AZ10","v":0},{"$f":"IF(AND(F20=0,F21=0),\"\",IF(F20>F21,E20,E21))","v":""},null,{"$f":"IFERROR(VLOOKUP(C20,KATILIM!$A$4:$G$301,6,0),0)","v":"ANKARA"},null,null,"E6",6,{"$f":"OFFSET(#REF!,M20,#REF!)","v":{"$error":"#REF!"}},{"$f":"IFERROR(VLOOKUP(N20,KATILIM!$A$4:$Z$301,26,0),0)","v":0},{"$f":"IFERROR(VLOOKUP(N20,KATILIM!$A$4:$G$301,6,0),0)","v":0},null,null,null,null,null,null,null,null,null,null,null,null,null,null,null,null,null,null,16,null,null,null,null,{"$f":"E50","v":0},{"$f":"E51","v":0}]
["6.6",null,22,null,{"$f":"IFERROR(VLOOKUP(C21,KATILIM!$A$4:$Z$301,26,0),0)","v":0},{"$f":"BA10","v":0},null,null,{"$f":"IFERROR(VLOOKUP(C21,KATILIM!$A$4:$G$301,6,0),0)","v":0},null,null,null,null,null,null,null,null,null,null,null,null,null,null,null,null,null,null,null,null,null,null,null,null,null,17,null,null,null,null,{"$f":"E53","v":0},{"$f":"E54","v":0}]
[null,null,null,null,null,null,null,null,null,null,null,null,null,null,null,null,null,null,null,null,null,null,null,null,null,null,null,null,null,null,null,null,null,null,18,null,null,null,null,{"$f":"E56","v":0},{"$f":"E57","v":0}]
[7,"E7",15,null,{"$f":"IFERROR(VLOOKUP(C23,KATILIM!$A$4:$Z$301,26,0),0)","v":"AĞRI GSK (A) (AĞR)"},{"$f":"AZ11","v":0},{"$f":"IF(AND(F23=0,F24=0),\"\",IF(F23>F24,E23,E24))","v":""},null,{"$f":"IFERROR(VLOOKUP(C23,KATILIM!$A$4:$G$301,6,0),0)","v":"AĞRI"},null,null,"E7",7,{"$f":"OFFSET(#REF!,M23,#REF!)","v":{"$error":"#REF!"}},{"$f":"IFERROR(VLOOKUP(N23,KATILIM!$A$4:$Z$301,26,0),0)","v":0},{"$f":"IFERROR(VLOOKUP(N23,KATILIM!$A$4:$G$301,6,0),0)","v":0},null,null,null,null,null,null,null,null,null,null,null,null,null,null,null,null,null,null,19,null,null,null,null,{"$f":"E59","v":0},{"$f":"E60","v":0}]
["7.7",null,23,null,{"$f":"IFERROR(VLOOKUP(C24,KATILIM!$A$4:$Z$301,26,0),0)","v":0},{"$f":"BA11","v":0},null,null,{"$f":"IFERROR(VLOOKUP(C24,KATILIM!$A$4:$G$301,6,0),0)","v":0},null,null,null,null,null,null,null,null,null,null,null,null,null,null,null,null,null,null,null,null,null,null,null,null,null,20,null,null,null,null,{"$f":"E62","v":0},{"$f":"E63","v":0}]
[null,null,null,null,null,null,null,null,null,null,null,null,null,null,null,null,null,null,null,null,null,null,null,null,null,null,null,null,null,null,null,null,null,null,21,null,null,null,null,{"$f":"E65","v":0},{"$f":"E66","v":0}]
[8,"E8",16,null,{"$f":"IFERROR(VLOOKUP(C26,KATILIM!$A$4:$Z$301,26,0),0)","v":"FINDIKLI 1974 SPOR (A) (RİZ)"},{"$f":"AZ12","v":0},{"$f":"IF(AND(F26=0,F27=0),\"\",IF(F26>F27,E26,E27))","v":""},null,{"$f":"IFERROR(VLOOKUP(C26,KATILIM!$A$4:$G$301,6,0),0)","v":"RİZE"},null,null,"E8",8,{"$f":"OFFSET(#REF!,M26,#REF!)","v":{"$error":"#REF!"}},{"$f":"IFERROR(VLOOKUP(N26,KATILIM!$A$4:$Z$301,26,0),0)","v":0},{"$f":"IFERROR(VLOOKUP(N26,KATILIM!$A$4:$G$301,6,0),0)","v":0},null,null,null,null,null,null,null,null,null,null,null,null,null,null,null,null,null,null,22,null,null,null,null,{"$f":"E68","v":0},{"$f":"E69","v":0}]
["8.8",null,24,null,{"$f":"IFERROR(VLOOKUP(C27,KATILIM!$A$4:$Z$301,26,0),0)","v":0},{"$f":"BA12","v":0},null,null,{"$f":"IFERROR(VLOOKUP(C27,KATILIM!$A$4:$G$301,6,0),0)","v":0},null,null,null,null,null,null,null,null,null,null,null,null,null,null,null,null,null,null,null,null,null,null,null,null,null,23,null,null,null,null,{"$f":"E71","v":0},{"$f":"E72","v":0}]
[null,null,null,null,null,null,null,null,null,null,null,null,null,null,null,null,null,null,null,null,null,null,null,null,null,null,null,null,null,null,null,null,null,null,24,null,null,null,null,{"$f":"E74","v":0},{"$f":"E75","v":0}]
[9,"E9",null,null,{"$f":"IFERROR(VLOOKUP(C29,KATILIM!$A$4:$Z$301,26,0),0)","v":0},{"$f":"AZ13","v":0},{"$f":"IF(AND(F29=0,F30=0),\"\",IF(F29>F30,E29,E30))","v":""},null,{"$f":"IFERROR(VLOOKUP(C29,KATILIM!$A$4:$G$301,6,0),0)","v":0},null,null,"E9",9,{"$f":"OFFSET(#REF!,M29,#REF!)","v":{"$error":"#REF!"}},{"$f":"IFERROR(VLOOKUP(N29,KATILIM!$A$4:$Z$301,26,0),0)","v":0},{"$f":"IFERROR(VLOOKUP(N29,KATILIM!$A$4:$G$301,6,0),0)","v":0},null,null,null,null,null,null,null,null,null,null,null,null,null,null,null,null,null,null,25,null,null,null,null,{"$f":"E77","v":0},{"$f":"E78","v":0}]
["9.9",null,null,null,{"$f":"IFERROR(VLOOKUP(C30,KATILIM!$A$4:$Z$301,26,0),0)","v":0},{"$f":"BA13","v":0},null,null,{"$f":"IFERROR(VLOOKUP(C30,KATILIM!$A$4:$G$301,6,0),0)","v":0},null,null,null,null,null,null,null,null,null,null,null,null,null,null,null,null,null,null,null,null,null,null,null,null,null,26,null,null,null,null,{"$f":"E80","v":0},{"$f":"E81","v":0}]
[null,null,null,null,null,null,null,null,null,null,null,null,null,null,null,null,null,null,null,null,null,null,null,null,null,null,null,null,null,null,null,null,null,null,27,null,null,null,null,{"$f":"E83","v":0},{"$f":"E84","v":0}]
[10,"E10",null,null,{"$f":"IFERROR(VLOOKUP(C32,KATILIM!$A$4:$Z$301,26,0),0)","v":0},{"$f":"AZ14","v":0},{"$f":"IF(AND(F32=0,F33=0),\"\",IF(F32>F33,E32,E33))","v":""},null,{"$f":"IFERROR(VLOOKUP(C32,KATILIM!$A$4:$G$301,6,0),0)","v":0},null,null,"E10",10,{"$f":"OFFSET(#REF!,M32,#REF!)","v":{"$error":"#REF!"}},{"$f":"IFERROR(VLOOKUP(N32,KATILIM!$A$4:$Z$301,26,0),0)","v":0},{"$f":"IFERROR(VLOOKUP(N32,KATILIM!$A$4:$G$301,6,0),0)","v":0},null,null,null,null,null,null,null,null,null,null,null,null,null,null,null,null,null,null,28,null,null,null,null,{"$f":"E86","v":0},{"$f":"E87","v":0}]
["10.10",null,null,null,{"$f":"IFERROR(VLOOKUP(C33,KATILIM!$A$4:$Z$301,26,0),0)","v":0},{"$f":"BA14","v":0},null,null,{"$f":"IFERROR(VLOOKUP(C33,KATILIM!$A$4:$G$301,6,0),0)","v":0},null,null,null,null,null,null,null,null,null,null,null,null,null,null,null,null,null,null,null,null,null,null,null,null,null,29,null,null,null,null,{"$f":"E89","v":0},{"$f":"E90","v":0}]
[null,null,null,null,null,null,null,null,null,null,null,null,null,null,null,null,null,null,null,null,null,null,null,null,null,null,null,null,null,null,null,null,null,null,30,null,null,null,null,{"$f":"E92","v":0},{"$f":"E93","v":0}]
[11,"E11",null,null,{"$f":"IFERROR(VLOOKUP(C35,KATILIM!$A$4:$Z$301,26,0),0)","v":0},{"$f":"AZ15","v":0},{"$f":"IF(AND(F35=0,F36=0),\"\",IF(F35>F36,E35,E36))","v":""},null,{"$f":"IFERROR(VLOOKUP(C35,KATILIM!$A$4:$G$301,6,0),0)","v":0},null,null,"E11",11,{"$f":"OFFSET(#REF!,M35,#REF!)","v":{"$error":"#REF!"}},{"$f":"IFERROR(VLOOKUP(N35,KATILIM!$A$4:$Z$301,26,0),0)","v":0},{"$f":"IFERROR(VLOOKUP(N35,KATILIM!$A$4:$G$301,6,0),0)","v":0},null,null,null,null,null,null,null,null,null,null,null,null,null,null,null,null,null,null,31,null,null,null,null,{"$f":"E95","v":0},{"$f":"E96","v":0}]
["11.11",null,null,null,{"$f":"IFERROR(VLOOKUP(C36,KATILIM!$A$4:$Z$301,26,0),0)","v":0},{"$f":"BA15","v":0},null,null,{"$f":"IFERROR(VLOOKUP(C36,KATILIM!$A$4:$G$301,6,0),0)","v":0},null,null,null,null,null,null,null,null,null,null,null,null,null,null,null,null,null,null,null,null,null,null,null,null,null,32,null,null,null,null,{"$f":"E98","v":0},{"$f":"E99","v":0}]
[null,null,null,null,null,null,null,null,null,null,null,null,null,null,null,null,null,null,null,null,null,null,null,null,null,null,null,null,null,null,null,null,null,null,33,null,null,null,null,{"$f":"E101","v":0},{"$f":"E102","v":0}]
[12,"E12",null,null,{"$f":"IFERROR(VLOOKUP(C38,KATILIM!$A$4:$Z$301,26,0),0)","v":0},{"$f":"AZ16","v":0},{"$f":"IF(AND(F38=0,F39=0),\"\",IF(F38>F39,E38,E39))","v":""},null,{"$f":"IFERROR(VLOOKUP(C38,KATILIM!$A$4:$G$301,6,0),0)","v":0},null,null,"E12",12,{"$f":"OFFSET(#REF!,M38,#REF!)","v":{"$error":"#REF!"}},{"$f":"IFERROR(VLOOKUP(N38,KATILIM!$A$4:$Z$301,26,0),0)","v":0},{"$f":"IFERROR(VLOOKUP(N38,KATILIM!$A$4:$G$301,6,0),0)","v":0},null,null,null,null,null,null,null,null,null,null,null,null,null,null,null,null,null,null,34,null,null,null,null,{"$f":"E104","v":0},{"$f":"E105","v":0}]
["12.12",null,null,null,{"$f":"IFERROR(VLOOKUP(C39,KATILIM!$A$4:$Z$301,26,0),0)","v":0},{"$f":"BA16","v":0},null,null,{"$f":"IFERROR(VLOOKUP(C39,KATILIM!$A$4:$G$301,6,0),0)","v":0},null,null,null,null,null,null,null,null,null,null,null,null,null,null,null,null,null,null,null,null,null,null,null,null,null,35,null,null,null,null,{"$f":"E107","v":0},{"$f":"E108","v":0}]
[null,null,null,null,null,null,null,null,null,null,null,null,null,null,null,null,null,null,null,null,null,null,null,null,null,null,null,null,null,null,null,null,null,null,36,null,null,null,null,{"$f":"E110","v":0},{"$f":"E111","v":0}]
[13,"E13",null,null,{"$f":"IFERROR(VLOOKUP(C41,KATILIM!$A$4:$Z$301,26,0),0)","v":0},{"$f":"AZ17","v":0},{"$f":"IF(AND(F41=0,F42=0),\"\",IF(F41>F42,E41,E42))","v":""},null,{"$f":"IFERROR(VLOOKUP(C41,KATILIM!$A$4:$G$301,6,0),0)","v":0},null,null,"E13",13,{"$f":"OFFSET(#REF!,M41,#REF!)","v":{"$error":"#REF!"}},{"$f":"IFERROR(VLOOKUP(N41,KATILIM!$A$4:$Z$301,26,0),0)","v":0},{"$f":"IFERROR(VLOOKUP(N41,KATILIM!$A$4:$G$301,6,0),0)","v":0},null,null,null,null,null,null,null,null,null,null,null,null,null,null,null,null,null,null,37,null,null,null,null,{"$f":"E113","v":0},{"$f":"E114","v":0}]
["13.13",null,null,null,{"$f":"IFERROR(VLOOKUP(C42,KATILIM!$A$4:$Z$301,26,0),0)","v":0},{"$f":"BA17","v":0},null,null,{"$f":"IFERROR(VLOOKUP(C42,KATILIM!$A$4:$G$301,6,0),0)","v":0},null,null,null,null,null,null,null,null,null,null,null,null,null,null,null,null,null,null,null,null,null,null,null,null,null,38,null,null,null,null,{"$f":"E116","v":0},{"$f":"E117","v":0}]
[null,null,null,null,null,null,null,null,null,null,null,null,null,null,null,null,null,null,null,null,null,null,null,null,null,null,null,null,null,null,null,null,null,null,39,null,null,null,null,{"$f":"E119","v":0},{"$f":"E120","v":0}]
[14,"E14",null,null,{"$f":"IFERROR(VLOOKUP(C44,KATILIM!$A$4:$Z$301,26,0),0)","v":0},{"$f":"AZ18","v":0},{"$f":"IF(AND(F44=0,F45=0),\"\",IF(F44>F45,E44,E45))","v":""},null,{"$f":"IFERROR(VLOOKUP(C44,KATILIM!$A$4:$G$301,6,0),0)","v":0},null,null,"E14",14,{"$f":"OFFSET(#REF!,M44,#REF!)","v":{"$error":"#REF!"}},{"$f":"IFERROR(VLOOKUP(N44,KATILIM!$A$4:$Z$301,26,0),0)","v":0},{"$f":"IFERROR(VLOOKUP(N44,KATILIM!$A$4:$G$301,6,0),0)","v":0},null,null,null,null,null,null,null,null,null,null,null,null,null,null,null,null,null,null,40,null,null,null,null,{"$f":"E122","v":0},{"$f":"E123","v":0}]
["14.14",null,null,null,{"$f":"IFERROR(VLOOKUP(C45,KATILIM!$A$4:$Z$301,26,0),0)","v":0},{"$f":"BA18","v":0},null,null,{"$f":"IFERROR(VLOOKUP(C45,KATILIM!$A$4:$G$301,6,0),0)","v":0},null,null,null,null,null,null,null,null,null,null,null,null,null,null,null,null,null,null,null,null,null,null,null,null,null,41,null,null,null,null,{"$f":"E125","v":0},{"$f":"E126","v":0}]
[null,null,null,null,null,null,null,null,null,null,null,null,null,null,null,null,null,null,null,null,null,null,null,null,null,null,null,null,null,null,null,null,null,null,42,null,null,null,null,{"$f":"E128","v":0},{"$f":"E129","v":0}]
[15,"E15",null,null,{"$f":"IFERROR(VLOOKUP(C47,KATILIM!$A$4:$Z$301,26,0),0)","v":0},{"$f":"AZ19","v":0},{"$f":"IF(AND(F47=0,F48=0),\"\",IF(F47>F48,E47,E48))","v":""},null,{"$f":"IFERROR(VLOOKUP(C47,KATILIM!$A$4:$G$301,6,0),0)","v":0},null,null,"E15",15,{"$f":"OFFSET(#REF!,M47,#REF!)","v":{"$error":"#REF!"}},{"$f":"IFERROR(VLOOKUP(N47,KATILIM!$A$4:$Z$301,26,0),0)","v":0},{"$f":"IFERROR(VLOOKUP(N47,KATILIM!$A$4:$G$301,6,0),0)","v":0},null,null,null,null,null,null,null,null,null,null,null,null,null,null,null,null,null,null,43,null,null,null,null,{"$f":"E131","v":0},{"$f":"E132","v":0}]
["15.15",null,null,null,{"$f":"IFERROR(VLOOKUP(C48,KATILIM!$A$4:$Z$301,26,0),0)","v":0},{"$f":"BA19","v":0},null,null,{"$f":"IFERROR(VLOOKUP(C48,KATILIM!$A$4:$G$301,6,0),0)","v":0},null,null,null,null,null,null,null,null,null,null,null,null,null,null,null,null,null,null,null,null,null,null,null,null,null,44,null,null,null,null,{"$f":"E134","v":0},{"$f":"E135","v":0}]
[null,null,null,null,null,null,null,null,null,null,null,null,null,null,null,null,null,null,null,null,null,null,null,null,null,null,null,null,null,null,null,null,null,null,45,null,null,null,null,{"$f":"E137","v":0},{"$f":"E138","v":0}]
[16,"E16",null,null,{"$f":"IFERROR(VLOOKUP(C50,KATILIM!$A$4:$Z$301,26,0),0)","v":0},{"$f":"AZ20","v":0},{"$f":"IF(AND(F50=0,F51=0),\"\",IF(F50>F51,E50,E51))","v":""},null,{"$f":"IFERROR(VLOOKUP(C50,KATILIM!$A$4:$G$301,6,0),0)","v":0},null,null,"E16",16,{"$f":"OFFSET(#REF!,M50,#REF!)","v":{"$error":"#REF!"}},{"$f":"IFERROR(VLOOKUP(N50,KATILIM!$A$4:$Z$301,26,0),0)","v":0},{"$f":"IFERROR(VLOOKUP(N50,KATILIM!$A$4:$G$301,6,0),0)","v":0},null,null,null,null,null,null,null,null,null,null,null,null,null,null,null,null,null,null,46,null,null,null,null,{"$f":"E140","v":0},{"$f":"E141","v":0}]
["16.16",null,null,null,{"$f":"IFERROR(VLOOKUP(C51,KATILIM!$A$4:$Z$301,26,0),0)","v":0},{"$f":"BA20","v":0},null,null,{"$f":"IFERROR(VLOOKUP(C51,KATILIM!$A$4:$G$301,6,0),0)","v":0},null,null,null,null,null,null,null,null,null,null,null,null,null,null,null,null,null,null,null,null,null,null,null,null,null,47,null,null,null,null,{"$f":"E143","v":0},{"$f":"E144","v":0}]
[null,null,null,null,null,null,null,null,null,null,null,null,null,null,null,null,null,null,null,null,null,null,null,null,null,null,null,null,null,null,null,null,null,null,48,null,null,null,null,{"$f":"E146","v":0},{"$f":"E147","v":0}]
[17,"E17",null,null,{"$f":"IFERROR(VLOOKUP(C53,KATILIM!$A$4:$Z$301,26,0),0)","v":0},{"$f":"AZ21","v":0},{"$f":"IF(AND(F53=0,F54=0),\"\",IF(F53>F54,E53,E54))","v":""},null,{"$f":"IFERROR(VLOOKUP(C53,KATILIM!$A$4:$G$301,6,0),0)","v":0},null,null,"E17",17,{"$f":"OFFSET(#REF!,M53,#REF!)","v":{"$error":"#REF!"}},{"$f":"IFERROR(VLOOKUP(N53,KATILIM!$A$4:$Z$301,26,0),0)","v":0},{"$f":"IFERROR(VLOOKUP(N53,KATILIM!$A$4:$G$301,6,0),0)","v":0},null,null,null,null,null,null,null,null,null,null,null,null,null,null,null,null,null,null,49,null,null,null,null,{"$f":"E149","v":0},{"$f":"E150","v":0}]
["17.17",null,null,null,{"$f":"IFERROR(VLOOKUP(C54,KATILIM!$A$4:$Z$301,26,0),0)","v":0},{"$f":"BA21","v":0},null,null,{"$f":"IFERROR(VLOOKUP(C54,KATILIM!$A$4:$G$301,6,0),0)","v":0},null,null,null,null,null,null,null,null,null,null,null,null,null,null,null,null,null,null,null,null,null,null,null,null,null,50,null,null,null,null,{"$f":"E152","v":0},{"$f":"E153","v":0}]
[null,null,null,null,null,null,null,null,null,null,null,null,null,null,null,null,null,null,null,null,null,null,null,null,null,null,null,null,null,null,null,null,null,null,51,null,null,null,null,{"$f":"E155","v":0},{"$f":"E156","v":0}]
[18,"E18",null,null,{"$f":"IFERROR(VLOOKUP(C56,KATILIM!$A$4:$Z$301,26,0),0)","v":0},{"$f":"AZ22","v":0},{"$f":"IF(AND(F56=0,F57=0),\"\",IF(F56>F57,E56,E57))","v":""},null,{"$f":"IFERROR(VLOOKUP(C56,KATILIM!$A$4:$G$301,6,0),0)","v":0},null,null,"E18",18,{"$f":"OFFSET(#REF!,M56,#REF!)","v":{"$error":"#REF!"}},{"$f":"IFERROR(VLOOKUP(N56,KATILIM!$A$4:$Z$301,26,0),0)","v":0},{"$f":"IFERROR(VLOOKUP(N56,KATILIM!$A$4:$G$301,6,0),0)","v":0},null,null,null,null,null,null,null,null,null,null,null,null,null,null,null,null,null,null,52,null,null,null,null,{"$f":"E158","v":0},{"$f":"E159","v":0}]
["18.18",null,null,null,{"$f":"IFERROR(VLOOKUP(C57,KATILIM!$A$4:$Z$301,26,0),0)","v":0},{"$f":"BA22","v":0},null,null,{"$f":"IFERROR(VLOOKUP(C57,KATILIM!$A$4:$G$301,6,0),0)","v":0},null,null,null,null,null,null,null,null,null,null,null,null,null,null,null,null,null,null,null,null,null,null,null,null,null,53,null,null,null,null,{"$f":"E161","v":0},{"$f":"E162","v":0}]
[null,null,null,null,null,null,null,null,null,null,null,null,null,null,null,null,null,null,null,null,null,null,null,null,null,null,null,null,null,null,null,null,null,null,54,null,null,null,null,{"$f":"E164","v":0},{"$f":"E165","v":0}]
[19,"E19",null,null,{"$f":"IFERROR(VLOOKUP(C59,KATILIM!$A$4:$Z$301,26,0),0)","v":0},{"$f":"AZ23","v":0},{"$f":"IF(AND(F59=0,F60=0),\"\",IF(F59>F60,E59,E60))","v":""},null,{"$f":"IFERROR(VLOOKUP(C59,KATILIM!$A$4:$G$301,6,0),0)","v":0},null,null,"E19",19,{"$f":"OFFSET(#REF!,M59,#REF!)","v":{"$error":"#REF!"}},{"$f":"IFERROR(VLOOKUP(N59,KATILIM!$A$4:$Z$301,26,0),0)","v":0},{"$f":"IFERROR(VLOOKUP(N59,KATILIM!$A$4:$G$301,6,0),0)","v":0},null,null,null,null,null,null,null,null,null,null,null,null,null,null,null,null,null,null,55,null,null,null,null,{"$f":"E167","v":0},{"$f":"E168","v":0}]
["19.19",null,null,null,{"$f":"IFERROR(VLOOKUP(C60,KATILIM!$A$4:$Z$301,26,0),0)","v":0},{"$f":"BA23","v":0},null,null,{"$f":"IFERROR(VLOOKUP(C60,KATILIM!$A$4:$G$301,6,0),0)","v":0},null,null,null,null,null,null,null,null,null,null,null,null,null,null,null,null,null,null,null,null,null,null,null,null,null,56,null,null,null,null,{"$f":"E170","v":0},{"$f":"E171","v":0}]
[null,null,null,null,null,null,null,null,null,null,null,null,null,null,null,null,null,null,null,null,null,null,null,null,null,null,null,null,null,null,null,null,null,null,57,null,null,null,null,{"$f":"E173","v":0},{"$f":"E174","v":0}]
[20,"E20",null,null,{"$f":"IFERROR(VLOOKUP(C62,KATILIM!$A$4:$Z$301,26,0),0)","v":0},{"$f":"AZ24","v":0},{"$f":"IF(AND(F62=0,F63=0),\"\",IF(F62>F63,E62,E63))","v":""},null,{"$f":"IFERROR(VLOOKUP(C62,KATILIM!$A$4:$G$301,6,0),0)","v":0},null,null,"E20",20,{"$f":"OFFSET(#REF!,M62,#REF!)","v":{"$error":"#REF!"}},{"$f":"IFERROR(VLOOKUP(N62,KATILIM!$A$4:$Z$301,26,0),0)","v":0},{"$f":"IFERROR(VLOOKUP(N62,KATILIM!$A$4:$G$301,6,0),0)","v":0},null,null,null,null,null,null,null,null,null,null,null,null,null,null,null,null,null,null,58,null,null,null,null,{"$f":"E176","v":0},{"$f":"E177","v":0}]
["20.20",null,null,null,{"$f":"IFERROR(VLOOKUP(C63,KATILIM!$A$4:$Z$301,26,0),0)","v":0},{"$f":"BA24","v":0},null,null,{"$f":"IFERROR(VLOOKUP(C63,KATILIM!$A$4:$G$301,6,0),0)","v":0},null,null,null,null,null,null,null,null,null,null,null,null,null,null,null,null,null,null,null,null,null,null,null,null,null,59,null,null,null,null,{"$f":"E179","v":0},{"$f":"E180","v":0}]
[null,null,null,null,null,null,null,null,null,null,null,null,null,null,null,null,null,null,null,null,null,null,null,null,null,null,null,null,null,null,null,null,null,null,60,null,null,null,null,{"$f":"E182","v":0},{"$f":"E183","v":0}]
[21,"E21",null,null,{"$f":"IFERROR(VLOOKUP(C65,KATILIM!$A$4:$Z$301,26,0),0)","v":0},{"$f":"AZ25","v":0},{"$f":"IF(AND(F65=0,F66=0),\"\",IF(F65>F66,E65,E66))","v":""},null,{"$f":"IFERROR(VLOOKUP(C65,KATILIM!$A$4:$G$301,6,0),0)","v":0},null,null,"E21",21,{"$f":"OFFSET(#REF!,M65,#REF!)","v":{"$error":"#REF!"}},{"$f":"IFERROR(VLOOKUP(N65,KATILIM!$A$4:$Z$301,26,0),0)","v":0},{"$f":"IFERROR(VLOOKUP(N65,KATILIM!$A$4:$G$301,6,0),0)","v":0},null,null,null,null,null,null,null,null,null,null,null,null,null,null,null,null,null,null,61,null,null,null,null,{"$f":"E185","v":0},{"$f":"E186","v":0}]
["21.21",null,null,null,{"$f":"IFERROR(VLOOKUP(C66,KATILIM!$A$4:$Z$301,26,0),0)","v":0},{"$f":"BA25","v":0},null,null,{"$f":"IFERROR(VLOOKUP(C66,KATILIM!$A$4:$G$301,6,0),0)","v":0},null,null,null,null,null,null,null,null,null,null,null,null,null,null,null,null,null,null,null,null,null,null,null,null,null,62,null,null,null,null,{"$f":"E188","v":0},{"$f":"E189","v":0}]
[null,null,null,null,null,null,null,null,null,null,null,null,null,null,null,null,null,null,null,null,null,null,null,null,null,null,null,null,null,null,null,null,null,null,63,null,null,null,null,{"$f":"E191","v":0},{"$f":"E192","v":0}]
[22,"E22",null,null,{"$f":"IFERROR(VLOOKUP(C68,KATILIM!$A$4:$Z$301,26,0),0)","v":0},{"$f":"AZ26","v":0},{"$f":"IF(AND(F68=0,F69=0),\"\",IF(F68>F69,E68,E69))","v":""},null,{"$f":"IFERROR(VLOOKUP(C68,KATILIM!$A$4:$G$301,6,0),0)","v":0},null,null,"E22",22,{"$f":"OFFSET(#REF!,M68,#REF!)","v":{"$error":"#REF!"}},{"$f":"IFERROR(VLOOKUP(N68,KATILIM!$A$4:$Z$301,26,0),0)","v":0},{"$f":"IFERROR(VLOOKUP(N68,KATILIM!$A$4:$G$301,6,0),0)","v":0},null,null,null,null,null,null,null,null,null,null,null,null,null,null,null,null,null,null,64,null,null,null,null,{"$f":"E194","v":0},{"$f":"E195","v":0}]
["22.22",null,null,null,{"$f":"IFERROR(VLOOKUP(C69,KATILIM!$A$4:$Z$301,26,0),0)","v":0},{"$f":"BA26","v":0},null,null,{"$f":"IFERROR(VLOOKUP(C69,KATILIM!$A$4:$G$301,6,0),0)","v":0}]
[]
[23,"E23",null,null,{"$f":"IFERROR(VLOOKUP(C71,KATILIM!$A$4:$Z$301,26,0),0)","v":0},{"$f":"AZ27","v":0},{"$f":"IF(AND(F71=0,F72=0),\"\",IF(F71>F72,E71,E72))","v":""},null,{"$f":"IFERROR(VLOOKUP(C71,KATILIM!$A$4:$G$301,6,0),0)","v":0},null,null,"E23",23,{"$f":"OFFSET(#REF!,M71,#REF!)","v":{"$error":"#REF!"}},{"$f":"IFERROR(VLOOKUP(N71,KATILIM!$A$4:$Z$301,26,0),0)","v":0},{"$f":"IFERROR(VLOOKUP(N71,KATILIM!$A$4:$G$301,6,0),0)","v":0}]
["23.23",null,null,null,{"$f":"IFERROR(VLOOKUP(C72,KATILIM!$A$4:$Z$301,26,0),0)","v":0},{"$f":"BA27","v":0},null,null,{"$f":"IFERROR(VLOOKUP(C72,KATILIM!$A$4:$G$301,6,0),0)","v":0}]
[]
[24,"E24",null,null,{"$f":"IFERROR(VLOOKUP(C74,KATILIM!$A$4:$Z$301,26,0),0)","v":0},{"$f":"AZ28","v":0},{"$f":"IF(AND(F74=0,F75=0),\"\",IF(F74>F75,E74,E75))","v":""},null,{"$f":"IFERROR(VLOOKUP(C74,KATILIM!$A$4:$G$301,6,0),0)","v":0},null,null,"E24",24,{"$f":"OFFSET(#REF!,M74,#REF!)","v":{"$error":"#REF!"}},{"$f":"IFERROR(VLOOKUP(N74,KATILIM!$A$4:$Z$301,26,0),0)","v":0},{"$f":"IFERROR(VLOOKUP(N74,KATILIM!$A$4:$G$301,6,0),0)","v":0}]
["24.24",null,null,null,{"$f":"IFERROR(VLOOKUP(C75,KATILIM!$A$4:$Z$301,26,0),0)","v":0},{"$f":"BA28","v":0},null,null,{"$f":"IFERROR(VLOOKUP(C75,KATILIM!$A$4:$G$301,6,0),0)","v":0}]
[]
[25,"E25",null,null,{"$f":"IFERROR(VLOOKUP(C77,KATILIM!$A$4:$Z$301,26,0),0)","v":0},{"$f":"AZ29","v":0},{"$f":"IF(AND(F77=0,F78=0),\"\",IF(F77>F78,E77,E78))","v":""},null,{"$f":"IFERROR(VLOOKUP(C77,KATILIM!$A$4:$G$301,6,0),0)","v":0},null,null,"E25",25,{"$f":"OFFSET(#REF!,M77,#REF!)","v":{"$error":"#REF!"}},{"$f":"IFERROR(VLOOKUP(N77,KATILIM!$A$4:$Z$301,26,0),0)","v":0},{"$f":"IFERROR(VLOOKUP(N77,KATILIM!$A$4:$G$301,6,0),0)","v":0}]
["25.25",null,null,null,{"$f":"IFERROR(VLOOKUP(C78,KATILIM!$A$4:$Z$301,26,0),0)","v":0},{"$f":"BA29","v":0},null,null,{"$f":"IFERROR(VLOOKUP(C78,KATILIM!$A$4:$G$301,6,0),0)","v":0}]
[]
[26,"E26",null,null,{"$f":"IFERROR(VLOOKUP(C80,KATILIM!$A$4:$Z$301,26,0),0)","v":0},{"$f":"AZ30","v":0},{"$f":"IF(AND(F80=0,F81=0),\"\",IF(F80>F81,E80,E81))","v":""},null,{"$f":"IFERROR(VLOOKUP(C80,KATILIM!$A$4:$G$301,6,0),0)","v":0},null,null,"E26",26,{"$f":"OFFSET(#REF!,M80,#REF!)","v":{"$error":"#REF!"}},{"$f":"IFERROR(VLOOKUP(N80,KATILIM!$A$4:$Z$301,26,0),0)","v":0},{"$f":"IFERROR(VLOOKUP(N80,KATILIM!$A$4:$G$301,6,0),0)","v":0}]
["26.26",null,null,null,{"$f":"IFERROR(VLOOKUP(C81,KATILIM!$A$4:$Z$301,26,0),0)","v":0},{"$f":"BA30","v":0},null,null,{"$f":"IFERROR(VLOOKUP(C81,KATILIM!$A$4:$G$301,6,0),0)","v":0}]
[]
[27,"E27",null,null,{"$f":"IFERROR(VLOOKUP(C83,KATILIM!$A$4:$Z$301,26,0),0)","v":0},{"$f":"AZ31","v":0},{"$f":"IF(AND(F83=0,F84=0),\"\",IF(F83>F84,E83,E84))","v":""},null,{"$f":"IFERROR(VLOOKUP(C83,KATILIM!$A$4:$G$301,6,0),0)","v":0},null,null,"E27",27,{"$f":"OFFSET(#REF!,M83,#REF!)","v":{"$error":"#REF!"}},{"$f":"IFERROR(VLOOKUP(N83,KATILIM!$A$4:$Z$301,26,0),0)","v":0},{"$f":"IFERROR(VLOOKUP(N83,KATILIM!$A$4:$G$301,6,0),0)","v":0}]
["27.27",null,null,null,{"$f":"IFERROR(VLOOKUP(C84,KATILIM!$A$4:$Z$301,26,0),0)","v":0},{"$f":"BA31","v":0},null,null,{"$f":"IFERROR(VLOOKUP(C84,KATILIM!$A$4:$G$301,6,0),0)","v":0}]
[]
[28,"E28",null,null,{"$f":"IFERROR(VLOOKUP(C86,KATILIM!$A$4:$Z$301,26,0),0)","v":0},{"$f":"AZ32","v":0},{"$f":"IF(AND(F86=0,F87=0),\"\",IF(F86>F87,E86,E87))","v":""},null,{"$f":"IFERROR(VLOOKUP(C86,KATILIM!$A$4:$G$301,6,0),0)","v":0},null,null,"E28",28,{"$f":"OFFSET(#REF!,M86,#REF!)","v":{"$error":"#REF!"}},{"$f":"IFERROR(VLOOKUP(N86,KATILIM!$A$4:$Z$301,26,0),0)","v":0},{"$f":"IFERROR(VLOOKUP(N86,KATILIM!$A$4:$G$301,6,0),0)","v":0}]
["28.28",null,null,null,{"$f":"IFERROR(VLOOKUP(C87,KATILIM!$A$4:$Z$301,26,0),0)","v":0},{"$f":"BA32","v":0},null,null,{"$f":"IFERROR(VLOOKUP(C87,KATILIM!$A$4:$G$301,6,0),0)","v":0}]
[]
[29,"E29",null,null,{"$f":"IFERROR(VLOOKUP(C89,KATILIM!$A$4:$Z$301,26,0),0)","v":0},{"$f":"AZ33","v":0},{"$f":"IF(AND(F89=0,F90=0),\"\",IF(F89>F90,E89,E90))","v":""},null,{"$f":"IFERROR(VLOOKUP(C89,KATILIM!$A$4:$G$301,6,0),0)","v":0},null,null,"E29",29,{"$f":"OFFSET(#REF!,M89,#REF!)","v":{"$error":"#REF!"}},{"$f":"IFERROR(VLOOKUP(N89,KATILIM!$A$4:$Z$301,26,0),0)","v":0},{"$f":"IFERROR(VLOOKUP(N89,KATILIM!$A$4:$G$301,6,0),0)","v":0}]
["29.29",null,null,null,{"$f":"IFERROR(VLOOKUP(C90,KATILIM!$A$4:$Z$301,26,0),0)","v":0},{"$f":"BA33","v":0},null,null,{"$f":"IFERROR(VLOOKUP(C90,KATILIM!$A$4:$G$301,6,0),0)","v":0}]
[]
[30,"E30",null,null,{"$f":"IFERROR(VLOOKUP(C92,KATILIM!$A$4:$Z$301,26,0),0)","v":0},{"$f":"AZ34","v":0},{"$f":"IF(AND(F92=0,F93=0),\"\",IF(F92>F93,E92,E93))","v":""},null,{"$f":"IFERROR(VLOOKUP(C92,KATILIM!$A$4:$G$301,6,0),0)","v":0},null,null,"E30",30,{"$f":"OFFSET(#REF!,M92,#REF!)","v":{"$error":"#REF!"}},{"$f":"IFERROR(VLOOKUP(N92,KATILIM!$A$4:$Z$301,26,0),0)","v":0},{"$f":"IFERROR(VLOOKUP(N92,KATILIM!$A$4:$G$301,6,0),0)","v":0}]
["30.30",null,null,null,{"$f":"IFERROR(VLOOKUP(C93,KATILIM!$A$4:$Z$301,26,0),0)","v":0},{"$f":"BA34","v":0},null,null,{"$f":"IFERROR(VLOOKUP(C93,KATILIM!$A$4:$G$301,6,0),0)","v":0}]
[]
[31,"E31",null,null,{"$f":"IFERROR(VLOOKUP(C95,KATILIM!$A$4:$Z$301,26,0),0)","v":0},{"$f":"AZ35","v":0},{"$f":"IF(AND(F95=0,F96=0),\"\",IF(F95>F96,E95,E96))","v":""},null,{"$f":"IFERROR(VLOOKUP(C95,KATILIM!$A$4:$G$301,6,0),0)","v":0},null,null,"E31",31,{"$f":"OFFSET(#REF!,M95,#REF!)","v":{"$error":"#REF!"}},{"$f":"IFERROR(VLOOKUP(N95,KATILIM!$A$4:$Z$301,26,0),0)","v":0},{"$f":"IFERROR(VLOOKUP(N95,KATILIM!$A$4:$G$301,6,0),0)","v":0}]
["31.31",null,null,null,{"$f":"IFERROR(VLOOKUP(C96,KATILIM!$A$4:$Z$301,26,0),0)","v":0},{"$f":"BA35","v":0},null,null,{"$f":"IFERROR(VLOOKUP(C96,KATILIM!$A$4:$G$301,6,0),0)","v":0}]
[]
[32,"E32",null,null,{"$f":"IFERROR(VLOOKUP(C98,KATILIM!$A$4:$Z$301,26,0),0)","v":0},{"$f":"AZ36","v":0},{"$f":"IF(AND(F98=0,F99=0),\"\",IF(F98>F99,E98,E99))","v":""},null,{"$f":"IFERROR(VLOOKUP(C98,KATILIM!$A$4:$G$301,6,0),0)","v":0},null,null,"E32",32,{"$f":"OFFSET(#REF!,M98,#REF!)","v":{"$error":"#REF!"}},{"$f":"IFERROR(VLOOKUP(N98,KATILIM!$A$4:$Z$301,26,0),0)","v":0},{"$f":"IFERROR(VLOOKUP(N98,KATILIM!$A$4:$G$301,6,0),0)","v":0}]
["32.32",null,null,null,{"$f":"IFERROR(VLOOKUP(C99,KATILIM!$A$4:$Z$301,26,0),0)","v":0},{"$f":"BA36","v":0},null,null,{"$f":"IFERROR(VLOOKUP(C99,KATILIM!$A$4:$G$301,6,0),0)","v":0}]
[]
[33,"E33",null,null,{"$f":"IFERROR(VLOOKUP(C101,KATILIM!$A$4:$Z$301,26,0),0)","v":0},{"$f":"AZ37","v":0},{"$f":"IF(AND(F101=0,F102=0),\"\",IF(F101>F102,E101,E102))","v":""},null,{"$f":"IFERROR(VLOOKUP(C101,KATILIM!$A$4:$G$301,6,0),0)","v":0},null,null,"E33",33,{"$f":"OFFSET(#REF!,M101,#REF!)","v":{"$error":"#REF!"}},{"$f":"IFERROR(VLOOKUP(N101,KATILIM!$A$4:$Z$301,26,0),0)","v":0},{"$f":"IFERROR(VLOOKUP(N101,KATILIM!$A$4:$G$301,6,0),0)","v":0}]
["33.33",null,null,null,{"$f":"IFERROR(VLOOKUP(C102,KATILIM!$A$4:$Z$301,26,0),0)","v":0},{"$f":"BA37","v":0},null,null,{"$f":"IFERROR(VLOOKUP(C102,KATILIM!$A$4:$G$301,6,0),0)","v":0}]
[]
[34,"E34",null,null,{"$f":"IFERROR(VLOOKUP(C104,KATILIM!$A$4:$Z$301,26,0),0)","v":0},{"$f":"AZ38","v":0},{"$f":"IF(AND(F104=0,F105=0),\"\",IF(F104>F105,E104,E105))","v":""},null,{"$f":"IFERROR(VLOOKUP(C104,KATILIM!$A$4:$G$301,6,0),0)","v":0},null,null,"E34",34,{"$f":"OFFSET(#REF!,M104,#REF!)","v":{"$error":"#REF!"}},{"$f":"IFERROR(VLOOKUP(N104,KATILIM!$A$4:$Z$301,26,0),0)","v":0},{"$f":"IFERROR(VLOOKUP(N104,KATILIM!$A$4:$G$301,6,0),0)","v":0}]
["34.34",null,null,null,{"$f":"IFERROR(VLOOKUP(C105,KATILIM!$A$4:$Z$301,26,0),0)","v":0},{"$f":"BA38","v":0},null,null,{"$f":"IFERROR(VLOOKUP(C105,KATILIM!$A$4:$G$301,6,0),0)","v":0}]
[]
[35,"E35",null,null,{"$f":"IFERROR(VLOOKUP(C107,KATILIM!$A$4:$Z$301,26,0),0)","v":0},{"$f":"AZ39","v":0},{"$f":"IF(AND(F107=0,F108=0),\"\",IF(F107>F108,E107,E108))","v":""},null,{"$f":"IFERROR(VLOOKUP(C107,KATILIM!$A$4:$G$301,6,0),0)","v":0},null,null,"E35",35,{"$f":"OFFSET(#REF!,M107,#REF!)","v":{"$error":"#REF!"}},{"$f":"IFERROR(VLOOKUP(N107,KATILIM!$A$4:$Z$301,26,0),0)","v":0},{"$f":"IFERROR(VLOOKUP(N107,KATILIM!$A$4:$G$301,6,0),0)","v":0}]
["35.35",null,null,null,{"$f":"IFERROR(VLOOKUP(C108,KATILIM!$A$4:$Z$301,26,0),0)","v":0},{"$f":"BA39","v":0},null,null,{"$f":"IFERROR(VLOOKUP(C108,KATILIM!$A$4:$G$301,6,0),0)","v":0}]
[]
[36,"E36",null,null,{"$f":"IFERROR(VLOOKUP(C110,KATILIM!$A$4:$Z$301,26,0),0)","v":0},{"$f":"AZ40","v":0},{"$f":"IF(AND(F110=0,F111=0),\"\",IF(F110>F111,E110,E111))","v":""},null,{"$f":"IFERROR(VLOOKUP(C110,KATILIM!$A$4:$G$301,6,0),0)","v":0},null,null,"E36",36,{"$f":"OFFSET(#REF!,M110,#REF!)","v":{"$error":"#REF!"}},{"$f":"IFERROR(VLOOKUP(N110,KATILIM!$A$4:$Z$301,26,0),0)","v":0},{"$f":"IFERROR(VLOOKUP(N110,KATILIM!$A$4:$G$301,6,0),0)","v":0}]
["36.36",null,null,null,{"$f":"IFERROR(VLOOKUP(C111,KATILIM!$A$4:$Z$301,26,0),0)","v":0},{"$f":"BA40","v":0},null,null,{"$f":"IFERROR(VLOOKUP(C111,KATILIM!$A$4:$G$301,6,0),0)","v":0}]
[]
[37,"E37",null,null,{"$f":"IFERROR(VLOOKUP(C113,KATILIM!$A$4:$Z$301,26,0),0)","v":0},{"$f":"AZ41","v":0},{"$f":"IF(AND(F113=0,F114=0),\"\",IF(F113>F114,E113,E114))","v":""},null,{"$f":"IFERROR(VLOOKUP(C113,KATILIM!$A$4:$G$301,6,0),0)","v":0},null,null,"E37",37,{"$f":"OFFSET(#REF!,M113,#REF!)","v":{"$error":"#REF!"}},{"$f":"IFERROR(VLOOKUP(N113,KATILIM!$A$4:$Z$301,26,0),0)","v":0},{"$f":"IFERROR(VLOOKUP(N113,KATILIM!$A$4:$G$301,6,0),0)","v":0}]
["37.37",null,null,null,{"$f":"IFERROR(VLOOKUP(C114,KATILIM!$A$4:$Z$301,26,0),0)","v":0},{"$f":"BA41","v":0},null,null,{"$f":"IFERROR(VLOOKUP(C114,KATILIM!$A$4:$G$301,6,0),0)","v":0}]
[]
[38,"E38",null,null,{"$f":"IFERROR(VLOOKUP(C116,KATILIM!$A$4:$Z$301,26,0),0)","v":0},{"$f":"AZ42","v":0},{"$f":"IF(AND(F116=0,F117=0),\"\",IF(F116>F117,E116,E117))","v":""},null,{"$f":"IFERROR(VLOOKUP(C116,KATILIM!$A$4:$G$301,6,0),0)","v":0},null,null,"E38",38,{"$f":"OFFSET(#REF!,M116,#REF!)","v":{"$error":"#REF!"}},{"$f":"IFERROR(VLOOKUP(N116,KATILIM!$A$4:$Z$301,26,0),0)","v":0},{"$f":"IFERROR(VLOOKUP(N116,KATILIM!$A$4:$G$301,6,0),0)","v":0}]
["38.38",null,null,null,{"$f":"IFERROR(VLOOKUP(C117,KATILIM!$A$4:$Z$301,26,0),0)","v":0},{"$f":"BA42","v":0},null,null,{"$f":"IFERROR(VLOOKUP(C117,KATILIM!$A$4:$G$301,6,0),0)","v":0}]
[]
[39,"E39",null,null,{"$f":"IFERROR(VLOOKUP(C119,KATILIM!$A$4:$Z$301,26,0),0)","v":0},{"$f":"AZ43","v":0},{"$f":"IF(AND(F119=0,F120=0),\"\",IF(F119>F120,E119,E120))","v":""},null,{"$f":"IFERROR(VLOOKUP(C119,KATILIM!$A$4:$G$301,6,0),0)","v":0},null,null,"E39",39,{"$f":"OFFSET(#REF!,M119,#REF!)","v":{"$error":"#REF!"}},{"$f":"IFERROR(VLOOKUP(N119,KATILIM!$A$4:$Z$301,26,0),0)","v":0},{"$f":"IFERROR(VLOOKUP(N119,KATILIM!$A$4:$G$301,6,0),0)","v":0}]
["39.39",null,null,null,{"$f":"IFERROR(VLOOKUP(C120,KATILIM!$A$4:$Z$301,26,0),0)","v":0},{"$f":"BA43","v":0},null,null,{"$f":"IFERROR(VLOOKUP(C120,KATILIM!$A$4:$G$301,6,0),0)","v":0}]
[]
[40,"E40",null,null,{"$f":"IFERROR(VLOOKUP(C122,KATILIM!$A$4:$Z$301,26,0),0)","v":0},{"$f":"AZ44","v":0},{"$f":"IF(AND(F122=0,F123=0),\"\",IF(F122>F123,E122,E123))","v":""},null,{"$f":"IFERROR(VLOOKUP(C122,KATILIM!$A$4:$G$301,6,0),0)","v":0},null,null,"E40",40,{"$f":"OFFSET(#REF!,M122,#REF!)","v":{"$error":"#REF!"}},{"$f":"IFERROR(VLOOKUP(N122,KATILIM!$A$4:$Z$301,26,0),0)","v":0},{"$f":"IFERROR(VLOOKUP(N122,KATILIM!$A$4:$G$301,6,0),0)","v":0}]
["40.40",null,null,null,{"$f":"IFERROR(VLOOKUP(C123,KATILIM!$A$4:$Z$301,26,0),0)","v":0},{"$f":"BA44","v":0},null,null,{"$f":"IFERROR(VLOOKUP(C123,KATILIM!$A$4:$G$301,6,0),0)","v":0}]
[]
[41,"E41",null,null,{"$f":"IFERROR(VLOOKUP(C125,KATILIM!$A$4:$Z$301,26,0),0)","v":0},{"$f":"AZ45","v":0},{"$f":"IF(AND(F125=0,F126=0),\"\",IF(F125>F126,E125,E126))","v":""},null,{"$f":"IFERROR(VLOOKUP(C125,KATILIM!$A$4:$G$301,6,0),0)","v":0},null,null,"E41",41,{"$f":"OFFSET(#REF!,M125,#REF!)","v":{"$error":"#REF!"}},{"$f":"IFERROR(VLOOKUP(N125,KATILIM!$A$4:$Z$301,26,0),0)","v":0},{"$f":"IFERROR(VLOOKUP(N125,KATILIM!$A$4:$G$301,6,0),0)","v":0}]
["41.41",null,null,null,{"$f":"IFERROR(VLOOKUP(C126,KATILIM!$A$4:$Z$301,26,0),0)","v":0},{"$f":"BA45","v":0},null,null,{"$f":"IFERROR(VLOOKUP(C126,KATILIM!$A$4:$G$301,6,0),0)","v":0}]
[]
[42,"E42",null,null,{"$f":"IFERROR(VLOOKUP(C128,KATILIM!$A$4:$Z$301,26,0),0)","v":0},{"$f":"AZ46","v":0},{"$f":"IF(AND(F128=0,F129=0),\"\",IF(F128>F129,E128,E129))","v":""},null,{"$f":"IFERROR(VLOOKUP(C128,KATILIM!$A$4:$G$301,6,0),0)","v":0},null,null,"E42",42,{"$f":"OFFSET(#REF!,M128,#REF!)","v":{"$error":"#REF!"}},{"$f":"IFERROR(VLOOKUP(N128,KATILIM!$A$4:$Z$301,26,0),0)","v":0},{"$f":"IFERROR(VLOOKUP(N128,KATILIM!$A$4:$G$301,6,0),0)","v":0}]
["42.42",null,null,null,{"$f":"IFERROR(VLOOKUP(C129,KATILIM!$A$4:$Z$301,26,0),0)","v":0},{"$f":"BA46","v":0},null,null,{"$f":"IFERROR(VLOOKUP(C129,KATILIM!$A$4:$G$301,6,0),0)","v":0}]
[]
[43,"E43",null,null,{"$f":"IFERROR(VLOOKUP(C131,KATILIM!$A$4:$Z$301,26,0),0)","v":0},{"$f":"AZ47","v":0},{"$f":"IF(AND(F131=0,F132=0),\"\",IF(F131>F132,E131,E132))","v":""},null,{"$f":"IFERROR(VLOOKUP(C131,KATILIM!$A$4:$G$301,6,0),0)","v":0},null,null,"E43",43,{"$f":"OFFSET(#REF!,M131,#REF!)","v":{"$error":"#REF!"}},{"$f":"IFERROR(VLOOKUP(N131,KATILIM!$A$4:$Z$301,26,0),0)","v":0},{"$f":"IFERROR(VLOOKUP(N131,KATILIM!$A$4:$G$301,6,0),0)","v":0}]
["43.43",null,null,null,{"$f":"IFERROR(VLOOKUP(C132,KATILIM!$A$4:$Z$301,26,0),0)","v":0},{"$f":"BA47","v":0},null,null,{"$f":"IFERROR(VLOOKUP(C132,KATILIM!$A$4:$G$301,6,0),0)","v":0}]
[]
[44,"E44",null,null,{"$f":"IFERROR(VLOOKUP(C134,KATILIM!$A$4:$Z$301,26,0),0)","v":0},{"$f":"AZ48","v":0},{"$f":"IF(AND(F134=0,F135=0),\"\",IF(F134>F135,E134,E135))","v":""},null,{"$f":"IFERROR(VLOOKUP(C134,KATILIM!$A$4:$G$301,6,0),0)","v":0},null,null,"E44",44,{"$f":"OFFSET(#REF!,M134,#REF!)","v":{"$error":"#REF!"}},{"$f":"IFERROR(VLOOKUP(N134,KATILIM!$A$4:$Z$301,26,0),0)","v":0},{"$f":"IFERROR(VLOOKUP(N134,KATILIM!$A$4:$G$301,6,0),0)","v":0}]
["44.44",null,null,null,{"$f":"IFERROR(VLOOKUP(C135,KATILIM!$A$4:$Z$301,26,0),0)","v":0},{"$f":"BA48","v":0},null,null,{"$f":"IFERROR(VLOOKUP(C135,KATILIM!$A$4:$G$301,6,0),0)","v":0}]
[]
[45,"E45",null,null,{"$f":"IFERROR(VLOOKUP(C137,KATILIM!$A$4:$Z$301,26,0),0)","v":0},{"$f":"AZ49","v":0},{"$f":"IF(AND(F137=0,F138=0),\"\",IF(F137>F138,E137,E138))","v":""},null,{"$f":"IFERROR(VLOOKUP(C137,KATILIM!$A$4:$G$301,6,0),0)","v":0},null,null,"E45",45,{"$f":"OFFSET(#REF!,M137,#REF!)","v":{"$error":"#REF!"}},{"$f":"IFERROR(VLOOKUP(N137,KATILIM!$A$4:$Z$301,26,0),0)","v":0},{"$f":"IFERROR(VLOOKUP(N137,KATILIM!$A$4:$G$301,6,0),0)","v":0}]
["45.45",null,null,null,{"$f":"IFERROR(VLOOKUP(C138,KATILIM!$A$4:$Z$301,26,0),0)","v":0},{"$f":"BA49","v":0},null,null,{"$f":"IFERROR(VLOOKUP(C138,KATILIM!$A$4:$G$301,6,0),0)","v":0}]
[]
[46,"E46",null,null,{"$f":"IFERROR(VLOOKUP(C140,KATILIM!$A$4:$Z$301,26,0),0)","v":0},{"$f":"AZ50","v":0},{"$f":"IF(AND(F140=0,F141=0),\"\",IF(F140>F141,E140,E141))","v":""},null,{"$f":"IFERROR(VLOOKUP(C140,KATILIM!$A$4:$G$301,6,0),0)","v":0},null,null,"E46",46,{"$f":"OFFSET(#REF!,M140,#REF!)","v":{"$error":"#REF!"}},{"$f":"IFERROR(VLOOKUP(N140,KATILIM!$A$4:$Z$301,26,0),0)","v":0},{"$f":"IFERROR(VLOOKUP(N140,KATILIM!$A$4:$G$301,6,0),0)","v":0}]
["46.46",null,null,null,{"$f":"IFERROR(VLOOKUP(C141,KATILIM!$A$4:$Z$301,26,0),0)","v":0},{"$f":"BA50","v":0},null,null,{"$f":"IFERROR(VLOOKUP(C141,KATILIM!$A$4:$G$301,6,0),0)","v":0}]
[]
[47,"E47",null,null,{"$f":"IFERROR(VLOOKUP(C143,KATILIM!$A$4:$Z$301,26,0),0)","v":0},{"$f":"AZ51","v":0},{"$f":"IF(AND(F143=0,F144=0),\"\",IF(F143>F144,E143,E144))","v":""},null,{"$f":"IFERROR(VLOOKUP(C143,KATILIM!$A$4:$G$301,6,0),0)","v":0},null,null,"E47",47,{"$f":"OFFSET(#REF!,M143,#REF!)","v":{"$error":"#REF!"}},{"$f":"IFERROR(VLOOKUP(N143,KATILIM!$A$4:$Z$301,26,0),0)","v":0},{"$f":"IFERROR(VLOOKUP(N143,KATILIM!$A$4:$G$301,6,0),0)","v":0}]
["47.47",null,null,null,{"$f":"IFERROR(VLOOKUP(C144,KATILIM!$A$4:$Z$301,26,0),0)","v":0},{"$f":"BA51","v":0},null,null,{"$f":"IFERROR(VLOOKUP(C144,KATILIM!$A$4:$G$301,6,0),0)","v":0}]
[]
[48,"E48",null,null,{"$f":"IFERROR(VLOOKUP(C146,KATILIM!$A$4:$Z$301,26,0),0)","v":0},{"$f":"AZ52","v":0},{"$f":"IF(AND(F146=0,F147=0),\"\",IF(F146>F147,E146,E147))","v":""},null,{"$f":"IFERROR(VLOOKUP(C146,KATILIM!$A$4:$G$301,6,0),0)","v":0},null,null,"E48",48,{"$f":"OFFSET(#REF!,M146,#REF!)","v":{"$error":"#REF!"}},{"$f":"IFERROR(VLOOKUP(N146,KATILIM!$A$4:$Z$301,26,0),0)","v":0},{"$f":"IFERROR(VLOOKUP(N146,KATILIM!$A$4:$G$301,6,0),0)","v":0}]
["48.48",null,null,null,{"$f":"IFERROR(VLOOKUP(C147,KATILIM!$A$4:$Z$301,26,0),0)","v":0},{"$f":"BA52","v":0},null,null,{"$f":"IFERROR(VLOOKUP(C147,KATILIM!$A$4:$G$301,6,0),0)","v":0}]
[]
[49,"E49",null,null,{"$f":"IFERROR(VLOOKUP(C149,KATILIM!$A$4:$Z$301,26,0),0)","v":0},{"$f":"AZ53","v":0},{"$f":"IF(AND(F149=0,F150=0),\"\",IF(F149>F150,E149,E150))","v":""},null,{"$f":"IFERROR(VLOOKUP(C149,KATILIM!$A$4:$G$301,6,0),0)","v":0},null,null,"E49",49,{"$f":"OFFSET(#REF!,M149,#REF!)","v":{"$error":"#REF!"}},{"$f":"IFERROR(VLOOKUP(N149,KATILIM!$A$4:$Z$301,26,0),0)","v":0},{"$f":"IFERROR(VLOOKUP(N149,KATILIM!$A$4:$G$301,6,0),0)","v":0}]
["49.49",null,null,null,{"$f":"IFERROR(VLOOKUP(C150,KATILIM!$A$4:$Z$301,26,0),0)","v":0},{"$f":"BA53","v":0},null,null,{"$f":"IFERROR(VLOOKUP(C150,KATILIM!$A$4:$G$301,6,0),0)","v":0}]
[]
[50,"E50",null,null,{"$f":"IFERROR(VLOOKUP(C152,KATILIM!$A$4:$Z$301,26,0),0)","v":0},{"$f":"AZ54","v":0},{"$f":"IF(AND(F152=0,F153=0),\"\",IF(F152>F153,E152,E153))","v":""},null,{"$f":"IFERROR(VLOOKUP(C152,KATILIM!$A$4:$G$301,6,0),0)","v":0},null,null,"E50",50,{"$f":"OFFSET(#REF!,M152,#REF!)","v":{"$error":"#REF!"}},{"$f":"IFERROR(VLOOKUP(N152,KATILIM!$A$4:$Z$301,26,0),0)","v":0},{"$f":"IFERROR(VLOOKUP(N152,KATILIM!$A$4:$G$301,6,0),0)","v":0}]
["50.50",null,null,null,{"$f":"IFERROR(VLOOKUP(C153,KATILIM!$A$4:$Z$301,26,0),0)","v":0},{"$f":"BA54","v":0},null,null,{"$f":"IFERROR(VLOOKUP(C153,KATILIM!$A$4:$G$301,6,0),0)","v":0}]
[]
[51,"E51",null,null,{"$f":"IFERROR(VLOOKUP(C155,KATILIM!$A$4:$Z$301,26,0),0)","v":0},{"$f":"AZ55","v":0},{"$f":"IF(AND(F155=0,F156=0),\"\",IF(F155>F156,E155,E156))","v":""},null,{"$f":"IFERROR(VLOOKUP(C155,KATILIM!$A$4:$G$301,6,0),0)","v":0},null,null,"E51",51,{"$f":"OFFSET(#REF!,M155,#REF!)","v":{"$error":"#REF!"}},{"$f":"IFERROR(VLOOKUP(N155,KATILIM!$A$4:$Z$301,26,0),0)","v":0},{"$f":"IFERROR(VLOOKUP(N155,KATILIM!$A$4:$G$301,6,0),0)","v":0}]
["51.51",null,null,null,{"$f":"IFERROR(VLOOKUP(C156,KATILIM!$A$4:$Z$301,26,0),0)","v":0},{"$f":"BA55","v":0},null,null,{"$f":"IFERROR(VLOOKUP(C156,KATILIM!$A$4:$G$301,6,0),0)","v":0}]
[]
[52,"E52",null,null,{"$f":"IFERROR(VLOOKUP(C158,KATILIM!$A$4:$Z$301,26,0),0)","v":0},{"$f":"AZ56","v":0},{"$f":"IF(AND(F158=0,F159=0),\"\",IF(F158>F159,E158,E159))","v":""},null,{"$f":"IFERROR(VLOOKUP(C158,KATILIM!$A$4:$G$301,6,0),0)","v":0},null,null,"E52",52,{"$f":"OFFSET(#REF!,M158,#REF!)","v":{"$error":"#REF!"}},{"$f":"IFERROR(VLOOKUP(N158,KATILIM!$A$4:$Z$301,26,0),0)","v":0},{"$f":"IFERROR(VLOOKUP(N158,KATILIM!$A$4:$G$301,6,0),0)","v":0}]
["52.52",null,null,null,{"$f":"IFERROR(VLOOKUP(C159,KATILIM!$A$4:$Z$301,26,0),0)","v":0},{"$f":"BA56","v":0},null,null,{"$f":"IFERROR(VLOOKUP(C159,KATILIM!$A$4:$G$301,6,0),0)","v":0}]
[]
[53,"E53",null,null,{"$f":"IFERROR(VLOOKUP(C161,KATILIM!$A$4:$Z$301,26,0),0)","v":0},{"$f":"AZ57","v":0},{"$f":"IF(AND(F161=0,F162=0),\"\",IF(F161>F162,E161,E162))","v":""},null,{"$f":"IFERROR(VLOOKUP(C161,KATILIM!$A$4:$G$301,6,0),0)","v":0},null,null,"E53",53,{"$f":"OFFSET(#REF!,M161,#REF!)","v":{"$error":"#REF!"}},{"$f":"IFERROR(VLOOKUP(N161,KATILIM!$A$4:$Z$301,26,0),0)","v":0},{"$f":"IFERROR(VLOOKUP(N161,KATILIM!$A$4:$G$301,6,0),0)","v":0}]
["53.53",null,null,null,{"$f":"IFERROR(VLOOKUP(C162,KATILIM!$A$4:$Z$301,26,0),0)","v":0},{"$f":"BA57","v":0},null,null,{"$f":"IFERROR(VLOOKUP(C162,KATILIM!$A$4:$G$301,6,0),0)","v":0}]
[]
[54,"E54",null,null,{"$f":"IFERROR(VLOOKUP(C164,KATILIM!$A$4:$Z$301,26,0),0)","v":0},{"$f":"AZ58","v":0},{"$f":"IF(AND(F164=0,F165=0),\"\",IF(F164>F165,E164,E165))","v":""},null,{"$f":"IFERROR(VLOOKUP(C164,KATILIM!$A$4:$G$301,6,0),0)","v":0},null,null,"E54",54,{"$f":"OFFSET(#REF!,M164,#REF!)","v":{"$error":"#REF!"}},{"$f":"IFERROR(VLOOKUP(N164,KATILIM!$A$4:$Z$301,26,0),0)","v":0},{"$f":"IFERROR(VLOOKUP(N164,KATILIM!$A$4:$G$301,6,0),0)","v":0}]
["54.54",null,null,null,{"$f":"IFERROR(VLOOKUP(C165,KATILIM!$A$4:$Z$301,26,0),0)","v":0},{"$f":"BA58","v":0},null,null,{"$f":"IFERROR(VLOOKUP(C165,KATILIM!$A$4:$G$301,6,0),0)","v":0}]
[]
[55,"E55",null,null,{"$f":"IFERROR(VLOOKUP(C167,KATILIM!$A$4:$Z$301,26,0),0)","v":0},{"$f":"AZ59","v":0},{"$f":"IF(AND(F167=0,F168=0),\"\",IF(F167>F168,E167,E168))","v":""},null,{"$f":"IFERROR(VLOOKUP(C167,KATILIM!$A$4:$G$301,6,0),0)","v":0},null,null,"E55",55,{"$f":"OFFSET(#REF!,M167,#REF!)","v":{"$error":"#REF!"}},{"$f":"IFERROR(VLOOKUP(N167,KATILIM!$A$4:$Z$301,26,0),0)","v":0},{"$f":"IFERROR(VLOOKUP(N167,KATILIM!$A$4:$G$301,6,0),0)","v":0}]
["55.55",null,null,null,{"$f":"IFERROR(VLOOKUP(C168,KATILIM!$A$4:$Z$301,26,0),0)","v":0},{"$f":"BA59","v":0},null,null,{"$f":"IFERROR(VLOOKUP(C168,KATILIM!$A$4:$G$301,6,0),0)","v":0}]
[]
[56,"E56",null,null,{"$f":"IFERROR(VLOOKUP(C170,KATILIM!$A$4:$Z$301,26,0),0)","v":0},{"$f":"AZ60","v":0},{"$f":"IF(AND(F170=0,F171=0),\"\",IF(F170>F171,E170,E171))","v":""},null,{"$f":"IFERROR(VLOOKUP(C170,KATILIM!$A$4:$G$301,6,0),0)","v":0},null,null,"E56",56,{"$f":"OFFSET(#REF!,M170,#REF!)","v":{"$error":"#REF!"}},{"$f":"IFERROR(VLOOKUP(N170,KATILIM!$A$4:$Z$301,26,0),0)","v":0},{"$f":"IFERROR(VLOOKUP(N170,KATILIM!$A$4:$G$301,6,0),0)","v":0}]
["56.56",null,null,null,{"$f":"IFERROR(VLOOKUP(C171,KATILIM!$A$4:$Z$301,26,0),0)","v":0},{"$f":"BA60","v":0},null,null,{"$f":"IFERROR(VLOOKUP(C171,KATILIM!$A$4:$G$301,6,0),0)","v":0}]
[]
[57,"E57",null,null,{"$f":"IFERROR(VLOOKUP(C173,KATILIM!$A$4:$Z$301,26,0),0)","v":0},{"$f":"AZ61","v":0},{"$f":"IF(AND(F173=0,F174=0),\"\",IF(F173>F174,E173,E174))","v":""},null,{"$f":"IFERROR(VLOOKUP(C173,KATILIM!$A$4:$G$301,6,0),0)","v":0},null,null,"E57",57,{"$f":"OFFSET(#REF!,M173,#REF!)","v":{"$error":"#REF!"}},{"$f":"IFERROR(VLOOKUP(N173,KATILIM!$A$4:$Z$301,26,0),0)","v":0},{"$f":"IFERROR(VLOOKUP(N173,KATILIM!$A$4:$G$301,6,0),0)","v":0}]
["57.57",null,null,null,{"$f":"IFERROR(VLOOKUP(C174,KATILIM!$A$4:$Z$301,26,0),0)","v":0},{"$f":"BA61","v":0},null,null,{"$f":"IFERROR(VLOOKUP(C174,KATILIM!$A$4:$G$301,6,0),0)","v":0}]
[]
[58,"E58",null,null,{"$f":"IFERROR(VLOOKUP(C176,KATILIM!$A$4:$Z$301,26,0),0)","v":0},{"$f":"AZ62","v":0},{"$f":"IF(AND(F176=0,F177=0),\"\",IF(F176>F177,E176,E177))","v":""},null,{"$f":"IFERROR(VLOOKUP(C176,KATILIM!$A$4:$G$301,6,0),0)","v":0},null,null,"E58",58,{"$f":"OFFSET(#REF!,M176,#REF!)","v":{"$error":"#REF!"}},{"$f":"IFERROR(VLOOKUP(N176,KATILIM!$A$4:$Z$301,26,0),0)","v":0},{"$f":"IFERROR(VLOOKUP(N176,KATILIM!$A$4:$G$301,6,0),0)","v":0}]
["58.58",null,null,null,{"$f":"IFERROR(VLOOKUP(C177,KATILIM!$A$4:$Z$301,26,0),0)","v":0},{"$f":"BA62","v":0},null,null,{"$f":"IFERROR(VLOOKUP(C177,KATILIM!$A$4:$G$301,6,0),0)","v":0}]
[]
[59,"E59",null,null,{"$f":"IFERROR(VLOOKUP(C179,KATILIM!$A$4:$Z$301,26,0),0)","v":0},{"$f":"AZ63","v":0},{"$f":"IF(AND(F179=0,F180=0),\"\",IF(F179>F180,E179,E180))","v":""},null,{"$f":"IFERROR(VLOOKUP(C179,KATILIM!$A$4:$G$301,6,0),0)","v":0},null,null,"E59",59,{"$f":"OFFSET(#REF!,M179,#REF!)","v":{"$error":"#REF!"}},{"$f":"IFERROR(VLOOKUP(N179,KATILIM!$A$4:$Z$301,26,0),0)","v":0},{"$f":"IFERROR(VLOOKUP(N179,KATILIM!$A$4:$G$301,6,0),0)","v":0}]
["59.59",null,null,null,{"$f":"IFERROR(VLOOKUP(C180,KATILIM!$A$4:$Z$301,26,0),0)","v":0},{"$f":"BA63","v":0},null,null,{"$f":"IFERROR(VLOOKUP(C180,KATILIM!$A$4:$G$301,6,0),0)","v":0}]
[]
[60,"E60",null,null,{"$f":"IFERROR(VLOOKUP(C182,KATILIM!$A$4:$Z$301,26,0),0)","v":0},{"$f":"AZ64","v":0},{"$f":"IF(AND(F182=0,F183=0),\"\",IF(F182>F183,E182,E183))","v":""},null,{"$f":"IFERROR(VLOOKUP(C182,KATILIM!$A$4:$G$301,6,0),0)","v":0},null,null,"E60",60,{"$f":"OFFSET(#REF!,M182,#REF!)","v":{"$error":"#REF!"}},{"$f":"IFERROR(VLOOKUP(N182,KATILIM!$A$4:$Z$301,26,0),0)","v":0},{"$f":"IFERROR(VLOOKUP(N182,KATILIM!$A$4:$G$301,6,0),0)","v":0}]
["60.60",null,null,null,{"$f":"IFERROR(VLOOKUP(C183,KATILIM!$A$4:$Z$301,26,0),0)","v":0},{"$f":"BA64","v":0},null,null,{"$f":"IFERROR(VLOOKUP(C183,KATILIM!$A$4:$G$301,6,0),0)","v":0}]
[]
[61,"E61",null,null,{"$f":"IFERROR(VLOOKUP(C185,KATILIM!$A$4:$Z$301,26,0),0)","v":0},{"$f":"AZ65","v":0},{"$f":"IF(AND(F185=0,F186=0),\"\",IF(F185>F186,E185,E186))","v":""},null,{"$f":"IFERROR(VLOOKUP(C185,KATILIM!$A$4:$G$301,6,0),0)","v":0},null,null,"E61",61,{"$f":"OFFSET(#REF!,M185,#REF!)","v":{"$error":"#REF!"}},{"$f":"IFERROR(VLOOKUP(N185,KATILIM!$A$4:$Z$301,26,0),0)","v":0},{"$f":"IFERROR(VLOOKUP(N185,KATILIM!$A$4:$G$301,6,0),0)","v":0}]
["61.61",null,null,null,{"$f":"IFERROR(VLOOKUP(C186,KATILIM!$A$4:$Z$301,26,0),0)","v":0},{"$f":"BA65","v":0},null,null,{"$f":"IFERROR(VLOOKUP(C186,KATILIM!$A$4:$G$301,6,0),0)","v":0}]
[]
[62,"E62",null,null,{"$f":"IFERROR(VLOOKUP(C188,KATILIM!$A$4:$Z$301,26,0),0)","v":0},{"$f":"AZ66","v":0},{"$f":"IF(AND(F188=0,F189=0),\"\",IF(F188>F189,E188,E189))","v":""},null,{"$f":"IFERROR(VLOOKUP(C188,KATILIM!$A$4:$G$301,6,0),0)","v":0},null,null,"E62",62,{"$f":"OFFSET(#REF!,M188,#REF!)","v":{"$error":"#REF!"}},{"$f":"IFERROR(VLOOKUP(N188,KATILIM!$A$4:$Z$301,26,0),0)","v":0},{"$f":"IFERROR(VLOOKUP(N188,KATILIM!$A$4:$G$301,6,0),0)","v":0}]
["62.62",null,null,null,{"$f":"IFERROR(VLOOKUP(C189,KATILIM!$A$4:$Z$301,26,0),0)","v":0},{"$f":"BA66","v":0},null,null,{"$f":"IFERROR(VLOOKUP(C189,KATILIM!$A$4:$G$301,6,0),0)","v":0}]
[]
[63,"E63",null,null,{"$f":"IFERROR(VLOOKUP(C191,KATILIM!$A$4:$Z$301,26,0),0)","v":0},{"$f":"AZ67","v":0},{"$f":"IF(AND(F191=0,F192=0),\"\",IF(F191>F192,E191,E192))","v":""},null,{"$f":"IFERROR(VLOOKUP(C191,KATILIM!$A$4:$G$301,6,0),0)","v":0},null,null,"E63",63,{"$f":"OFFSET(#REF!,M191,#REF!)","v":{"$error":"#REF!"}},{"$f":"IFERROR(VLOOKUP(N191,KATILIM!$A$4:$Z$301,26,0),0)","v":0},{"$f":"IFERROR(VLOOKUP(N191,KATILIM!$A$4:$G$301,6,0),0)","v":0}]
["63.63",null,null,null,{"$f":"IFERROR(VLOOKUP(C192,KATILIM!$A$4:$Z$301,26,0),0)","v":0},{"$f":"BA67","v":0},null,null,{"$f":"IFERROR(VLOOKUP(C192,KATILIM!$A$4:$G$301,6,0),0)","v":0}]
[]
[64,"E64",null,null,{"$f":"IFERROR(VLOOKUP(C194,KATILIM!$A$4:$Z$301,26,0),0)","v":0},{"$f":"AZ68","v":0},{"$f":"IF(AND(F194=0,F195=0),\"\",IF(F194>F195,E194,E195))","v":""},null,{"$f":"IFERROR(VLOOKUP(C194,KATILIM!$A$4:$G$301,6,0),0)","v":0},null,null,"E64",64,{"$f":"OFFSET(#REF!,M194,#REF!)","v":{"$error":"#REF!"}},{"$f":"IFERROR(VLOOKUP(N194,KATILIM!$A$4:$Z$301,26,0),0)","v":0},{"$f":"IFERROR(VLOOKUP(N194,KATILIM!$A$4:$G$301,6,0),0)","v":0}]
["64.64",null,null,null,{"$f":"IFERROR(VLOOKUP(C195,KATILIM!$A$4:$Z$301,26,0),0)","v":0},{"$f":"BA68","v":0},null,null,{"$f":"IFERROR(VLOOKUP(C195,KATILIM!$A$4:$G$301,6,0),0)","v":0}]

{"sheet":"32DE","index":3,"n_rows":98,"n_cols":105,"rows_kept":98,"cut":false,"hidden":true,"merged":[[4,88,4,89],[4,90,4,91],[4,92,4,93],[4,94,4,95],[4,96,4,97],[4,98,4,99],[94,36,94,42],[95,43,95,49],[96,36,96,42],[87,50,87,56],[89,50,89,56],[83,50,83,56],[85,50,85,56],[60,57,60,63],[54,64,54,70],[48,57,48,63],[38,71,38,77],[37,50,37,56],[12,50,12,56],[97,43,97,49],[3,24,4,45],[90,29,90,35],[91,29,91,35],[91,43,91,49],[92,36,92,42],[93,29,93,35],[93,43,93,49],[86,43,86,49],[48,29,48,35],[48,43,48,49],[88,29,88,35],[88,43,88,49],[89,36,89,42],[82,36,82,42],[83,36,83,42],[84,43,84,49],[85,36,85,42],[79,15,79,21],[79,43,79,49],[80,8,80,14],[80,36,80,42],[80,50,80,56],[81,43,81,49],[76,8,76,14],[76,29,76,35],[76,57,76,63],[77,15,77,21],[77,43,77,49],[78,8,78,14],[78,22,78,28],[78,50,78,56],[74,8,74,14],[74,22,74,28],[74,36,74,42],[74,57,74,63],[75,15,75,21],[75,50,75,56],[70,57,70,63],[71,15,71,21],[71,43,71,49],[72,8,72,14],[72,29,72,35],[73,15,73,21],[73,50,73,56],[67,15,67,21],[68,8,68,14],[68,29,68,35],[68,50,68,56],[69,15,69,21],[70,8,70,14],[70,22,70,28],[64,8,64,14],[64,29,64,35],[64,43,64,49],[65,15,65,21],[66,8,66,14],[66,22,66,28],[66,36,66,42],[61,15,61,21],[62,8,62,14],[62,22,62,28],[62,64,62,70],[63,15,63,21],[58,8,58,14],[58,22,58,28],[58,36,58,42],[59,15,59,21],[60,8,60,14],[60,29,60,35],[55,15,55,21],[56,8,56,14],[56,29,56,35],[56,71,56,77],[57,15,57,21],[51,15,51,21],[51,50,51,56],[52,8,52,14],[52,29,52,35],[53,15,53,21],[54,8,54,14],[54,22,54,28],[54,43,54,49],[49,15,49,21],[50,8,50,14],[50,22,50,28],[50,36,50,42],[43,8,43,14],[44,1,44,7],[44,15,44,21],[45,1,45,7],[46,8,46,14],[47,1,47,7],[39,1,39,7],[39,15,39,21],[40,8,40,14],[41,1,41,7],[42,1,42,7],[42,29,42,35],[34,8,34,14],[35,1,35,7],[36,1,36,7],[37,8,37,14],[38,1,38,7],[30,1,30,7],[31,8,31,14],[31,29,31,35],[32,1,32,7],[32,15,32,21],[33,1,33,7],[25,8,25,14],[26,1,26,7],[27,1,27,7],[27,15,27,21],[28,8,28,14],[29,1,29,7],[21,1,21,7],[22,8,22,14],[23,1,23,7],[24,1,24,7],[24,64,24,70],[17,1,17,7],[17,29,17,35],[18,1,18,7],[18,22,18,28],[19,8,19,14],[20,1,20,7],[20,15,20,21],[13,8,13,14],[14,1,14,7],[15,1,15,7],[15,15,15,21],[16,8,16,14],[8,1,8,7],[8,15,8,21],[9,1,9,7],[10,8,10,14],[11,1,11,7],[12,1,12,7],[4,8,4,14],[5,1,5,7],[6,1,6,7],[6,29,6,35],[7,8,7,14],[0,1,0,7],[1,8,1,14],[2,1,2,7],[3,1,3,7],[3,15,3,21],[0,24,2,45]]}
[1,{"$f":"IF(#REF!=2,#REF!,IF(#REF!=3,#REF!,IF(#REF!=4,#REF!,IF(#REF!=5,#REF!))))","v":{"$error":"#REF!"}},null,null,null,null,null,null,null,null,null,null,null,null,null,null,null,null,null,null,null,null,null,null,{"$f":"+KATILIM!A1","v":"TÜRKİYE MASA TENİSİ FEDERASYONU\nYILDIZLAR KUZEYDOĞU BÖLGE YARIŞMALARI"},null,null,null,null,null,null,null,null,null,null,null,null,null,null,null,null,null,null,null,null,null,null,null,null,null,null,null,null,null,null,null,null,null,null,null,null,null,null,null,null,null,null,null,null,null,null,null,null,null,null,null,null,null,null,null,null,null,null,null,null,null,null,null,null,null,null,null,null,null,null,null,null,null,null,null,null,null,null,"1st Round",1]
[null,null,null,{"$f":"CU6","v":0},{"$f":"CV6","v":0},"Y1",null,1,{"$f":"IF(AND(D2=0,E2=0),\"\",IF(D2>E2,B1,B3))","v":""},null,null,null,null,null,null,null,null,null,null,null,null,null,null,null,null,null,null,null,null,null,null,null,null,null,null,null,null,null,null,null,null,null,null,null,null,null,null,null,null,null,null,null,null,null,null,null,null,null,null,null,null,null,null,null,null,null,null,null,null,null,null,null,null,null,null,null,null,null,null,null,null,null,null,null,null,null,null,null,null,null,null,null,null,null,null,null,null,null,null,null,null,null,null,"2sn Round"]
[2,{"$f":"IF(#REF!=2,#REF!,IF(#REF!=3,#REF!,IF(#REF!=4,#REF!,IF(#REF!=5,#REF!))))","v":{"$error":"#REF!"}},null,null,null,null,null,null,null,null,null,null,null,null,17,null,null,null,null,null,null,null,null,null,null,null,null,null,null,null,null,null,null,null,null,null,null,null,null,null,null,null,null,null,null,null,null,null,null,null,null,null,null,null,null,null,null,null,null,null,null,null,null,null,null,null,null,null,null,null,null,null,null,null,null,null,null,null,null,null,null,null,null,null,null,null,null,null,null,null,null,null,null,null,null,null,null,null,null,null,null,null,null,"3th Round"]
[3,{"$f":"IF(#REF!=2,#REF!,IF(#REF!=3,#REF!,IF(#REF!=4,#REF!,IF(#REF!=5,#REF!))))","v":{"$error":"#REF!"}},null,null,null,null,null,null,null,null,{"$f":"CU22","v":0},{"$f":"CV22","v":0},"Y17",null,null,{"$f":"IF(AND(K4=0,L4=0),\"\",IF(K4>L4,I2,I5))","v":""},null,null,null,null,null,null,null,null,{"$f":"KATILIM!AC2&\" \"&KATILIM!AE3","v":"KIZ TAKIM  [01-02 Mart 2025 SİVAS] [ Ana Tablo ]"},null,null,null,null,null,null,null,null,null,null,null,null,null,null,null,null,null,null,null,null,null,null,null,null,null,null,null,null,null,null,null,null,null,null,null,null,null,null,null,null,null,null,null,null,null,null,null,null,null,null,null,null,null,null,null,null,null,null,null,null,null,null,null,null,null,null,null,null,null,null,null,null,null,null,null,null,null,null,"4th Round"]
[null,null,null,{"$f":"CU7","v":0},{"$f":"CV7","v":0},"Y2",null,2,{"$f":"IF(AND(D5=0,E5=0),\"\",IF(D5>E5,B4,B6))","v":""},null,null,null,null,null,null,null,null,null,null,null,null,33,null,null,null,null,null,null,null,null,null,null,null,null,null,null,null,null,null,null,null,null,null,null,null,null,null,null,null,null,null,null,null,null,null,null,null,null,null,null,null,null,null,null,null,null,null,null,null,null,null,null,null,null,null,null,null,null,null,null,null,"#","Date","Time","Table","Competition","Player A","Player B","Set1",null,"Set2",null,"Set3",null,"Set4",null,"Set5",null,"Result",null,null,null,null,"5th Round"]
[4,{"$f":"IF(#REF!=2,#REF!,IF(#REF!=3,#REF!,IF(#REF!=4,#REF!,IF(#REF!=5,#REF!))))","v":{"$error":"#REF!"}},null,null,null,null,null,null,null,null,null,null,null,null,null,null,null,null,null,null,null,null,null,null,null,null,null,null,null,null,null,null,null,null,null,null,null,null,null,null,null,null,null,null,null,null,null,null,null,null,null,null,null,null,null,null,null,null,null,null,null,null,null,null,null,null,null,null,null,null,null,null,null,null,null,null,null,null,null,null,null,1,null,null,null,null,{"$f":"B1","v":{"$error":"#REF!"}},{"$f":"B3","v":{"$error":"#REF!"}},null,null,null,null,null,null,null,null,null,null,null,null,null,null,null,"6th Round"]
[5,{"$f":"IF(#REF!=2,#REF!,IF(#REF!=3,#REF!,IF(#REF!=4,#REF!,IF(#REF!=5,#REF!))))","v":{"$error":"#REF!"}},null,null,null,null,null,null,null,null,null,null,null,null,null,null,null,{"$f":"CU38","v":0},{"$f":"CV38","v":0},"Y25",null,null,null,null,null,null,null,null,null,{"$f":"IF(AND(R7=0,S7=0),\"\",IF(R7>S7,P4,P9))","v":""},null,null,null,null,null,null,null,null,null,null,null,null,null,null,null,null,null,null,null,null,null,null,null,null,null,null,null,null,null,null,null,null,null,null,null,null,null,null,null,null,null,null,null,null,null,null,null,null,null,null,null,2,null,null,null,null,{"$f":"B4","v":{"$error":"#REF!"}},{"$f":"B6","v":{"$error":"#REF!"}},null,null,null,null,null,null,null,null,null,null,null,null,null,null,null,"7th Round"]
[null,null,null,{"$f":"CU8","v":0},{"$f":"CV8","v":0},"Y3",null,3,{"$f":"IF(AND(D8=0,E8=0),\"\",IF(D8>E8,B7,B9))","v":""},null,null,null,null,null,null,null,null,null,null,null,null,null,null,null,null,null,null,null,null,null,null,null,null,null,null,49,null,null,null,null,null,null,null,null,null,null,null,null,null,null,null,null,null,null,null,null,null,null,null,null,null,null,null,null,null,null,null,null,null,null,null,null,null,null,null,null,null,null,null,null,null,3,null,null,null,null,{"$f":"B7","v":{"$error":"#REF!"}},{"$f":"B9","v":{"$error":"#REF!"}},null,null,null,null,null,null,null,null,null,null,null,null,null,null,null,"8th Round"]
[6,{"$f":"IF(#REF!=2,#REF!,IF(#REF!=3,#REF!,IF(#REF!=4,#REF!,IF(#REF!=5,#REF!))))","v":{"$error":"#REF!"}},null,null,null,null,null,null,null,null,null,null,null,null,18,{"$f":"IF(AND(K10=0,L10=0),\"\",IF(K10>L10,I8,I11))","v":""},null,null,null,null,null,null,null,null,null,null,null,null,null,null,null,null,null,null,null,null,null,null,null,null,null,null,null,null,null,null,null,null,null,null,null,null,null,null,null,null,null,null,null,null,null,null,null,null,null,null,null,null,null,null,null,null,null,null,null,null,null,null,null,null,null,4,null,null,null,null,{"$f":"B10","v":{"$error":"#REF!"}},{"$f":"B12","v":{"$error":"#REF!"}},null,null,null,null,null,null,null,null,null,null,null,null,null,null,null,"9th Round"]
[7,{"$f":"IF(#REF!=2,#REF!,IF(#REF!=3,#REF!,IF(#REF!=4,#REF!,IF(#REF!=5,#REF!))))","v":{"$error":"#REF!"}},null,null,null,null,null,null,null,null,{"$f":"CU23","v":0},{"$f":"CV23","v":0},"Y18",null,null,null,null,null,null,null,null,null,null,null,null,null,null,null,null,null,null,null,null,null,null,null,null,null,null,null,null,null,null,null,null,null,null,null,null,null,null,null,null,null,null,null,null,null,null,null,null,null,null,null,null,null,null,null,null,null,null,null,null,null,null,null,null,null,null,null,null,5,null,null,null,null,{"$f":"B13","v":{"$error":"#REF!"}},{"$f":"B15","v":{"$error":"#REF!"}},null,null,null,null,null,null,null,null,null,null,null,null,null,null,null,"10th Round"]
[null,null,null,{"$f":"CU9","v":0},{"$f":"CV9","v":0},"Y4",null,4,{"$f":"IF(AND(D11=0,E11=0),\"\",IF(D11>E11,B10,B12))","v":""},null,null,null,null,null,null,null,null,null,null,null,null,null,null,null,null,null,null,null,null,null,null,null,null,null,null,null,null,null,null,null,null,null,null,null,null,null,null,null,null,null,null,null,null,null,null,null,null,null,null,null,null,null,null,null,null,null,null,null,null,null,null,null,null,null,null,null,null,null,null,null,null,6,null,null,null,null,{"$f":"B16","v":{"$error":"#REF!"}},{"$f":"B18","v":{"$error":"#REF!"}}]
[8,{"$f":"IF(#REF!=2,#REF!,IF(#REF!=3,#REF!,IF(#REF!=4,#REF!,IF(#REF!=5,#REF!))))","v":{"$error":"#REF!"}},null,null,null,null,null,null,null,null,null,null,null,null,null,null,null,null,null,null,null,null,null,null,null,null,null,null,null,null,null,null,null,null,null,null,null,null,null,null,null,null,null,null,null,null,null,null,null,null,null,null,null,null,null,null,null,null,null,null,null,null,null,null,null,null,null,null,null,null,null,null,null,null,null,null,null,null,null,null,null,7,null,null,null,null,{"$f":"B19","v":{"$error":"#REF!"}},{"$f":"B21","v":{"$error":"#REF!"}}]
[9,{"$f":"IF(#REF!=2,#REF!,IF(#REF!=3,#REF!,IF(#REF!=4,#REF!,IF(#REF!=5,#REF!))))","v":{"$error":"#REF!"}},null,null,null,null,null,null,null,null,null,null,null,null,null,null,null,null,null,null,null,null,null,null,null,null,null,null,null,null,null,{"$f":"CU54","v":0},{"$f":"CV54","v":0},"Y29",null,null,null,null,null,null,null,null,null,null,null,null,null,null,null,null,{"$f":"IF(AND(AF13=0,AG13=0),\"\",IF(AF13>AG13,AD7,AD18))","v":""},null,null,null,null,null,null,null,null,null,null,null,null,null,null,null,null,null,null,null,null,null,null,null,null,null,null,null,null,null,null,8,null,null,null,null,{"$f":"B22","v":{"$error":"#REF!"}},{"$f":"B24","v":{"$error":"#REF!"}}]
[null,null,null,{"$f":"CU10","v":0},{"$f":"CV10","v":0},"Y5",null,5,{"$f":"IF(AND(D14=0,E14=0),\"\",IF(D14>E14,B13,B15))","v":""},null,null,null,null,null,null,null,null,null,null,null,null,null,null,null,null,null,null,null,null,null,null,null,null,null,null,null,null,null,null,null,null,null,null,null,null,null,null,null,null,null,null,null,null,null,null,null,68,null,null,null,null,null,null,null,null,null,null,null,null,null,null,null,null,null,null,null,null,null,null,null,null,9,null,null,null,null,{"$f":"B25","v":{"$error":"#REF!"}},{"$f":"B27","v":{"$error":"#REF!"}}]
[10,{"$f":"IF(#REF!=2,#REF!,IF(#REF!=3,#REF!,IF(#REF!=4,#REF!,IF(#REF!=5,#REF!))))","v":{"$error":"#REF!"}},null,null,null,null,null,null,null,null,null,null,null,null,19,null,null,null,null,null,null,null,null,null,null,null,null,null,null,null,null,null,null,null,null,null,null,null,null,null,null,null,null,null,null,null,null,null,null,null,null,null,null,null,null,null,null,null,null,null,null,null,null,null,null,null,null,null,null,null,null,null,null,null,null,null,null,null,null,null,null,10,null,null,null,null,{"$f":"B28","v":{"$error":"#REF!"}},{"$f":"B30","v":{"$error":"#REF!"}}]
[11,{"$f":"IF(#REF!=2,#REF!,IF(#REF!=3,#REF!,IF(#REF!=4,#REF!,IF(#REF!=5,#REF!))))","v":{"$error":"#REF!"}},null,null,null,null,null,null,null,null,{"$f":"CU24","v":0},{"$f":"CV24","v":0},"Y19",null,null,{"$f":"IF(AND(K16=0,L16=0),\"\",IF(K16>L16,I14,I17))","v":""},null,null,null,null,null,null,null,null,null,null,null,null,null,null,null,null,null,null,null,null,null,null,null,null,null,null,null,null,null,null,null,null,null,null,null,null,null,null,null,null,null,null,null,null,null,null,null,null,null,null,null,null,null,null,null,null,null,null,null,null,null,null,null,null,null,11,null,null,null,null,{"$f":"B31","v":{"$error":"#REF!"}},{"$f":"B33","v":{"$error":"#REF!"}}]
[null,null,null,{"$f":"CU11","v":0},{"$f":"CV11","v":0},"Y6",null,6,{"$f":"IF(AND(D17=0,E17=0),\"\",IF(D17>E17,B16,B18))","v":""},null,null,null,null,null,null,null,null,null,null,null,null,34,null,null,null,null,null,null,null,null,null,null,null,null,null,null,null,null,null,null,null,null,null,null,null,null,null,null,null,null,null,null,null,null,null,null,null,null,null,null,null,null,null,null,null,null,null,null,null,null,null,null,null,null,null,null,null,null,null,null,null,12,null,null,null,null,{"$f":"B34","v":{"$error":"#REF!"}},{"$f":"B36","v":{"$error":"#REF!"}}]
[12,{"$f":"IF(#REF!=2,#REF!,IF(#REF!=3,#REF!,IF(#REF!=4,#REF!,IF(#REF!=5,#REF!))))","v":{"$error":"#REF!"}},null,null,null,null,null,null,null,null,null,null,null,null,null,null,null,null,null,null,null,null,null,null,null,null,null,null,null,{"$f":"IF(AND(R19=0,S19=0),\"\",IF(R19>S19,P16,P21))","v":""},null,null,null,null,null,null,null,null,null,null,null,null,null,null,null,null,null,null,null,null,null,null,null,null,null,null,null,null,null,null,null,null,null,null,null,null,null,null,null,null,null,null,null,null,null,null,null,null,null,null,null,13,null,null,null,null,{"$f":"B37","v":{"$error":"#REF!"}},{"$f":"B39","v":{"$error":"#REF!"}}]
[13,{"$f":"IF(#REF!=2,#REF!,IF(#REF!=3,#REF!,IF(#REF!=4,#REF!,IF(#REF!=5,#REF!))))","v":{"$error":"#REF!"}},null,null,null,null,null,null,null,null,null,null,null,null,null,null,null,{"$f":"CU39","v":0},{"$f":"CV39","v":0},"Y26",null,null,null,null,null,null,null,null,null,null,null,null,null,null,null,null,null,null,null,null,null,null,null,null,null,null,null,null,null,null,null,null,null,null,null,null,null,null,null,null,null,null,null,null,null,null,null,null,null,null,null,null,null,null,null,null,null,null,null,null,null,14,null,null,null,null,{"$f":"B40","v":{"$error":"#REF!"}},{"$f":"B42","v":{"$error":"#REF!"}}]
[null,null,null,{"$f":"CU12","v":0},{"$f":"CV12","v":0},"Y7",null,7,{"$f":"IF(AND(D20=0,E20=0),\"\",IF(D20>E20,B19,B21))","v":""},null,null,null,null,null,null,null,null,null,null,null,null,null,null,null,null,null,null,null,null,null,null,null,null,null,null,null,null,null,null,null,null,null,null,null,null,null,null,null,null,null,null,null,null,null,null,null,null,null,null,null,null,null,null,null,null,null,null,null,null,null,null,null,null,null,null,null,null,null,null,null,null,15,null,null,null,null,{"$f":"B43","v":{"$error":"#REF!"}},{"$f":"B45","v":{"$error":"#REF!"}}]
[14,{"$f":"IF(#REF!=2,#REF!,IF(#REF!=3,#REF!,IF(#REF!=4,#REF!,IF(#REF!=5,#REF!))))","v":{"$error":"#REF!"}},null,null,null,null,null,null,null,null,null,null,null,null,20,{"$f":"IF(AND(K22=0,L22=0),\"\",IF(K22>L22,I20,I23))","v":""},null,null,null,null,null,null,null,null,null,null,null,null,null,null,null,null,null,null,null,null,null,null,null,null,null,null,null,null,null,null,null,null,null,null,null,null,null,null,null,null,null,null,null,null,null,null,null,null,null,null,null,null,null,null,null,null,null,null,null,null,null,null,null,null,null,16,null,null,null,null,{"$f":"B46","v":{"$error":"#REF!"}},{"$f":"B48","v":{"$error":"#REF!"}}]
[15,{"$f":"IF(#REF!=2,#REF!,IF(#REF!=3,#REF!,IF(#REF!=4,#REF!,IF(#REF!=5,#REF!))))","v":{"$error":"#REF!"}},null,null,null,null,null,null,null,null,{"$f":"CU25","v":0},{"$f":"CV25","v":0},"Y20",null,null,null,null,null,null,null,null,null,null,null,null,null,null,null,null,null,null,null,null,null,null,null,null,null,null,null,null,null,null,null,null,null,null,null,null,null,null,null,null,null,null,null,null,null,null,null,null,null,null,null,null,null,null,null,null,null,null,null,null,null,null,null,null,null,null,null,null,17,null,null,null,null,{"$f":"I2","v":""},{"$f":"I5","v":""}]
[null,null,null,{"$f":"CU13","v":0},{"$f":"CV13","v":0},"Y8",null,8,{"$f":"IF(AND(D23=0,E23=0),\"\",IF(D23>E23,B22,B24))","v":""},null,null,null,null,null,null,null,null,null,null,null,null,null,null,null,null,null,null,null,null,null,null,null,null,null,null,null,null,null,null,null,null,null,null,null,null,null,null,null,null,null,null,null,null,null,null,null,null,null,null,null,null,null,null,null,null,null,null,null,null,null,null,null,null,null,null,null,null,null,null,null,null,18,null,null,null,null,{"$f":"I8","v":""},{"$f":"I11","v":""}]
[16,{"$f":"IF(#REF!=2,#REF!,IF(#REF!=3,#REF!,IF(#REF!=4,#REF!,IF(#REF!=5,#REF!))))","v":{"$error":"#REF!"}},null,null,null,null,null,null,null,null,null,null,null,null,null,null,null,null,null,null,null,null,null,null,null,null,null,null,null,null,null,null,null,null,null,null,null,null,null,null,null,null,null,null,null,null,null,null,null,null,null,null,null,null,null,null,null,null,null,null,null,null,null,null,null,null,null,null,null,null,null,null,null,null,null,null,null,null,null,null,null,19,null,null,null,null,{"$f":"I14","v":""},{"$f":"I17","v":""}]
[17,{"$f":"IF(#REF!=2,#REF!,IF(#REF!=3,#REF!,IF(#REF!=4,#REF!,IF(#REF!=5,#REF!))))","v":{"$error":"#REF!"}},null,null,null,null,null,null,null,null,null,null,null,null,null,{"$f":"IF(AND(K22=0,L22=0),\"\",IF(K22<L22,I20,I23))","v":""},null,null,null,null,null,null,null,null,null,null,null,null,null,null,null,null,null,null,null,null,null,null,null,null,null,null,null,null,null,null,null,null,null,null,null,null,{"$f":"CU73","v":0},{"$f":"CV73","v":0},"Y31",null,null,null,null,null,null,null,null,null,{"$f":"IF(AND(BA25=0,BB25=0),\"\",IF(BA25>BB25,AY13,AY38))","v":""},null,null,null,null,null,null,null,null,null,null,null,null,null,null,null,null,20,null,null,null,null,{"$f":"I20","v":""},{"$f":"I23","v":""}]
[null,null,null,{"$f":"CU14","v":0},{"$f":"CV14","v":0},"Y9",null,9,{"$f":"IF(AND(D26=0,E26=0),\"\",IF(D26>E26,B25,B27))","v":""},null,null,null,null,null,null,null,null,null,null,null,null,null,null,null,null,null,null,null,null,null,null,null,null,null,null,null,null,null,null,null,null,null,null,null,null,null,null,null,null,null,null,null,null,null,null,null,null,null,null,null,null,null,null,null,null,null,null,null,null,null,72,null,null,null,null,null,null,null,null,null,null,21,null,null,null,null,{"$f":"I26","v":""},{"$f":"I29","v":""}]
[18,{"$f":"IF(#REF!=2,#REF!,IF(#REF!=3,#REF!,IF(#REF!=4,#REF!,IF(#REF!=5,#REF!))))","v":{"$error":"#REF!"}},null,null,null,null,null,null,null,null,null,null,null,null,21,null,null,null,null,null,null,null,null,null,null,null,null,null,null,null,null,null,null,null,null,null,null,null,null,null,null,null,null,null,null,null,null,null,null,null,null,null,null,null,null,null,null,null,null,null,null,null,null,null,null,null,null,null,null,null,null,null,null,null,null,null,null,null,null,null,null,22,null,null,null,null,{"$f":"I32","v":""},{"$f":"I35","v":""}]
[19,{"$f":"IF(#REF!=2,#REF!,IF(#REF!=3,#REF!,IF(#REF!=4,#REF!,IF(#REF!=5,#REF!))))","v":{"$error":"#REF!"}},null,null,null,null,null,null,null,null,{"$f":"CU26","v":0},{"$f":"CV26","v":0},"Y21",null,null,{"$f":"IF(AND(K28=0,L28=0),\"\",IF(K28>L28,I26,I29))","v":""},null,null,null,null,null,null,null,null,null,null,null,null,null,null,null,null,null,null,null,null,null,null,null,null,null,null,null,null,null,null,null,null,null,null,null,null,null,null,null,null,null,null,null,null,null,null,null,null,null,null,null,null,null,null,null,null,null,null,null,null,null,null,null,null,null,23,null,null,null,null,{"$f":"I38","v":""},{"$f":"I41","v":""}]
[null,null,null,{"$f":"CU15","v":0},{"$f":"CV15","v":0},"Y10",null,10,{"$f":"IF(AND(D29=0,E29=0),\"\",IF(D29>E29,B28,B30))","v":""},null,null,null,null,null,null,null,null,null,null,null,null,35,null,null,null,null,null,null,null,null,null,null,null,null,null,null,null,null,null,null,null,null,null,null,null,null,null,null,null,null,null,null,null,null,null,null,null,null,null,null,null,null,null,null,null,null,null,null,null,null,null,null,null,null,null,null,null,null,null,null,null,24,null,null,null,null,{"$f":"I44","v":""},{"$f":"I47","v":""}]
[20,{"$f":"IF(#REF!=2,#REF!,IF(#REF!=3,#REF!,IF(#REF!=4,#REF!,IF(#REF!=5,#REF!))))","v":{"$error":"#REF!"}},null,null,null,null,null,null,null,null,null,null,null,null,null,null,null,null,null,null,null,null,null,null,null,null,null,null,null,null,null,null,null,null,null,null,null,null,null,null,null,null,null,null,null,null,null,null,null,null,null,null,null,null,null,null,null,null,null,null,null,null,null,null,null,null,null,null,null,null,null,null,null,null,null,null,null,null,null,null,null,25,null,null,null,null,{"$f":"I51","v":""},{"$f":"I53","v":""}]
[21,{"$f":"IF(#REF!=2,#REF!,IF(#REF!=3,#REF!,IF(#REF!=4,#REF!,IF(#REF!=5,#REF!))))","v":{"$error":"#REF!"}},null,null,null,null,null,null,null,null,null,null,null,null,null,null,null,{"$f":"CU40","v":0},{"$f":"CV40","v":0},"Y27",null,null,null,null,null,null,null,null,null,null,null,null,null,null,null,null,null,null,null,null,null,null,null,null,null,null,null,null,null,null,null,null,null,null,null,null,null,null,null,null,null,null,null,null,null,null,null,null,null,null,null,null,null,null,null,null,null,null,null,null,null,26,null,null,null,null,{"$f":"I55","v":""},{"$f":"I57","v":""}]
[null,null,null,{"$f":"CU16","v":0},{"$f":"CV16","v":0},"Y11",null,11,{"$f":"IF(AND(D32=0,E32=0),\"\",IF(D32>E32,B31,B33))","v":""},null,null,null,null,null,null,null,null,null,null,null,null,null,null,null,null,null,null,null,null,{"$f":"IF(AND(R31=0,S31=0),\"\",IF(R31>S31,P28,P33))","v":""},null,null,null,null,null,null,null,null,null,null,null,null,null,null,null,null,null,null,null,null,null,null,null,null,null,null,null,null,null,null,null,null,null,null,null,null,null,null,null,null,null,null,null,null,null,null,null,null,null,null,null,27,null,null,null,null,{"$f":"I59","v":""},{"$f":"I61","v":""}]
[22,{"$f":"IF(#REF!=2,#REF!,IF(#REF!=3,#REF!,IF(#REF!=4,#REF!,IF(#REF!=5,#REF!))))","v":{"$error":"#REF!"}},null,null,null,null,null,null,null,null,null,null,null,null,22,{"$f":"IF(AND(K34=0,L34=0),\"\",IF(K34>L34,I32,I35))","v":""},null,null,null,null,null,null,null,null,null,null,null,null,null,null,null,null,null,null,null,50,null,null,null,null,null,null,null,null,null,null,null,null,null,null,null,null,null,null,null,null,null,null,null,null,null,null,null,null,null,null,null,null,null,null,null,null,null,null,null,null,null,null,null,null,null,28,null,null,null,null,{"$f":"I63","v":""},{"$f":"I65","v":""}]
[23,{"$f":"IF(#REF!=2,#REF!,IF(#REF!=3,#REF!,IF(#REF!=4,#REF!,IF(#REF!=5,#REF!))))","v":{"$error":"#REF!"}},null,null,null,null,null,null,null,null,{"$f":"CU27","v":0},{"$f":"CV27","v":0},"Y22",null,null,null,null,null,null,null,null,null,null,null,null,null,null,null,null,null,null,null,null,null,null,null,null,null,null,null,null,null,null,null,null,null,null,null,null,null,null,null,null,null,null,null,null,null,null,null,null,null,null,null,null,null,null,null,null,null,null,null,null,null,null,null,null,null,null,null,null,29,null,null,null,null,{"$f":"I67","v":""},{"$f":"I69","v":""}]
[null,null,null,{"$f":"CU17","v":0},{"$f":"CV17","v":0},"Y12",null,12,{"$f":"IF(AND(D35=0,E35=0),\"\",IF(D35>E35,B34,B36))","v":""},null,null,null,null,null,null,null,null,null,null,null,null,null,null,null,null,null,null,null,null,null,null,null,null,null,null,null,null,null,null,null,null,null,null,null,null,null,null,null,null,null,null,null,null,null,null,null,null,null,null,null,null,null,null,null,null,null,null,null,null,null,null,null,null,null,null,null,null,null,null,null,null,30,null,null,null,null,{"$f":"I71","v":""},{"$f":"I73","v":""}]
[24,{"$f":"IF(#REF!=2,#REF!,IF(#REF!=3,#REF!,IF(#REF!=4,#REF!,IF(#REF!=5,#REF!))))","v":{"$error":"#REF!"}},null,null,null,null,null,null,null,null,null,null,null,null,null,null,null,null,null,null,null,null,null,null,null,null,null,null,null,null,null,null,null,null,null,null,null,null,null,null,null,null,null,null,null,null,null,null,null,null,null,null,null,null,null,null,null,null,null,null,null,null,null,null,null,null,null,null,null,null,null,null,null,null,null,null,null,null,null,null,null,31,null,null,null,null,{"$f":"I75","v":""},{"$f":"I77","v":""}]
[25,{"$f":"IF(#REF!=2,#REF!,IF(#REF!=3,#REF!,IF(#REF!=4,#REF!,IF(#REF!=5,#REF!))))","v":{"$error":"#REF!"}},null,null,null,null,null,null,null,null,null,null,null,null,null,null,null,null,null,null,null,null,null,null,null,null,null,null,null,null,null,null,null,null,null,null,null,null,null,null,null,null,null,null,null,null,null,null,null,null,null,null,null,null,null,null,null,null,null,null,null,null,null,null,null,null,null,null,null,null,null,null,null,null,null,null,null,null,null,null,null,32,null,null,null,null,{"$f":"I79","v":""},{"$f":"I81","v":""}]
[null,null,null,{"$f":"CU18","v":0},{"$f":"CV18","v":0},"Y13",null,13,{"$f":"IF(AND(D38=0,E38=0),\"\",IF(D38>E38,B37,B39))","v":""},null,null,null,null,null,null,null,null,null,null,null,null,null,null,null,null,null,null,null,null,null,null,{"$f":"CU55","v":0},{"$f":"CV55","v":0},"Y30",null,null,null,null,null,null,null,null,null,null,null,null,null,null,null,null,{"$f":"IF(AND(AF38=0,AG38=0),\"\",IF(AF38>AG38,AD32,AD43))","v":""},null,null,null,null,null,null,null,null,null,null,null,null,null,null,null,null,null,null,null,null,null,null,null,null,null,null,null,null,null,null,33,null,null,null,null,{"$f":"P4","v":""},{"$f":"P9","v":""}]
[26,{"$f":"IF(#REF!=2,#REF!,IF(#REF!=3,#REF!,IF(#REF!=4,#REF!,IF(#REF!=5,#REF!))))","v":{"$error":"#REF!"}},null,null,null,null,null,null,null,null,null,null,null,null,23,null,null,null,null,null,null,null,null,null,null,null,null,null,null,null,null,null,null,null,null,null,null,null,null,null,null,null,null,null,null,null,null,null,null,null,null,null,null,null,null,null,null,null,null,null,null,null,null,null,null,null,{"$f":"CU77","v":0},{"$f":"CV77","v":0},"Y32",null,null,{"$f":"IF(AND(BO39=0,BP39=0),\"\",IF(BO39>BP39,BM25,BM55))","v":""},null,null,null,null,null,null,"1.",null,null,34,null,null,null,null,{"$f":"P16","v":""},{"$f":"P21","v":""}]
[27,{"$f":"IF(#REF!=2,#REF!,IF(#REF!=3,#REF!,IF(#REF!=4,#REF!,IF(#REF!=5,#REF!))))","v":{"$error":"#REF!"}},null,null,null,null,null,null,null,null,{"$f":"CU28","v":0},{"$f":"CV28","v":0},"Y23",null,null,{"$f":"IF(AND(K40=0,L40=0),\"\",IF(K40>L40,I38,I41))","v":""},null,null,null,null,null,null,null,null,null,null,null,null,null,null,null,null,null,null,null,null,null,null,null,null,null,null,null,null,null,null,null,null,null,null,null,null,null,null,null,null,null,null,null,null,null,null,null,null,null,null,null,null,null,null,null,null,null,null,null,null,null,null,null,null,null,35,null,null,null,null,{"$f":"P28","v":""},{"$f":"P33","v":""}]
[null,null,null,{"$f":"CU19","v":0},{"$f":"CV19","v":0},"Y14",null,14,{"$f":"IF(AND(D41=0,E41=0),\"\",IF(D41>E41,B40,B42))","v":""},null,null,null,null,null,null,null,null,null,null,null,null,36,null,null,null,null,null,null,null,null,null,null,null,null,null,null,null,null,null,null,null,null,null,null,null,null,null,null,null,null,null,null,null,null,null,null,null,null,null,null,null,null,null,null,null,null,null,null,null,null,null,null,null,null,null,null,null,null,null,null,null,36,null,null,null,null,{"$f":"P40","v":""},{"$f":"P45","v":""}]
[28,{"$f":"IF(#REF!=2,#REF!,IF(#REF!=3,#REF!,IF(#REF!=4,#REF!,IF(#REF!=5,#REF!))))","v":{"$error":"#REF!"}},null,null,null,null,null,null,null,null,null,null,null,null,null,null,null,null,null,null,null,null,null,null,null,null,null,null,null,null,null,null,null,null,null,null,null,null,null,null,null,null,null,null,null,null,null,null,null,null,null,null,null,null,null,null,null,null,null,null,null,null,null,null,null,null,null,null,null,null,null,null,null,null,null,null,null,null,null,null,null,37,null,null,null,null,{"$f":"P50","v":""},{"$f":"P52","v":""}]
[29,{"$f":"IF(#REF!=2,#REF!,IF(#REF!=3,#REF!,IF(#REF!=4,#REF!,IF(#REF!=5,#REF!))))","v":{"$error":"#REF!"}},null,null,null,null,null,null,null,null,null,null,null,null,null,null,null,{"$f":"CU41","v":0},{"$f":"CV41","v":0},"Y28",null,null,null,null,null,null,null,null,null,{"$f":"IF(AND(R43=0,S43=0),\"\",IF(R43>S43,P40,P45))","v":""},null,null,null,null,null,null,null,null,null,null,null,null,null,null,null,null,null,null,null,null,null,null,null,null,null,null,null,null,null,null,null,null,null,null,null,null,null,null,null,null,null,null,null,null,null,null,null,null,null,null,null,38,null,null,null,null,{"$f":"P54","v":""},{"$f":"P56","v":""}]
[null,null,null,{"$f":"CU20","v":0},{"$f":"CV20","v":0},"Y15",null,15,{"$f":"IF(AND(D44=0,E44=0),\"\",IF(D44>E44,B43,B45))","v":""},null,null,null,null,null,null,null,null,null,null,null,null,null,null,null,null,null,null,null,null,null,null,null,null,null,null,null,null,null,null,null,null,null,null,null,null,null,null,null,null,null,null,null,null,null,null,null,null,null,null,null,null,null,null,null,null,null,null,null,null,null,null,null,null,null,null,null,null,null,null,null,null,39,null,null,null,null,{"$f":"P58","v":""},{"$f":"P60","v":""}]
[30,{"$f":"IF(#REF!=2,#REF!,IF(#REF!=3,#REF!,IF(#REF!=4,#REF!,IF(#REF!=5,#REF!))))","v":{"$error":"#REF!"}},null,null,null,null,null,null,null,null,null,null,null,null,24,{"$f":"IF(AND(K46=0,L46=0),\"\",IF(K46>L46,I44,I47))","v":""},null,null,null,null,null,null,null,null,null,null,null,null,null,null,null,null,null,null,null,null,null,null,null,null,null,null,null,null,null,null,null,null,null,null,null,null,null,null,null,null,null,null,null,null,null,null,null,null,null,null,null,null,null,null,null,null,null,null,null,null,null,null,null,null,null,40,null,null,null,null,{"$f":"P62","v":""},{"$f":"P64","v":""}]
[31,{"$f":"IF(#REF!=2,#REF!,IF(#REF!=3,#REF!,IF(#REF!=4,#REF!,IF(#REF!=5,#REF!))))","v":{"$error":"#REF!"}},null,null,null,null,null,null,null,null,{"$f":"CU29","v":0},{"$f":"CV29","v":0},"Y24",null,null,null,null,null,null,null,null,null,null,null,null,null,null,null,null,null,null,null,null,null,null,null,null,null,null,null,null,null,null,null,null,null,null,null,null,null,null,null,null,null,null,null,null,null,null,null,null,null,null,null,null,null,null,null,null,null,null,null,null,null,null,null,null,null,null,null,null,41,null,null,null,null,{"$f":"P66","v":""},{"$f":"P68","v":""}]
[null,null,null,{"$f":"CU21","v":0},{"$f":"CV21","v":0},"Y16",null,16,{"$f":"IF(AND(D47=0,E47=0),\"\",IF(D47>E47,B46,B48))","v":""},null,null,null,null,null,null,null,null,null,null,null,null,null,null,null,null,null,null,null,null,null,null,null,null,null,null,null,null,null,null,null,null,null,null,null,null,null,null,null,null,null,null,null,null,null,null,null,null,null,null,null,null,null,null,null,null,null,null,null,null,null,null,null,null,null,null,null,null,null,null,null,null,42,null,null,null,null,{"$f":"P70","v":""},{"$f":"P72","v":""}]
[32,{"$f":"IF(#REF!=2,#REF!,IF(#REF!=3,#REF!,IF(#REF!=4,#REF!,IF(#REF!=5,#REF!))))","v":{"$error":"#REF!"}},null,null,null,null,null,null,null,null,null,null,null,null,null,null,null,null,null,null,null,null,null,null,null,null,null,null,null,null,null,null,null,null,null,null,null,null,null,null,null,null,null,null,null,null,null,null,null,null,null,null,null,null,null,null,null,null,null,null,null,null,null,null,null,null,null,null,null,null,null,null,null,null,null,null,null,null,null,null,null,43,null,null,null,null,{"$f":"P74","v":""},{"$f":"P76","v":""}]
[null,null,null,null,null,null,null,null,null,null,null,null,null,null,null,null,null,null,null,null,null,null,null,null,null,null,null,null,"Y25",{"$f":"IF(AND(R7=0,S7=0),\"\",IF(R7<S7,P4,P9))","v":""},null,null,null,null,null,null,null,null,null,null,null,null,"Y30",{"$f":"IF(AND(AF38=0,AG38=0),\"\",IF(AF38<AG38,AD32,AD43))","v":""},null,null,null,null,null,null,null,null,null,null,null,null,"Y31",{"$f":"IF(AND(BA25=0,BB25=0),\"\",IF(BA25<BB25,AY13,AY38))","v":""},null,null,null,null,null,null,null,null,null,null,null,null,null,null,null,null,null,null,null,null,null,null,null,44,null,null,null,null,{"$f":"P78","v":""},{"$f":"P80","v":""}]
[null,null,null,null,null,null,null,null,null,null,null,null,null,null,"Y24",{"$f":"IF(AND(K46=0,L46=0),\"\",IF(K46<L46,I44,I47))","v":""},null,null,null,null,null,null,null,null,null,null,null,null,null,null,null,null,null,null,null,51,null,null,null,null,null,null,null,null,null,null,null,null,null,63,null,null,null,null,null,null,null,null,null,null,null,null,null,71,null,null,null,null,null,null,null,null,null,null,null,null,null,null,null,null,null,45,null,null,null,null,{"$f":"W51","v":""},{"$f":"W55","v":""}]
[null,null,null,null,null,null,null,"Y1",{"$f":"IF(AND(D2=0,E2=0),\"\",IF(D2<E2,B1,B3))","v":""},null,null,null,null,null,null,null,null,{"$f":"CU42","v":0},{"$f":"CV42","v":0},"YE",null,37,{"$f":"IF(AND(R51=0,S51=0),\"\",IF(R51>S51,P50,P52))","v":""},null,null,null,null,null,null,null,null,{"$f":"CU56","v":0},{"$f":"CV56","v":0},"Y37",null,null,{"$f":"IF(AND(AF51=0,AG51=0),\"\",IF(AF51>AG51,AD49,AD53))","v":""},null,null,null,null,null,null,null,null,null,null,null,null,null,null,null,null,null,null,null,null,null,null,null,null,null,null,null,null,null,null,null,null,null,null,null,null,null,null,null,null,null,null,null,null,46,null,null,null,null,{"$f":"W59","v":""},{"$f":"W63","v":""}]
[null,null,null,null,null,null,null,null,null,null,{"$f":"CU30","v":0},{"$f":"CV30","v":0},"Y.Elenir",null,25,{"$f":"IF(AND(K52=0,L52=0),\"\",IF(K52>L52,I51,I53))","v":""},null,null,null,null,null,null,null,null,null,null,null,null,45,null,null,null,null,null,null,null,null,null,null,null,null,null,57,null,null,null,null,null,null,null,{"$f":"IF(AND(AT53=0,AU53=0),\"\",IF(AT53>AU53,AR49,AR55))","v":""},null,null,null,null,null,null,null,null,null,null,null,null,null,null,null,null,null,null,null,null,null,null,null,null,null,null,null,null,null,null,47,null,null,null,null,{"$f":"W67","v":""},{"$f":"W71","v":""}]
[null,null,null,null,null,null,null,"Y2",{"$f":"IF(AND(D5=0,E5=0),\"\",IF(D5<E5,B4,B6))","v":""},null,null,null,null,null,null,null,null,null,null,null,null,null,null,null,null,{"$f":"CU50","v":0},{"$f":"CV50","v":0},"Y33",null,{"$f":"IF(AND(Z53=0,AA53=0),\"\",IF(Z53>AA53,W51,W55))","v":""},null,null,null,null,null,null,null,null,null,null,null,null,null,null,null,{"$f":"CU68","v":0},{"$f":"CV68","v":0},"Y43",null,null,null,null,null,null,null,null,69,null,null,null,null,null,null,null,null,null,null,null,null,null,null,null,null,null,null,null,null,null,null,null,null,48,null,null,null,null,{"$f":"W75","v":""},{"$f":"W79","v":""}]
[null,null,null,null,null,null,null,null,null,null,null,null,null,null,"Y23",{"$f":"IF(AND(K40=0,L40=0),\"\",IF(K40<L40,I38,I41))","v":""},null,null,null,null,null,null,null,null,null,null,null,null,null,null,null,null,null,null,null,null,null,null,null,null,null,null,null,null,null,null,null,null,null,null,null,null,null,null,null,null,null,null,null,null,null,null,null,null,null,null,null,null,null,null,null,null,null,null,null,null,null,null,null,null,null,49,null,null,null,null,{"$f":"AD7","v":""},{"$f":"AD18","v":""}]
[null,null,null,null,null,null,null,"Y3",{"$f":"IF(AND(D8=0,E8=0),\"\",IF(D8<E8,B7,B9))","v":""},null,null,null,null,null,null,null,null,{"$f":"CU43","v":0},{"$f":"CV43","v":0},"YE",null,38,{"$f":"IF(AND(R55=0,S55=0),\"\",IF(R55>S55,P54,P56))","v":""},null,null,null,null,null,null,null,null,null,null,null,null,null,null,null,null,null,null,null,null,{"$f":"IF(AND(AM56=0,AN56=0),\"\",IF(AM56>AN56,AK51,AK59))","v":""},null,null,null,null,null,null,null,null,null,null,null,null,null,null,null,null,{"$f":"CU76","v":0},{"$f":"CV76","v":0},"Y46",null,{"$f":"IF(AND(BI55=0,BJ55=0),\"\",IF(BI55>BJ55,BF49,BF61))","v":""},null,null,null,null,null,null,null,null,null,null,null,null,null,null,null,null,50,null,null,null,null,{"$f":"AD32","v":""},{"$f":"AD43","v":""}]
[null,null,null,null,null,null,null,null,null,null,{"$f":"CU31","v":0},{"$f":"CV31","v":0},"YE",null,26,{"$f":"IF(AND(K56=0,L56=0),\"\",IF(K56>L56,I55,I57))","v":""},null,null,null,null,null,null,null,null,null,null,null,null,null,null,null,null,null,null,null,null,null,null,{"$f":"CU62","v":0},{"$f":"CV62","v":0},"Y41",null,null,null,null,null,null,null,null,null,null,null,null,null,null,null,null,null,null,null,null,null,null,null,null,null,null,null,null,null,null,null,null,null,null,null,null,null,null,null,null,51,null,null,null,null,{"$f":"AD49","v":""},{"$f":"AD53","v":""}]
[null,null,null,null,null,null,null,"Y4",{"$f":"IF(AND(D11=0,E11=0),\"\",IF(D11<E11,B10,B12))","v":""},null,null,null,null,null,null,null,null,null,null,null,null,null,null,null,null,null,null,null,"Y26",{"$f":"IF(AND(R19=0,S19=0),\"\",IF(R19<S19,P16,P21))","v":""},null,null,null,null,null,null,null,null,null,null,null,null,null,null,null,null,null,null,null,null,null,null,null,null,null,null,null,null,null,null,null,null,null,null,null,null,null,null,null,null,"Y32",{"$f":"IF(AND(BO39=0,BP39=0),\"\",IF(BO39<BP39,BM25,BM55))","v":""},null,null,null,null,null,null,"2.",null,null,52,null,null,null,null,{"$f":"AD57","v":""},{"$f":"AD61","v":""}]
[null,null,null,null,null,null,null,null,null,null,null,null,null,null,"Y22",{"$f":"IF(AND(K34=0,L34=0),\"\",IF(K34<L34,I32,I35))","v":""},null,null,null,null,null,null,null,null,null,null,null,null,null,null,null,null,null,null,null,52,null,null,null,null,null,null,null,null,null,null,null,null,null,null,null,null,null,null,null,null,null,null,null,null,null,null,null,null,null,null,null,null,null,null,null,null,null,null,null,null,null,null,null,null,null,53,null,null,null,null,{"$f":"AD65","v":""},{"$f":"AD69","v":""}]
[null,null,null,null,null,null,null,"Y5",{"$f":"IF(AND(D14=0,E14=0),\"\",IF(D14<E14,B13,B15))","v":""},null,null,null,null,null,null,null,null,{"$f":"CU44","v":0},{"$f":"CV44","v":0},"YE",null,39,{"$f":"IF(AND(R59=0,S59=0),\"\",IF(R59>S59,P58,P60))","v":""},null,null,null,null,null,null,null,null,{"$f":"CU57","v":0},{"$f":"CV57","v":0},"Y38",null,null,{"$f":"IF(AND(AF59=0,AG59=0),\"\",IF(AF59>AG59,AD57,AD61))","v":""},null,null,null,null,null,null,null,null,null,null,null,null,null,null,null,null,null,null,null,null,null,null,null,null,null,null,null,null,null,null,null,null,null,null,null,null,null,null,null,null,null,null,null,null,54,null,null,null,null,{"$f":"AD73","v":""},{"$f":"AD77","v":""}]
[null,null,null,null,null,null,null,null,null,null,{"$f":"CU32","v":0},{"$f":"CV32","v":0},"YE",null,27,{"$f":"IF(AND(K60=0,L60=0),\"\",IF(K60>L60,I59,I61))","v":""},null,null,null,null,null,null,null,null,null,null,null,null,46,null,null,null,null,null,null,null,null,null,null,null,null,null,null,null,null,null,null,null,null,null,null,null,null,null,null,null,null,null,null,null,null,null,null,null,null,null,null,null,null,null,null,null,null,null,null,null,null,null,null,null,null,55,null,null,null,null,{"$f":"AD89","v":""},{"$f":"AD91","v":""}]
[null,null,null,null,null,null,null,"Y6",{"$f":"IF(AND(D17=0,E17=0),\"\",IF(D17<E17,B16,B18))","v":""},null,null,null,null,null,null,null,null,null,null,null,null,null,null,null,null,{"$f":"CU51","v":0},{"$f":"CV51","v":0},"Y34",null,{"$f":"IF(AND(Z61=0,AA61=0),\"\",IF(Z61>AA61,W59,W63))","v":""},null,null,null,null,null,null,null,null,null,null,null,null,null,null,null,null,null,null,null,null,null,null,{"$f":"CU74","v":0},{"$f":"CV74","v":0},"Y45",null,null,{"$f":"IF(AND(BA61=0,BB61=0),\"\",IF(BA61>BB61,AY52,AY69))","v":""},null,null,null,null,null,null,null,null,null,null,null,null,null,null,null,null,null,null,null,null,null,null,null,56,null,null,null,null,{"$f":"AD92","v":""},{"$f":"AD94","v":""}]
[null,null,null,null,null,null,null,null,null,null,null,null,null,null,"Y21",{"$f":"IF(AND(K28=0,L28=0),\"\",IF(K28<L28,I26,I29))","v":""},null,null,null,null,null,null,null,null,null,null,null,null,null,null,null,null,null,null,null,null,null,null,null,null,null,null,null,null,null,null,null,null,null,null,null,null,null,null,null,null,null,null,null,null,null,null,null,null,null,null,null,null,null,null,null,null,null,null,null,null,null,null,null,null,null,57,null,null,null,null,{"$f":"AK51","v":""},{"$f":"AK59","v":""}]
[null,null,null,null,null,null,null,"Y7",{"$f":"IF(AND(D20=0,E20=0),\"\",IF(D20<E20,B19,B21))","v":""},null,null,null,null,null,null,null,null,{"$f":"CU45","v":0},{"$f":"CV45","v":0},"YE",null,40,{"$f":"IF(AND(R63=0,S63=0),\"\",IF(R63>S63,P62,P64))","v":""},null,null,null,null,null,null,null,null,null,null,null,null,null,null,null,null,null,null,null,null,null,null,null,null,null,null,null,null,null,null,null,null,null,null,null,null,null,null,null,null,"Y46",{"$f":"IF(AND(BI55=0,BJ55=0),\"\",IF(BI55<BJ55,BF49,BF61))","v":""},null,null,null,null,null,null,"3.",null,null,null,null,null,null,null,null,null,58,null,null,null,null,{"$f":"AK67","v":""},{"$f":"AK75","v":""}]
[null,null,null,null,null,null,null,null,null,null,{"$f":"CU33","v":0},{"$f":"CV33","v":0},"YE",null,28,{"$f":"IF(AND(K64=0,L64=0),\"\",IF(K64>L64,I63,I65))","v":""},null,null,null,null,null,null,null,null,null,null,null,null,null,null,null,null,null,null,null,null,null,null,null,null,null,null,null,null,null,null,null,null,null,null,null,null,null,null,null,null,null,null,null,null,null,null,null,null,null,null,null,null,null,null,null,null,null,null,null,null,null,null,null,null,null,59,null,null,null,null,{"$f":"AK81","v":""},{"$f":"AK83","v":""}]
[null,null,null,null,null,null,null,"Y8",{"$f":"IF(AND(D23=0,E23=0),\"\",IF(D23<E23,B22,B24))","v":""},null,null,null,null,null,null,null,null,null,null,null,null,null,null,null,null,null,null,null,"Y27",{"$f":"IF(AND(R31=0,S31=0),\"\",IF(R31<S31,P28,P33))","v":""},null,null,null,null,null,null,null,null,null,null,null,null,"Y29",{"$f":"IF(AND(AF13=0,AG13=0),\"\",IF(AF13<AG13,AD7,AD18))","v":""},null,null,null,null,null,null,null,null,null,null,null,null,null,null,null,null,null,null,null,null,null,null,null,null,null,null,null,null,null,null,null,null,null,null,null,null,null,60,null,null,null,null,{"$f":"AK84","v":""},{"$f":"AK86","v":""}]
[null,null,null,null,null,null,null,null,null,null,null,null,null,null,"Y20",{"$f":"IF(AND(K22=0,L22=0),\"\",IF(K22<L22,I20,I23))","v":""},null,null,null,null,null,null,null,null,null,null,null,null,null,null,null,null,null,null,null,53,null,null,null,null,null,null,null,null,null,null,null,null,null,64,null,null,null,null,null,null,null,null,null,null,null,null,null,null,null,null,null,null,null,null,null,null,null,null,null,null,null,null,null,null,null,61,null,null,null,null,{"$f":"AK90","v":""},{"$f":"AK93","v":""}]
[null,null,null,null,null,null,null,"Y9",{"$f":"IF(AND(D26=0,E26=0),\"\",IF(D26<E26,B25,B27))","v":""},null,null,null,null,null,null,null,null,{"$f":"CU46","v":0},{"$f":"CV46","v":0},"YE",null,41,{"$f":"IF(AND(R67=0,S67=0),\"\",IF(R67>S67,P66,P68))","v":""},null,null,null,null,null,null,null,null,{"$f":"CU58","v":0},{"$f":"CV58","v":0},"Y39",null,null,{"$f":"IF(AND(AF67=0,AG67=0),\"\",IF(AF67>AG67,AD65,AD69))","v":""},null,null,null,null,null,null,null,null,null,null,null,null,null,null,null,null,null,null,null,null,null,null,null,null,null,null,null,null,null,null,null,null,null,null,null,null,null,null,null,null,null,null,null,null,62,null,null,null,null,{"$f":"AK95","v":""},{"$f":"AK97","v":""}]
[null,null,null,null,null,null,null,null,null,null,{"$f":"CU34","v":0},{"$f":"CV34","v":0},"YE",null,29,{"$f":"IF(AND(K68=0,L68=0),\"\",IF(K68>L68,I67,I69))","v":""},null,null,null,null,null,null,null,null,null,null,null,null,47,null,null,null,null,null,null,null,null,null,null,null,null,null,null,null,null,null,null,null,null,null,null,null,null,null,null,null,null,null,null,null,null,null,null,null,null,null,null,null,null,null,null,null,null,null,null,null,null,null,null,null,null,63,null,null,null,null,{"$f":"AR49","v":""},{"$f":"AR55","v":""}]
[null,null,null,null,null,null,null,"Y10",{"$f":"IF(AND(D29=0,E29=0),\"\",IF(D29<E29,B28,B30))","v":""},null,null,null,null,null,null,null,null,null,null,null,null,null,null,null,null,{"$f":"CU52","v":0},{"$f":"CV52","v":0},"Y35",null,{"$f":"IF(AND(Z69=0,AA69=0),\"\",IF(Z69>AA69,W67,W71))","v":""},null,null,null,null,null,null,null,null,null,null,null,null,58,null,null,{"$f":"CU69","v":0},{"$f":"CV69","v":0},"Y44",null,null,{"$f":"IF(AND(AT69=0,AU69=0),\"\",IF(AT69>AU69,AR65,AR72))","v":""},null,null,null,null,null,null,null,null,null,null,null,null,null,null,null,null,null,null,null,null,null,null,null,null,null,null,null,null,null,null,64,null,null,null,null,{"$f":"AR65","v":""},{"$f":"AR72","v":""}]
[null,null,null,null,null,null,null,null,null,null,null,null,null,null,"Y19",{"$f":"IF(AND(K16=0,L16=0),\"\",IF(K16<L16,I14,I17))","v":""},null,null,null,null,null,null,null,null,null,null,null,null,null,null,null,null,null,null,null,null,null,null,null,null,null,null,null,null,null,null,null,null,null,null,null,null,null,null,null,null,null,null,null,null,null,null,null,null,null,null,null,null,null,null,null,null,null,null,null,null,null,null,null,null,null,65,null,null,null,null,{"$f":"AR78","v":""},{"$f":"AR80","v":""}]
[null,null,null,null,null,null,null,"Y11",{"$f":"IF(AND(D32=0,E32=0),\"\",IF(D32<E32,B31,B33))","v":""},null,null,null,null,null,null,null,null,{"$f":"CU47","v":0},{"$f":"CV47","v":0},"YE",null,42,{"$f":"IF(AND(R71=0,S71=0),\"\",IF(R71>S71,P70,P72))","v":""},null,null,null,null,null,null,null,null,null,null,null,null,null,null,null,null,null,null,null,null,null,null,null,null,null,null,null,null,null,null,null,null,null,"Y45",{"$f":"IF(AND(BA61=0,BB61=0),\"\",IF(BA61<BB61,AY52,AY69))","v":""},null,null,null,null,null,null,"4.",null,null,null,null,null,null,null,null,null,null,null,null,null,null,null,null,66,null,null,null,null,{"$f":"AR82","v":""},{"$f":"AR85","v":""}]
[null,null,null,null,null,null,null,null,null,null,{"$f":"CU35","v":0},{"$f":"CV35","v":0},"YE",null,30,{"$f":"IF(AND(K72=0,L72=0),\"\",IF(K72>L72,I71,I73))","v":""},null,null,null,null,null,null,null,null,null,null,null,null,null,null,null,null,null,null,null,null,null,null,{"$f":"CU63","v":0},{"$f":"CV63","v":0},"Y42",null,null,{"$f":"IF(AND(AM72=0,AN72=0),\"\",IF(AM72>AN72,AK67,AK75))","v":""},null,null,null,null,null,null,null,null,null,null,null,null,null,null,null,null,null,null,null,null,null,null,null,null,null,null,null,null,null,null,null,null,null,null,null,null,null,67,null,null,null,null,{"$f":"AR87","v":""},{"$f":"AR89","v":""}]
[null,null,null,null,null,null,null,"Y12",{"$f":"IF(AND(D35=0,E35=0),\"\",IF(D35<E35,B34,B36))","v":""},null,null,null,null,null,null,null,null,null,null,null,null,null,null,null,null,null,null,null,"Y28",{"$f":"IF(AND(R43=0,S43=0),\"\",IF(R43<S43,P40,P45))","v":""},null,null,null,null,null,null,null,null,null,null,null,null,null,null,null,null,null,null,null,null,null,null,null,null,null,null,null,null,null,null,null,null,null,null,null,null,null,null,null,null,null,null,null,null,null,null,null,null,null,null,null,68,null,null,null,null,{"$f":"AY13","v":""},{"$f":"AY38","v":""}]
[null,null,null,null,null,null,null,null,null,null,null,null,null,null,"Y18",{"$f":"IF(AND(K10=0,L10=0),\"\",IF(K10<L10,I8,I11))","v":""},null,null,null,null,null,null,null,null,null,null,null,null,null,null,null,null,null,null,null,54,null,null,null,null,null,null,null,null,null,null,null,null,null,"Y43",{"$f":"IF(AND(AT53=0,AU53=0),\"\",IF(AT53<AU53,AR49,AR55))","v":""},null,null,null,null,null,null,null,null,null,null,null,null,null,null,null,null,null,null,null,null,null,null,null,null,null,null,null,null,null,null,69,null,null,null,null,{"$f":"AY52","v":""},{"$f":"AY69","v":""}]
[null,null,null,null,null,null,null,"Y13",{"$f":"IF(AND(D38=0,E38=0),\"\",IF(D38<E38,B37,B39))","v":""},null,null,null,null,null,null,null,null,{"$f":"CU48","v":0},{"$f":"CV48","v":0},"YE",null,43,{"$f":"IF(AND(R75=0,S75=0),\"\",IF(R75>S75,P74,P76))","v":""},null,null,null,null,null,null,null,null,{"$f":"CU59","v":0},{"$f":"CV59","v":0},"Y40",null,null,{"$f":"IF(AND(AF75=0,AG75=0),\"\",IF(AF75>AG75,AD73,AD77))","v":""},null,null,null,null,null,null,null,null,null,null,null,null,null,null,null,{"$f":"CU75","v":0},{"$f":"CV75","v":0},"Y56",null,70,{"$f":"IF(AND(BA75=0,BB75=0),\"\",IF(BA75>BB75,AY74,AY76))","v":""},null,null,null,null,null,null,"5.",null,null,null,null,null,null,null,null,null,null,null,null,null,null,null,null,70,null,null,null,null,{"$f":"AY74","v":""},{"$f":"AY76","v":""}]
[null,null,null,null,null,null,null,null,null,null,{"$f":"CU36","v":0},{"$f":"CV36","v":0},"YE",null,31,{"$f":"IF(AND(K76=0,L76=0),\"\",IF(K76>L76,I75,I77))","v":""},null,null,null,null,null,null,null,null,null,null,null,null,48,null,null,null,null,null,null,null,null,null,null,null,null,null,null,null,null,null,null,null,null,"Y44",{"$f":"IF(AND(AT69=0,AU69=0),\"\",IF(AT69<AU69,AR65,AR72))","v":""},null,null,null,null,null,null,null,null,null,null,null,null,null,null,null,null,null,null,null,null,null,null,null,null,null,null,null,null,null,null,71,null,null,null,null,{"$f":"BF49","v":""},{"$f":"BF61","v":""}]
[null,null,null,null,null,null,null,"Y14",{"$f":"IF(AND(D41=0,E41=0),\"\",IF(D41<E41,B40,B42))","v":""},null,null,null,null,null,null,null,null,null,null,null,null,null,null,null,null,{"$f":"CU53","v":0},{"$f":"CV53","v":0},"Y36",null,{"$f":"IF(AND(Z77=0,AA77=0),\"\",IF(Z77>AA77,W75,W79))","v":""},null,null,null,null,null,null,null,null,null,null,null,null,null,null,null,null,null,null,null,null,null,null,null,null,null,null,"Y56",{"$f":"IF(AND(BA75=0,BB75=0),\"\",IF(BA75<BB75,AY74,AY76))","v":""},null,null,null,null,null,null,"6.",null,null,null,null,null,null,null,null,null,null,null,null,null,null,null,null,72,null,null,null,null,{"$f":"BM25","v":""},{"$f":"BM55","v":""}]
[null,null,null,null,null,null,null,null,null,null,null,null,null,null,"Y17",{"$f":"IF(AND(K4=0,L4=0),\"\",IF(K4<L4,I2,I5))","v":""},null,null,null,null,null,null,null,null,null,null,null,null,null,null,null,null,null,null,null,null,null,null,null,null,null,null,"Y41",{"$f":"IF(AND(AM56=0,AN56=0),\"\",IF(AM56<AN56,AK51,AK59))","v":""}]
[null,null,null,null,null,null,null,"Y15",{"$f":"IF(AND(D44=0,E44=0),\"\",IF(D44<E44,B43,B45))","v":""},null,null,null,null,null,null,null,null,{"$f":"CU49","v":0},{"$f":"CV49","v":0},"YE",null,44,{"$f":"IF(AND(R79=0,S79=0),\"\",IF(R79>S79,P78,P80))","v":""},null,null,null,null,null,null,null,null,null,null,null,null,null,null,null,null,null,null,null,null,null,null,{"$f":"CU70","v":0},{"$f":"CV70","v":0},"Y53",null,65,{"$f":"IF(AND(AT79=0,AU79=0),\"\",IF(AT79>AU79,AR78,AR80))","v":""},null,null,null,null,null,null,"7."]
[null,null,null,null,null,null,null,null,null,null,{"$f":"CU37","v":0},{"$f":"CV37","v":0},"YE",null,32,{"$f":"IF(AND(K80=0,L80=0),\"\",IF(K80>L80,I79,I81))","v":""},null,null,null,null,null,null,null,null,null,null,null,null,null,null,null,null,null,null,null,null,null,null,null,null,null,null,"Y42",{"$f":"IF(AND(AM72=0,AN72=0),\"\",IF(AM72<AN72,AK67,AK75))","v":""}]
[null,null,null,null,null,null,null,"Y16",{"$f":"IF(AND(D47=0,E47=0),\"\",IF(D47<E47,B46,B48))","v":""},null,null,null,null,null,null,null,null,null,null,null,null,null,null,null,null,null,null,null,null,null,null,null,null,null,null,"Y37",{"$f":"IF(AND(AF51=0,AG51=0),\"\",IF(AF51<AG51,AD49,AD53))","v":""},null,null,null,null,null,null,null,null,null,null,null,null,"Y53",{"$f":"IF(AND(AT79=0,AU79=0),\"\",IF(AT79<AU79,AR78,AR80))","v":""},null,null,null,null,null,null,"8."]
[null,null,null,null,null,null,null,null,null,null,null,null,null,null,null,null,null,null,null,null,null,null,null,null,null,null,null,null,null,null,null,null,null,null,null,null,null,null,{"$f":"CU64","v":0},{"$f":"CV64","v":0},"Y49",null,59,{"$f":"IF(AND(AM82=0,AN82=0),\"\",IF(AM82>AN82,AK81,AK83))","v":""}]
[null,null,null,null,null,null,null,null,null,null,null,null,null,null,null,null,null,null,null,null,null,null,null,null,null,null,null,null,null,null,null,null,null,null,null,"Y38",{"$f":"IF(AND(AF59=0,AG59=0),\"\",IF(AF59<AG59,AD57,AD61))","v":""},null,null,null,null,null,null,null,null,null,null,null,null,66]
[null,null,null,null,null,null,null,null,null,null,null,null,null,null,null,null,null,null,null,null,null,null,null,null,null,null,null,null,null,null,null,null,null,null,null,"Y39",{"$f":"IF(AND(AF67=0,AG67=0),\"\",IF(AF67<AG67,AD65,AD69))","v":""},null,null,null,null,null,null,null,null,{"$f":"CU71","v":0},{"$f":"CV71","v":0},"Y54",null,null,{"$f":"IF(AND(AT84=0,AU84=0),\"\",IF(AT84>AU84,AR82,AR85))","v":""},null,null,null,null,null,null,"9."]
[null,null,null,null,null,null,null,null,null,null,null,null,null,null,null,null,null,null,null,null,null,null,null,null,null,null,null,null,null,null,null,null,null,null,null,null,null,null,{"$f":"CU65","v":0},{"$f":"CV65","v":0},"Y50",null,60,{"$f":"IF(AND(AM85=0,AN85=0),\"\",IF(AM85>AN85,AK84,AK86))","v":""}]
[null,null,null,null,null,null,null,null,null,null,null,null,null,null,null,null,null,null,null,null,null,null,null,null,null,null,null,null,null,null,null,null,null,null,null,"Y40",{"$f":"IF(AND(AF75=0,AG75=0),\"\",IF(AF75<AG75,AD73,AD77))","v":""},null,null,null,null,null,null,null,null,null,null,null,null,"Y54",{"$f":"IF(AND(AT84=0,AU84=0),\"\",IF(AT84<AU84,AR82,AR85))","v":""},null,null,null,null,null,null,"10."]
[null,null,null,null,null,null,null,null,null,null,null,null,null,null,null,null,null,null,null,null,null,null,null,null,null,null,null,null,null,null,null,null,null,null,null,null,null,null,null,null,null,null,"Y49",{"$f":"IF(AND(AM82=0,AN82=0),\"\",IF(AM82<AN82,AK81,AK83))","v":""}]
[null,null,null,null,null,null,null,null,null,null,null,null,null,null,null,null,null,null,null,null,null,null,null,null,null,null,null,null,null,null,null,null,null,null,null,null,null,null,null,null,null,null,null,null,null,{"$f":"CU72","v":0},{"$f":"CV72","v":0},"Y55",null,67,{"$f":"IF(AND(AT88=0,AU88=0),\"\",IF(AT88>AU88,AR87,AR89))","v":""},null,null,null,null,null,null,"11."]
[null,null,null,null,null,null,null,null,null,null,null,null,null,null,null,null,null,null,null,null,null,null,null,null,null,null,null,null,"Y33",{"$f":"IF(AND(Z53=0,AA53=0),\"\",IF(Z53<AA53,W51,W55))","v":""},null,null,null,null,null,null,null,null,null,null,null,null,"Y50",{"$f":"IF(AND(AM85=0,AN85=0),\"\",IF(AM85<AN85,AK84,AK86))","v":""}]
[null,null,null,null,null,null,null,null,null,null,null,null,null,null,null,null,null,null,null,null,null,null,null,null,null,null,null,null,null,null,null,{"$f":"CU60","v":0},{"$f":"CV60","v":0},"Y47",null,55,{"$f":"IF(AND(AF90=0,AG90=0),\"\",IF(AF90>AG90,AD89,AD91))","v":""},null,null,null,null,null,null,null,null,null,null,null,null,"Y55",{"$f":"IF(AND(AT88=0,AU88=0),\"\",IF(AT88<AU88,AR87,AR89))","v":""},null,null,null,null,null,null,"12."]
[null,null,null,null,null,null,null,null,null,null,null,null,null,null,null,null,null,null,null,null,null,null,null,null,null,null,null,null,"Y34",{"$f":"IF(AND(Z61=0,AA61=0),\"\",IF(Z61<AA61,W59,W63))","v":""},null,null,null,null,null,null,null,null,null,null,null,null,61]
[null,null,null,null,null,null,null,null,null,null,null,null,null,null,null,null,null,null,null,null,null,null,null,null,null,null,null,null,"Y35",{"$f":"IF(AND(Z69=0,AA69=0),\"\",IF(Z69<AA69,W67,W71))","v":""},null,null,null,null,null,null,null,null,{"$f":"CU66","v":0},{"$f":"CV66","v":0},"Y51",null,null,{"$f":"IF(AND(AM92=0,AN92=0),\"\",IF(AM92>AN92,AK90,AK93))","v":""},null,null,null,null,null,null,"13."]
[null,null,null,null,null,null,null,null,null,null,null,null,null,null,null,null,null,null,null,null,null,null,null,null,null,null,null,null,null,null,null,{"$f":"CU61","v":0},{"$f":"CV61","v":0},"Y48",null,56,{"$f":"IF(AND(AF93=0,AG93=0),\"\",IF(AF93>AG93,AD92,AD94))","v":""}]
[null,null,null,null,null,null,null,null,null,null,null,null,null,null,null,null,null,null,null,null,null,null,null,null,null,null,null,null,"Y36",{"$f":"IF(AND(Z77=0,AA77=0),\"\",IF(Z77<AA77,W75,W79))","v":""},null,null,null,null,null,null,null,null,null,null,null,null,"Y51",{"$f":"IF(AND(AM92=0,AN92=0),\"\",IF(AM92<AN92,AK90,AK93))","v":""},null,null,null,null,null,null,"14."]
[null,null,null,null,null,null,null,null,null,null,null,null,null,null,null,null,null,null,null,null,null,null,null,null,null,null,null,null,null,null,null,null,null,null,null,"Y47",{"$f":"IF(AND(AF90=0,AG90=0),\"\",IF(AF90<AG90,AD89,AD91))","v":""}]
[null,null,null,null,null,null,null,null,null,null,null,null,null,null,null,null,null,null,null,null,null,null,null,null,null,null,null,null,null,null,null,null,null,null,null,null,null,null,{"$f":"CU67","v":0},{"$f":"CV67","v":0},"Y52",null,62,{"$f":"IF(AND(AM96=0,AN96=0),\"\",IF(AM96>AN96,AK95,AK97))","v":""},null,null,null,null,null,null,"15."]
[null,null,null,null,null,null,null,null,null,null,null,null,null,null,null,null,null,null,null,null,null,null,null,null,null,null,null,null,null,null,null,null,null,null,null,"Y48",{"$f":"IF(AND(AF93=0,AG93=0),\"\",IF(AF93<AG93,AD92,AD94))","v":""}]
[null,null,null,null,null,null,null,null,null,null,null,null,null,null,null,null,null,null,null,null,null,null,null,null,null,null,null,null,null,null,null,null,null,null,null,null,null,null,null,null,null,null,"Y52",{"$f":"IF(AND(AM96=0,AN96=0),\"\",IF(AM96<AN96,AK95,AK97))","v":""},null,null,null,null,null,null,"16."]

{"sheet":"32DE(16)","index":4,"n_rows":84,"n_cols":105,"rows_kept":84,"cut":false,"hidden":true,"merged":[[39,36,39,42],[59,22,59,28],[0,24,2,43],[3,24,4,43],[82,29,82,35],[83,36,83,42],[45,29,45,35],[46,36,46,42],[48,22,48,28],[51,36,51,42],[53,29,53,35],[54,36,54,42],[61,29,61,35],[47,29,47,35],[48,36,48,42],[49,29,49,35],[50,22,50,28],[81,36,81,42],[79,36,79,42],[78,29,78,35],[79,22,79,28],[80,29,80,35],[77,22,77,28],[75,22,75,28],[76,36,76,42],[73,22,73,28],[73,36,73,42],[74,29,74,35],[69,15,69,21],[70,29,70,35],[71,36,71,42],[66,15,66,21],[66,29,66,35],[67,15,67,21],[67,36,67,42],[56,36,56,42],[57,29,57,35],[54,22,54,28],[55,29,55,35],[68,22,68,28],[72,29,72,35],[52,22,52,28],[45,1,45,7],[46,8,46,14],[47,1,47,7],[64,15,64,21],[65,22,65,28],[63,15,63,21],[64,36,64,42],[60,15,60,21],[61,15,61,21],[62,22,62,28],[58,36,58,42],[58,15,58,21],[40,8,40,14],[41,1,41,7],[42,1,42,7],[42,22,42,28],[43,8,43,14],[44,1,44,7],[44,15,44,21],[36,1,36,7],[37,8,37,14],[37,29,37,35],[38,1,38,7],[39,1,39,7],[39,15,39,21],[31,22,31,28],[32,1,32,7],[32,15,32,21],[33,1,33,7],[34,8,34,14],[35,1,35,7],[27,1,27,7],[27,15,27,21],[28,8,28,14],[29,1,29,7],[30,1,30,7],[31,8,31,14],[22,8,22,14],[23,1,23,7],[24,1,24,7],[24,36,24,42],[25,8,25,14],[26,1,26,7],[18,1,18,7],[19,8,19,14],[20,1,20,7],[20,15,20,21],[21,1,21,7],[14,1,14,7],[15,1,15,7],[15,15,15,21],[16,8,16,14],[17,1,17,7],[17,22,17,28],[9,1,9,7],[10,8,10,14],[11,1,11,7],[12,1,12,7],[12,29,12,35],[13,8,13,14],[5,1,5,7],[6,1,6,7],[6,22,6,28],[7,8,7,14],[8,1,8,7],[8,15,8,21],[4,88,4,89],[4,90,4,91],[4,92,4,93],[4,94,4,95],[4,96,4,97],[4,98,4,99],[0,1,0,7],[1,8,1,14],[2,1,2,7],[3,1,3,7],[3,15,3,21],[4,8,4,14]]}
[1,{"$f":"IF(#REF!=2,#REF!,IF(#REF!=3,#REF!,IF(#REF!=4,#REF!,IF(#REF!=5,#REF!))))","v":{"$error":"#REF!"}},null,null,null,null,null,null,null,null,null,null,null,null,null,null,null,null,null,null,null,null,null,null,{"$f":"+KATILIM!A1","v":"TÜRKİYE MASA TENİSİ FEDERASYONU\nYILDIZLAR KUZEYDOĞU BÖLGE YARIŞMALARI"},null,null,null,null,null,null,null,null,null,null,null,null,null,null,null,null,null,null,null,null,null,null,null,null,null,null,null,null,null,null,null,null,null,null,null,null,null,null,null,null,null,null,null,null,null,null,null,null,null,null,null,null,null,null,null,null,null,null,null,null,null,null,null,null,null,null,null,null,null,null,null,null,null,null,null,null,null,null,"1st Round",1]
[null,null,null,{"$f":"CU6","v":0},{"$f":"CV6","v":0},null,null,1,{"$f":"IF(AND(D2=0,E2=0),\"\",IF(D2>E2,B1,B3))","v":""},null,null,null,null,null,null,null,null,null,null,null,null,null,null,null,null,null,null,null,null,null,null,null,null,null,null,null,null,null,null,null,null,null,null,null,null,null,null,null,null,null,null,null,null,null,null,null,null,null,null,null,null,null,null,null,null,null,null,null,null,null,null,null,null,null,null,null,null,null,null,null,null,null,null,null,null,null,null,null,null,null,null,null,null,null,null,null,null,null,null,null,null,null,null,"2sn Round"]
[2,{"$f":"IF(#REF!=2,#REF!,IF(#REF!=3,#REF!,IF(#REF!=4,#REF!,IF(#REF!=5,#REF!))))","v":{"$error":"#REF!"}},null,null,null,null,null,null,null,null,null,null,null,null,17,null,null,null,null,null,null,null,null,null,null,null,null,null,null,null,null,null,null,null,null,null,null,null,null,null,null,null,null,null,null,null,null,null,null,null,null,null,null,null,null,null,null,null,null,null,null,null,null,null,null,null,null,null,null,null,null,null,null,null,null,null,null,null,null,null,null,null,null,null,null,null,null,null,null,null,null,null,null,null,null,null,null,null,null,null,null,null,null,"3th Round"]
[3,{"$f":"IF(#REF!=2,#REF!,IF(#REF!=3,#REF!,IF(#REF!=4,#REF!,IF(#REF!=5,#REF!))))","v":{"$error":"#REF!"}},null,null,null,null,null,null,null,null,{"$f":"CU22","v":0},{"$f":"CV22","v":0},"Y-1",null,null,{"$f":"IF(AND(K4=0,L4=0),\"\",IF(K4>L4,I2,I5))","v":""},null,null,null,null,null,null,null,null,{"$f":"KATILIM!AC2&\" \"&KATILIM!AE3","v":"KIZ TAKIM  [01-02 Mart 2025 SİVAS] [ Ana Tablo ]"},null,null,null,null,null,null,null,null,null,null,null,null,null,null,null,null,null,null,null,null,null,null,null,null,null,null,null,null,null,null,null,null,null,null,null,null,null,null,null,null,null,null,null,null,null,null,null,null,null,null,null,null,null,null,null,null,null,null,null,null,null,null,null,null,null,null,null,null,null,null,null,null,null,null,null,null,null,null,"4th Round"]
[null,null,null,{"$f":"CU7","v":0},{"$f":"CV7","v":0},null,null,2,{"$f":"IF(AND(D5=0,E5=0),\"\",IF(D5>E5,B4,B6))","v":""},null,null,null,null,null,null,null,null,null,null,null,null,25,null,null,null,null,null,null,null,null,null,null,null,null,null,null,null,null,null,null,null,null,null,null,null,null,null,null,null,null,null,null,null,null,null,null,null,null,null,null,null,null,null,null,null,null,null,null,null,null,null,null,null,null,null,null,null,null,null,null,null,"#","Date","Time","Table","Competition","Player A","Player B","Set1",null,"Set2",null,"Set3",null,"Set4",null,"Set5",null,"Result",null,null,null,null,"5th Round"]
[4,{"$f":"IF(#REF!=2,#REF!,IF(#REF!=3,#REF!,IF(#REF!=4,#REF!,IF(#REF!=5,#REF!))))","v":{"$error":"#REF!"}},null,null,null,null,null,null,null,null,null,null,null,null,null,null,null,null,null,null,null,null,null,null,null,null,null,null,null,null,null,null,null,null,null,null,null,null,null,null,null,null,null,null,null,null,null,null,null,null,null,null,null,null,null,null,null,null,null,null,null,null,null,null,null,null,null,null,null,null,null,null,null,null,null,null,null,null,null,null,null,1,null,null,null,null,{"$f":"B1","v":{"$error":"#REF!"}},{"$f":"B3","v":{"$error":"#REF!"}},null,null,null,null,null,null,null,null,null,null,null,null,null,null,null,"6th Round"]
[5,{"$f":"IF(#REF!=2,#REF!,IF(#REF!=3,#REF!,IF(#REF!=4,#REF!,IF(#REF!=5,#REF!))))","v":{"$error":"#REF!"}},null,null,null,null,null,null,null,null,null,null,null,null,null,null,null,{"$f":"CU30","v":0},{"$f":"CV30","v":0},"Y-9",null,null,{"$f":"IF(AND(R7=0,S7=0),\"\",IF(R7>S7,P4,P9))","v":""},null,null,null,null,null,null,null,null,null,null,null,null,null,null,null,null,null,null,null,null,null,null,null,null,null,null,null,null,null,null,null,null,null,null,null,null,null,null,null,null,null,null,null,null,null,null,null,null,null,null,null,null,null,null,null,null,null,null,2,null,null,null,null,{"$f":"B4","v":{"$error":"#REF!"}},{"$f":"B6","v":{"$error":"#REF!"}},null,null,null,null,null,null,null,null,null,null,null,null,null,null,null,"7th Round"]
[null,null,null,{"$f":"CU8","v":0},{"$f":"CV8","v":0},null,null,3,{"$f":"IF(AND(D8=0,E8=0),\"\",IF(D8>E8,B7,B9))","v":""},null,null,null,null,null,null,null,null,null,null,null,null,null,null,null,null,null,null,null,33,null,null,null,null,null,null,null,null,null,null,null,null,null,null,null,null,null,null,null,null,null,null,null,null,null,null,null,null,null,null,null,null,null,null,null,null,null,null,null,null,null,null,null,null,null,null,null,null,null,null,null,null,3,null,null,null,null,{"$f":"B7","v":{"$error":"#REF!"}},{"$f":"B9","v":{"$error":"#REF!"}},null,null,null,null,null,null,null,null,null,null,null,null,null,null,null,"8th Round"]
[6,{"$f":"IF(#REF!=2,#REF!,IF(#REF!=3,#REF!,IF(#REF!=4,#REF!,IF(#REF!=5,#REF!))))","v":{"$error":"#REF!"}},null,null,null,null,null,null,null,null,null,null,null,null,18,{"$f":"IF(AND(K10=0,L10=0),\"\",IF(K10>L10,I8,I11))","v":""},null,null,null,null,null,null,null,null,null,null,null,null,null,null,null,null,null,null,null,null,null,null,null,null,null,null,null,null,null,null,null,null,null,null,null,null,null,null,null,null,null,null,null,null,null,null,null,null,null,null,null,null,null,null,null,null,null,null,null,null,null,null,null,null,null,4,null,null,null,null,{"$f":"B10","v":{"$error":"#REF!"}},{"$f":"B12","v":{"$error":"#REF!"}},null,null,null,null,null,null,null,null,null,null,null,null,null,null,null,"9th Round"]
[7,{"$f":"IF(#REF!=2,#REF!,IF(#REF!=3,#REF!,IF(#REF!=4,#REF!,IF(#REF!=5,#REF!))))","v":{"$error":"#REF!"}},null,null,null,null,null,null,null,null,{"$f":"CU23","v":0},{"$f":"CV23","v":0},"Y-2",null,null,null,null,null,null,null,null,null,null,null,null,null,null,null,null,null,null,null,null,null,null,null,null,null,null,null,null,null,null,null,null,null,null,null,null,null,null,null,null,null,null,null,null,null,null,null,null,null,null,null,null,null,null,null,null,null,null,null,null,null,null,null,null,null,null,null,null,5,null,null,null,null,{"$f":"B13","v":{"$error":"#REF!"}},{"$f":"B15","v":{"$error":"#REF!"}},null,null,null,null,null,null,null,null,null,null,null,null,null,null,null,"10th Round"]
[null,null,null,{"$f":"CU9","v":0},{"$f":"CV9","v":0},null,null,4,{"$f":"IF(AND(D11=0,E11=0),\"\",IF(D11>E11,B10,B12))","v":""},null,null,null,null,null,null,null,null,null,null,null,null,null,null,null,null,null,null,null,null,null,null,null,null,null,null,null,null,null,null,null,null,null,null,null,null,null,null,null,null,null,null,null,null,null,null,null,null,null,null,null,null,null,null,null,null,null,null,null,null,null,null,null,null,null,null,null,null,null,null,null,null,6,null,null,null,null,{"$f":"B16","v":{"$error":"#REF!"}},{"$f":"B18","v":{"$error":"#REF!"}}]
[8,{"$f":"IF(#REF!=2,#REF!,IF(#REF!=3,#REF!,IF(#REF!=4,#REF!,IF(#REF!=5,#REF!))))","v":{"$error":"#REF!"}},null,null,null,null,null,null,null,null,null,null,null,null,null,null,null,null,null,null,null,null,null,null,null,null,null,null,null,null,null,null,null,null,null,null,null,null,null,null,null,null,null,null,null,null,null,null,null,null,null,null,null,null,null,null,null,null,null,null,null,null,null,null,null,null,null,null,null,null,null,null,null,null,null,null,null,null,null,null,null,7,null,null,null,null,{"$f":"B19","v":{"$error":"#REF!"}},{"$f":"B21","v":{"$error":"#REF!"}}]
[9,{"$f":"IF(#REF!=2,#REF!,IF(#REF!=3,#REF!,IF(#REF!=4,#REF!,IF(#REF!=5,#REF!))))","v":{"$error":"#REF!"}},null,null,null,null,null,null,null,null,null,null,null,null,null,null,null,null,null,null,null,null,null,null,{"$f":"CU38","v":0},{"$f":"CV38","v":0},"Y-17",null,null,{"$f":"IF(AND(Y13=0,Z13=0),\"\",IF(Y13>Z13,W7,W18))","v":""},null,null,null,null,null,null,null,null,null,null,null,null,null,null,null,null,null,null,null,null,null,null,null,null,null,null,null,null,null,null,null,null,null,null,null,null,null,null,null,null,null,null,null,null,null,null,null,null,null,null,null,8,null,null,null,null,{"$f":"B22","v":{"$error":"#REF!"}},{"$f":"B24","v":{"$error":"#REF!"}}]
[null,null,null,{"$f":"CU10","v":0},{"$f":"CV10","v":0},null,null,5,{"$f":"IF(AND(D14=0,E14=0),\"\",IF(D14>E14,B13,B15))","v":""},null,null,null,null,null,null,null,null,null,null,null,null,null,null,null,null,null,null,null,null,null,null,null,null,null,null,41,null,null,null,null,null,null,null,null,null,null,null,null,null,null,null,null,null,null,null,null,null,null,null,null,null,null,null,null,null,null,null,null,null,null,null,null,null,null,null,null,null,null,null,null,null,9,null,null,null,null,{"$f":"B25","v":{"$error":"#REF!"}},{"$f":"B27","v":{"$error":"#REF!"}}]
[10,{"$f":"IF(#REF!=2,#REF!,IF(#REF!=3,#REF!,IF(#REF!=4,#REF!,IF(#REF!=5,#REF!))))","v":{"$error":"#REF!"}},null,null,null,null,null,null,null,null,null,null,null,null,19,null,null,null,null,null,null,null,null,null,null,null,null,null,null,null,null,null,null,null,null,null,null,null,null,null,null,null,null,null,null,null,null,null,null,null,null,null,null,null,null,null,null,null,null,null,null,null,null,null,null,null,null,null,null,null,null,null,null,null,null,null,null,null,null,null,null,10,null,null,null,null,{"$f":"B28","v":{"$error":"#REF!"}},{"$f":"B30","v":{"$error":"#REF!"}}]
[11,{"$f":"IF(#REF!=2,#REF!,IF(#REF!=3,#REF!,IF(#REF!=4,#REF!,IF(#REF!=5,#REF!))))","v":{"$error":"#REF!"}},null,null,null,null,null,null,null,null,{"$f":"CU24","v":0},{"$f":"CV24","v":0},"Y-3",null,null,{"$f":"IF(AND(K16=0,L16=0),\"\",IF(K16>L16,I14,I17))","v":""},null,null,null,null,null,null,null,null,null,null,null,null,null,null,null,null,null,null,null,null,null,null,null,null,null,null,null,null,null,null,null,null,null,null,null,null,null,null,null,null,null,null,null,null,null,null,null,null,null,null,null,null,null,null,null,null,null,null,null,null,null,null,null,null,null,11,null,null,null,null,{"$f":"B31","v":{"$error":"#REF!"}},{"$f":"B33","v":{"$error":"#REF!"}}]
[null,null,null,{"$f":"CU11","v":0},{"$f":"CV11","v":0},null,null,6,{"$f":"IF(AND(D17=0,E17=0),\"\",IF(D17>E17,B16,B18))","v":""},null,null,null,null,null,null,null,null,null,null,null,null,26,null,null,null,null,null,null,null,null,null,null,null,null,null,null,null,null,null,null,null,null,null,null,null,null,null,null,null,null,null,null,null,null,null,null,null,null,null,null,null,null,null,null,null,null,null,null,null,null,null,null,null,null,null,null,null,null,null,null,null,12,null,null,null,null,{"$f":"B34","v":{"$error":"#REF!"}},{"$f":"B36","v":{"$error":"#REF!"}}]
[12,{"$f":"IF(#REF!=2,#REF!,IF(#REF!=3,#REF!,IF(#REF!=4,#REF!,IF(#REF!=5,#REF!))))","v":{"$error":"#REF!"}},null,null,null,null,null,null,null,null,null,null,null,null,null,null,null,null,null,null,null,null,{"$f":"IF(AND(R19=0,S19=0),\"\",IF(R19>S19,P16,P21))","v":""},null,null,null,null,null,null,null,null,null,null,null,null,null,null,null,null,null,null,null,null,null,null,null,null,null,null,null,null,null,null,null,null,null,null,null,null,null,null,null,null,null,null,null,null,null,null,null,null,null,null,null,null,null,null,null,null,null,null,13,null,null,null,null,{"$f":"B37","v":{"$error":"#REF!"}},{"$f":"B39","v":{"$error":"#REF!"}}]
[13,{"$f":"IF(#REF!=2,#REF!,IF(#REF!=3,#REF!,IF(#REF!=4,#REF!,IF(#REF!=5,#REF!))))","v":{"$error":"#REF!"}},null,null,null,null,null,null,null,null,null,null,null,null,null,null,null,{"$f":"CU31","v":0},{"$f":"CV31","v":0},"Y-10",null,null,null,null,null,null,null,null,null,null,null,null,null,null,null,null,null,null,null,null,null,null,null,null,null,null,null,null,null,null,null,null,null,null,null,null,null,null,null,null,null,null,null,null,null,null,null,null,null,null,null,null,null,null,null,null,null,null,null,null,null,14,null,null,null,null,{"$f":"B40","v":{"$error":"#REF!"}},{"$f":"B42","v":{"$error":"#REF!"}}]
[null,null,null,{"$f":"CU12","v":0},{"$f":"CV12","v":0},null,null,7,{"$f":"IF(AND(D20=0,E20=0),\"\",IF(D20>E20,B19,B21))","v":""},null,null,null,null,null,null,null,null,null,null,null,null,null,null,null,null,null,null,null,null,null,null,null,null,null,null,null,null,null,null,null,null,null,null,null,null,null,null,null,null,null,null,null,null,null,null,null,null,null,null,null,null,null,null,null,null,null,null,null,null,null,null,null,null,null,null,null,null,null,null,null,null,15,null,null,null,null,{"$f":"B43","v":{"$error":"#REF!"}},{"$f":"B45","v":{"$error":"#REF!"}}]
[14,{"$f":"IF(#REF!=2,#REF!,IF(#REF!=3,#REF!,IF(#REF!=4,#REF!,IF(#REF!=5,#REF!))))","v":{"$error":"#REF!"}},null,null,null,null,null,null,null,null,null,null,null,null,20,{"$f":"IF(AND(K22=0,L22=0),\"\",IF(K22>L22,I20,I23))","v":""},null,null,null,null,null,null,null,null,null,null,null,null,null,null,null,null,null,null,null,null,null,null,null,null,null,null,null,null,null,null,null,null,null,null,null,null,null,null,null,null,null,null,null,null,null,null,null,null,null,null,null,null,null,null,null,null,null,null,null,null,null,null,null,null,null,16,null,null,null,null,{"$f":"B46","v":{"$error":"#REF!"}},{"$f":"B48","v":{"$error":"#REF!"}}]
[15,{"$f":"IF(#REF!=2,#REF!,IF(#REF!=3,#REF!,IF(#REF!=4,#REF!,IF(#REF!=5,#REF!))))","v":{"$error":"#REF!"}},null,null,null,null,null,null,null,null,{"$f":"CU25","v":0},{"$f":"CV25","v":0},"Y-4",null,null,null,null,null,null,null,null,null,null,null,null,null,null,null,null,null,null,null,null,null,null,null,null,null,null,null,null,null,null,null,null,null,null,null,null,null,null,null,null,null,null,null,null,null,null,null,null,null,null,null,null,null,null,null,null,null,null,null,null,null,null,null,null,null,null,null,null,17,null,null,null,null,{"$f":"I2","v":""},{"$f":"I5","v":""}]
[null,null,null,{"$f":"CU13","v":0},{"$f":"CV13","v":0},null,null,8,{"$f":"IF(AND(D23=0,E23=0),\"\",IF(D23>E23,B22,B24))","v":""},null,null,null,null,null,null,null,null,null,null,null,null,null,null,null,null,null,null,null,null,null,null,null,null,null,null,null,null,null,null,null,null,null,null,null,null,null,null,null,null,null,null,null,null,null,null,null,null,null,null,null,null,null,null,null,null,null,null,null,null,null,null,null,null,null,null,null,null,null,null,null,null,18,null,null,null,null,{"$f":"I8","v":""},{"$f":"I11","v":""}]
[16,{"$f":"IF(#REF!=2,#REF!,IF(#REF!=3,#REF!,IF(#REF!=4,#REF!,IF(#REF!=5,#REF!))))","v":{"$error":"#REF!"}},null,null,null,null,null,null,null,null,null,null,null,null,null,null,null,null,null,null,null,null,null,null,null,null,null,null,null,null,null,null,null,null,null,null,null,null,null,null,null,null,null,null,null,null,null,null,null,null,null,null,null,null,null,null,null,null,null,null,null,null,null,null,null,null,null,null,null,null,null,null,null,null,null,null,null,null,null,null,null,19,null,null,null,null,{"$f":"I14","v":""},{"$f":"I17","v":""}]
[17,{"$f":"IF(#REF!=2,#REF!,IF(#REF!=3,#REF!,IF(#REF!=4,#REF!,IF(#REF!=5,#REF!))))","v":{"$error":"#REF!"}},null,null,null,null,null,null,null,null,null,null,null,null,null,{"$f":"IF(AND(K22=0,L22=0),\"\",IF(K22<L22,I20,I23))","v":""},null,null,null,null,null,null,null,null,null,null,null,null,null,null,null,{"$f":"CU46","v":0},{"$f":"CV46","v":0},"Y-25",null,null,{"$f":"IF(AND(AF25=0,AG25=0),\"\",IF(AF25>AG25,AD13,AD38))","v":""},null,null,null,null,null,null,"1.",null,null,null,null,null,null,null,null,null,null,null,null,null,null,null,null,null,null,null,null,null,null,null,null,null,null,null,null,null,null,null,null,null,null,null,null,null,20,null,null,null,null,{"$f":"I20","v":""},{"$f":"I23","v":""}]
[null,null,null,{"$f":"CU14","v":0},{"$f":"CV14","v":0},null,null,9,{"$f":"IF(AND(D26=0,E26=0),\"\",IF(D26>E26,B25,B27))","v":""},null,null,null,null,null,null,null,null,null,null,null,null,null,null,null,null,null,null,null,null,null,null,null,null,null,null,null,null,null,null,null,null,null,null,null,null,null,null,null,null,null,null,null,null,null,null,null,null,null,null,null,null,null,null,null,null,null,null,null,null,null,null,null,null,null,null,null,null,null,null,null,null,21,null,null,null,null,{"$f":"I26","v":""},{"$f":"I29","v":""}]
[18,{"$f":"IF(#REF!=2,#REF!,IF(#REF!=3,#REF!,IF(#REF!=4,#REF!,IF(#REF!=5,#REF!))))","v":{"$error":"#REF!"}},null,null,null,null,null,null,null,null,null,null,null,null,21,null,null,null,null,null,null,null,null,null,null,null,null,null,null,null,null,null,null,null,null,null,null,null,null,null,null,null,null,null,null,null,null,null,null,null,null,null,null,null,null,null,null,null,null,null,null,null,null,null,null,null,null,null,null,null,null,null,null,null,null,null,null,null,null,null,null,22,null,null,null,null,{"$f":"I32","v":""},{"$f":"I35","v":""}]
[19,{"$f":"IF(#REF!=2,#REF!,IF(#REF!=3,#REF!,IF(#REF!=4,#REF!,IF(#REF!=5,#REF!))))","v":{"$error":"#REF!"}},null,null,null,null,null,null,null,null,{"$f":"CU26","v":0},{"$f":"CV26","v":0},"Y-5",null,null,{"$f":"IF(AND(K28=0,L28=0),\"\",IF(K28>L28,I26,I29))","v":""},null,null,null,null,null,null,null,null,null,null,null,null,null,null,null,null,null,null,null,null,null,null,null,null,null,null,null,null,null,null,null,null,null,null,null,null,null,null,null,null,null,null,null,null,null,null,null,null,null,null,null,null,null,null,null,null,null,null,null,null,null,null,null,null,null,23,null,null,null,null,{"$f":"I38","v":""},{"$f":"I41","v":""}]
[null,null,null,{"$f":"CU15","v":0},{"$f":"CV15","v":0},null,null,10,{"$f":"IF(AND(D29=0,E29=0),\"\",IF(D29>E29,B28,B30))","v":""},null,null,null,null,null,null,null,null,null,null,null,null,27,null,null,null,null,null,null,null,null,null,null,null,null,null,null,null,null,null,null,null,null,null,null,null,null,null,null,null,null,null,null,null,null,null,null,null,null,null,null,null,null,null,null,null,null,null,null,null,null,null,null,null,null,null,null,null,null,null,null,null,24,null,null,null,null,{"$f":"I44","v":""},{"$f":"I47","v":""}]
[20,{"$f":"IF(#REF!=2,#REF!,IF(#REF!=3,#REF!,IF(#REF!=4,#REF!,IF(#REF!=5,#REF!))))","v":{"$error":"#REF!"}},null,null,null,null,null,null,null,null,null,null,null,null,null,null,null,null,null,null,null,null,null,null,null,null,null,null,null,null,null,null,null,null,null,null,null,null,null,null,null,null,null,null,null,null,null,null,null,null,null,null,null,null,null,null,null,null,null,null,null,null,null,null,null,null,null,null,null,null,null,null,null,null,null,null,null,null,null,null,null,25,null,null,null,null,{"$f":"P4","v":""},{"$f":"P9","v":""}]
[21,{"$f":"IF(#REF!=2,#REF!,IF(#REF!=3,#REF!,IF(#REF!=4,#REF!,IF(#REF!=5,#REF!))))","v":{"$error":"#REF!"}},null,null,null,null,null,null,null,null,null,null,null,null,null,null,null,{"$f":"CU32","v":0},{"$f":"CV32","v":0},"Y-11",null,null,null,null,null,null,null,null,null,null,null,null,null,null,null,null,null,null,null,null,null,null,null,null,null,null,null,null,null,null,null,null,null,null,null,null,null,null,null,null,null,null,null,null,null,null,null,null,null,null,null,null,null,null,null,null,null,null,null,null,null,26,null,null,null,null,{"$f":"P16","v":""},{"$f":"P21","v":""}]
[null,null,null,{"$f":"CU16","v":0},{"$f":"CV16","v":0},null,null,11,{"$f":"IF(AND(D32=0,E32=0),\"\",IF(D32>E32,B31,B33))","v":""},null,null,null,null,null,null,null,null,null,null,null,null,null,{"$f":"IF(AND(R31=0,S31=0),\"\",IF(R31>S31,P28,P33))","v":""},null,null,null,null,null,null,null,null,null,null,null,null,null,null,null,null,null,null,null,null,null,null,null,null,null,null,null,null,null,null,null,null,null,null,null,null,null,null,null,null,null,null,null,null,null,null,null,null,null,null,null,null,null,null,null,null,null,null,27,null,null,null,null,{"$f":"P28","v":""},{"$f":"P33","v":""}]
[22,{"$f":"IF(#REF!=2,#REF!,IF(#REF!=3,#REF!,IF(#REF!=4,#REF!,IF(#REF!=5,#REF!))))","v":{"$error":"#REF!"}},null,null,null,null,null,null,null,null,null,null,null,null,22,{"$f":"IF(AND(K34=0,L34=0),\"\",IF(K34>L34,I32,I35))","v":""},null,null,null,null,null,null,null,null,null,null,null,null,34,null,null,null,null,null,null,null,null,null,null,null,null,null,null,null,null,null,null,null,null,null,null,null,null,null,null,null,null,null,null,null,null,null,null,null,null,null,null,null,null,null,null,null,null,null,null,null,null,null,null,null,null,28,null,null,null,null,{"$f":"P40","v":""},{"$f":"P45","v":""}]
[23,{"$f":"IF(#REF!=2,#REF!,IF(#REF!=3,#REF!,IF(#REF!=4,#REF!,IF(#REF!=5,#REF!))))","v":{"$error":"#REF!"}},null,null,null,null,null,null,null,null,{"$f":"CU27","v":0},{"$f":"CV27","v":0},"Y-6",null,null,null,null,null,null,null,null,null,null,null,null,null,null,null,null,null,null,null,null,null,null,null,null,null,null,null,null,null,null,null,null,null,null,null,null,null,null,null,null,null,null,null,null,null,null,null,null,null,null,null,null,null,null,null,null,null,null,null,null,null,null,null,null,null,null,null,null,29,null,null,null,null,{"$f":"P59","v":""},{"$f":"P61","v":""}]
[null,null,null,{"$f":"CU17","v":0},{"$f":"CV17","v":0},null,null,12,{"$f":"IF(AND(D35=0,E35=0),\"\",IF(D35>E35,B34,B36))","v":""},null,null,null,null,null,null,null,null,null,null,null,null,null,null,null,null,null,null,null,null,null,null,null,null,null,null,null,null,null,null,null,null,null,null,null,null,null,null,null,null,null,null,null,null,null,null,null,null,null,null,null,null,null,null,null,null,null,null,null,null,null,null,null,null,null,null,null,null,null,null,null,null,30,null,null,null,null,{"$f":"P62","v":""},{"$f":"P64","v":""}]
[24,{"$f":"IF(#REF!=2,#REF!,IF(#REF!=3,#REF!,IF(#REF!=4,#REF!,IF(#REF!=5,#REF!))))","v":{"$error":"#REF!"}},null,null,null,null,null,null,null,null,null,null,null,null,null,null,null,null,null,null,null,null,null,null,null,null,null,null,null,null,null,null,null,null,null,null,null,null,null,null,null,null,null,null,null,null,null,null,null,null,null,null,null,null,null,null,null,null,null,null,null,null,null,null,null,null,null,null,null,null,null,null,null,null,null,null,null,null,null,null,null,31,null,null,null,null,{"$f":"P65","v":""},{"$f":"P67","v":""}]
[25,{"$f":"IF(#REF!=2,#REF!,IF(#REF!=3,#REF!,IF(#REF!=4,#REF!,IF(#REF!=5,#REF!))))","v":{"$error":"#REF!"}},null,null,null,null,null,null,null,null,null,null,null,null,null,null,null,null,null,null,null,null,null,null,null,null,null,null,null,null,null,null,null,null,null,null,null,null,null,null,null,null,null,null,null,null,null,null,null,null,null,null,null,null,null,null,null,null,null,null,null,null,null,null,null,null,null,null,null,null,null,null,null,null,null,null,null,null,null,null,null,32,null,null,null,null,{"$f":"P68","v":""},{"$f":"P70","v":""}]
[null,null,null,{"$f":"CU18","v":0},{"$f":"CV18","v":0},null,null,13,{"$f":"IF(AND(D38=0,E38=0),\"\",IF(D38>E38,B37,B39))","v":""},null,null,null,null,null,null,null,null,null,null,null,null,null,null,null,{"$f":"CU39","v":0},{"$f":"CV39","v":0},"Y-18",null,null,{"$f":"IF(AND(Y38=0,Z38=0),\"\",IF(Y38>Z38,W32,W43))","v":""},null,null,null,null,null,null,null,null,null,null,null,null,null,null,null,null,null,null,null,null,null,null,null,null,null,null,null,null,null,null,null,null,null,null,null,null,null,null,null,null,null,null,null,null,null,null,null,null,null,null,null,33,null,null,null,null,{"$f":"W7","v":""},{"$f":"W18","v":""}]
[26,{"$f":"IF(#REF!=2,#REF!,IF(#REF!=3,#REF!,IF(#REF!=4,#REF!,IF(#REF!=5,#REF!))))","v":{"$error":"#REF!"}},null,null,null,null,null,null,null,null,null,null,null,null,23,null,null,null,null,null,null,null,null,null,null,null,null,null,null,null,null,null,null,null,null,null,null,null,null,null,null,null,null,null,null,null,null,null,null,null,null,null,null,null,null,null,null,null,null,null,null,null,null,null,null,null,null,null,null,null,null,null,null,null,null,null,null,null,null,null,null,34,null,null,null,null,{"$f":"W32","v":""},{"$f":"W43","v":""}]
[27,{"$f":"IF(#REF!=2,#REF!,IF(#REF!=3,#REF!,IF(#REF!=4,#REF!,IF(#REF!=5,#REF!))))","v":{"$error":"#REF!"}},null,null,null,null,null,null,null,null,{"$f":"CU28","v":0},{"$f":"CV28","v":0},"Y-7",null,null,{"$f":"IF(AND(K40=0,L40=0),\"\",IF(K40>L40,I38,I41))","v":""},null,null,null,null,null,null,null,null,null,null,null,null,null,null,null,null,null,null,null,25,{"$f":"IF(AND(AF25=0,AG25=0),\"\",IF(AF25<AG25,AD13,AD38))","v":""},null,null,null,null,null,null,"2.",null,null,null,null,null,null,null,null,null,null,null,null,null,null,null,null,null,null,null,null,null,null,null,null,null,null,null,null,null,null,null,null,null,null,null,null,null,35,null,null,null,null,{"$f":"W49","v":""},{"$f":"W51","v":""}]
[null,null,null,{"$f":"CU19","v":0},{"$f":"CV19","v":0},null,null,14,{"$f":"IF(AND(D41=0,E41=0),\"\",IF(D41>E41,B40,B42))","v":""},null,null,null,null,null,null,null,null,null,null,null,null,28,null,null,null,null,null,null,null,null,null,null,null,null,null,null,null,null,null,null,null,null,null,null,null,null,null,null,null,null,null,null,null,null,null,null,null,null,null,null,null,null,null,null,null,null,null,null,null,null,null,null,null,null,null,null,null,null,null,null,null,36,null,null,null,null,{"$f":"W53","v":""},{"$f":"W55","v":""}]
[28,{"$f":"IF(#REF!=2,#REF!,IF(#REF!=3,#REF!,IF(#REF!=4,#REF!,IF(#REF!=5,#REF!))))","v":{"$error":"#REF!"}},null,null,null,null,null,null,null,null,null,null,null,null,null,null,null,null,null,null,null,null,null,null,null,null,null,null,null,null,null,null,null,null,null,null,null,null,null,null,null,null,null,null,null,null,null,null,null,null,null,null,null,null,null,null,null,null,null,null,null,null,null,null,null,null,null,null,null,null,null,null,null,null,null,null,null,null,null,null,null,37,null,null,null,null,{"$f":"W60","v":""},{"$f":"W63","v":""}]
[29,{"$f":"IF(#REF!=2,#REF!,IF(#REF!=3,#REF!,IF(#REF!=4,#REF!,IF(#REF!=5,#REF!))))","v":{"$error":"#REF!"}},null,null,null,null,null,null,null,null,null,null,null,null,null,null,null,{"$f":"CU33","v":0},{"$f":"CV33","v":0},"Y-12",null,null,{"$f":"IF(AND(R43=0,S43=0),\"\",IF(R43>S43,P40,P45))","v":""},null,null,null,null,null,null,null,null,null,null,null,null,null,null,null,null,null,null,null,null,null,null,null,null,null,null,null,null,null,null,null,null,null,null,null,null,null,null,null,null,null,null,null,null,null,null,null,null,null,null,null,null,null,null,null,null,null,null,38,null,null,null,null,{"$f":"W66","v":""},{"$f":"W69","v":""}]
[null,null,null,{"$f":"CU20","v":0},{"$f":"CV20","v":0},null,null,15,{"$f":"IF(AND(D44=0,E44=0),\"\",IF(D44>E44,B43,B45))","v":""},null,null,null,null,null,null,null,null,null,null,null,null,null,null,null,null,null,null,null,null,null,null,null,null,null,null,null,null,null,null,null,null,null,null,null,null,null,null,null,null,null,null,null,null,null,null,null,null,null,null,null,null,null,null,null,null,null,null,null,null,null,null,null,null,null,null,null,null,null,null,null,null,39,null,null,null,null,{"$f":"W74","v":""},{"$f":"W76","v":""}]
[30,{"$f":"IF(#REF!=2,#REF!,IF(#REF!=3,#REF!,IF(#REF!=4,#REF!,IF(#REF!=5,#REF!))))","v":{"$error":"#REF!"}},null,null,null,null,null,null,null,null,null,null,null,null,24,{"$f":"IF(AND(K46=0,L46=0),\"\",IF(K46>L46,I44,I47))","v":""},null,null,null,null,null,null,null,null,null,null,null,null,null,null,null,null,null,null,null,null,null,null,null,null,null,null,null,null,null,null,null,null,null,null,null,null,null,null,null,null,null,null,null,null,null,null,null,null,null,null,null,null,null,null,null,null,null,null,null,null,null,null,null,null,null,40,null,null,null,null,{"$f":"W78","v":""},{"$f":"W80","v":""}]
[31,{"$f":"IF(#REF!=2,#REF!,IF(#REF!=3,#REF!,IF(#REF!=4,#REF!,IF(#REF!=5,#REF!))))","v":{"$error":"#REF!"}},null,null,null,null,null,null,null,null,{"$f":"CU29","v":0},{"$f":"CV29","v":0},"Y-8",null,null,null,null,null,null,null,null,null,null,null,null,null,null,null,17,{"$f":"IF(AND(Y13=0,Z13=0),\"\",IF(Y13<Z13,W7,W18))","v":""},null,null,null,null,null,null,null,null,null,null,null,null,null,null,null,null,null,null,null,null,null,null,null,null,null,null,null,null,null,null,null,null,null,null,null,null,null,null,null,null,null,null,null,null,null,null,null,null,null,null,null,41,null,null,null,null,{"$f":"AD13","v":""},{"$f":"AD38","v":""}]
[null,null,null,{"$f":"CU21","v":0},{"$f":"CV21","v":0},null,null,16,{"$f":"IF(AND(D47=0,E47=0),\"\",IF(D47>E47,B46,B48))","v":""},null,null,null,null,null,null,null,null,null,null,null,null,null,null,null,null,null,null,null,null,null,null,{"$f":"CU47","v":0},{"$f":"+CV47","v":0},"Y-26",null,42,{"$f":"IF(AND(AF47=0,AG47=0),\"\",IF(AF47>AG47,AD46,AD48))","v":""},null,null,null,null,null,null,"3.",null,null,null,null,null,null,null,null,null,null,null,null,null,null,null,null,null,null,null,null,null,null,null,null,null,null,null,null,null,null,null,null,null,null,null,null,null,42,null,null,null,null,{"$f":"AD46","v":""},{"$f":"AD48","v":""}]
[32,{"$f":"IF(#REF!=2,#REF!,IF(#REF!=3,#REF!,IF(#REF!=4,#REF!,IF(#REF!=5,#REF!))))","v":{"$error":"#REF!"}},null,null,null,null,null,null,null,null,null,null,null,null,null,null,null,null,null,null,null,null,null,null,null,null,null,null,18,{"$f":"IF(AND(Y38=0,Z38=0),\"\",IF(Y38<Z38,W32,W43))","v":""},null,null,null,null,null,null,null,null,null,null,null,null,null,null,null,null,null,null,null,null,null,null,null,null,null,null,null,null,null,null,null,null,null,null,null,null,null,null,null,null,null,null,null,null,null,null,null,null,null,null,null,43,null,null,null,null,{"$f":"AD50","v":""},{"$f":"AD54","v":""}]
[null,null,null,null,null,null,null,null,null,null,null,null,null,null,null,null,null,null,null,null,null,9,{"$f":"IF(AND(R7=0,S7=0),\"\",IF(R7<S7,P4,P9))","v":""},null,null,null,null,null,null,null,null,null,null,null,null,26,{"$f":"IF(AND(AF47=0,AG47=0),\"\",IF(AF47<AG47,AD46,AD48))","v":""},null,null,null,null,null,null,"4.",null,null,null,null,null,null,null,null,null,null,null,null,null,null,null,null,null,null,null,null,null,null,null,null,null,null,null,null,null,null,null,null,null,null,null,null,null,44,null,null,null,null,{"$f":"AD56","v":""},{"$f":"AD58","v":""}]
[null,null,null,null,null,null,null,null,null,null,null,null,null,null,null,null,null,null,null,null,null,null,null,null,{"$f":"CU40","v":0},{"$f":"+CV40","v":0},"Y-19",null,35,{"$f":"IF(AND(Y50=0,Z50=0),\"\",IF(Y50>Z50,W49,W51))","v":""},null,null,null,null,null,null,null,null,null,null,null,null,null,null,null,null,null,null,null,null,null,null,null,null,null,null,null,null,null,null,null,null,null,null,null,null,null,null,null,null,null,null,null,null,null,null,null,null,null,null,null,45,null,null,null,null,{"$f":"AD62","v":""},{"$f":"AD67","v":""}]
[null,null,null,null,null,null,null,null,null,null,null,null,null,null,null,null,null,null,null,null,null,10,{"$f":"IF(AND(R19=0,S19=0),\"\",IF(R19<S19,P16,P21))","v":""},null,null,null,null,null,null,null,null,null,null,null,null,43,null,null,null,null,null,null,null,null,null,null,null,null,null,null,null,null,null,null,null,null,null,null,null,null,null,null,null,null,null,null,null,null,null,null,null,null,null,null,null,null,null,null,null,null,null,46,null,null,null,null,{"$f":"AD71","v":""},{"$f":"AD73","v":""}]
[null,null,null,null,null,null,null,null,null,null,null,null,null,null,null,null,null,null,null,null,null,null,null,null,null,null,null,null,null,null,null,{"$f":"CU48","v":0},{"$f":"+CV48","v":0},"Y-27",null,null,{"$f":"IF(AND(AF52=0,AG52=0),\"\",IF(AF52>AG52,AD50,AD54))","v":""},null,null,null,null,null,null,"5.",null,null,null,null,null,null,null,null,null,null,null,null,null,null,null,null,null,null,null,null,null,null,null,null,null,null,null,null,null,null,null,null,null,null,null,null,null,47,null,null,null,null,{"$f":"AD75","v":""},{"$f":"AD79","v":""}]
[null,null,null,null,null,null,null,null,null,null,null,null,null,null,null,null,null,null,null,null,null,11,{"$f":"IF(AND(R31=0,S31=0),\"\",IF(R31<S31,P28,P33))","v":""},null,null,null,null,null,null,null,null,null,null,null,null,null,null,null,null,null,null,null,null,null,null,null,null,null,null,null,null,null,null,null,null,null,null,null,null,null,null,null,null,null,null,null,null,null,null,null,null,null,null,null,null,null,null,null,null,null,null,48,null,null,null,null,{"$f":"AD81","v":""},{"$f":"AD83","v":""}]
[null,null,null,null,null,null,null,null,null,null,null,null,null,null,null,null,null,null,null,null,null,null,null,null,{"$f":"CU41","v":0},{"$f":"+CV41","v":0},"Y-20",null,36,{"$f":"IF(AND(Y54=0,Z54=0),\"\",IF(Y54>Z54,W53,W55))","v":""}]
[null,null,null,null,null,null,null,null,null,null,null,null,null,null,null,null,null,null,null,null,null,12,{"$f":"IF(AND(R43=0,S43=0),\"\",IF(R43<S43,P40,P45))","v":""},null,null,null,null,null,null,null,null,null,null,null,null,27,{"$f":"IF(AND(AF52=0,AG52=0),\"\",IF(AF52<AG52,AD50,AD54))","v":""},null,null,null,null,null,null,"6."]
[null,null,null,null,null,null,null,null,null,null,null,null,null,null,null,null,null,null,null,null,null,null,null,null,null,null,null,null,19,{"$f":"IF(AND(Y50=0,Z50=0),\"\",IF(Y50<Z50,W49,W51))","v":""}]
[null,null,null,null,null,null,null,null,null,null,null,null,null,null,null,null,null,null,null,null,null,null,null,null,null,null,null,null,null,null,null,{"$f":"CU49","v":0},{"$f":"+CV49","v":0},"Y-28",null,44,{"$f":"IF(AND(AF57=0,AG57=0),\"\",IF(AF57>AG57,AD56,AD58))","v":""},null,null,null,null,null,null,"7."]
[null,null,null,null,null,null,null,null,null,null,null,null,null,null,null,null,null,null,null,null,null,null,null,null,null,null,null,null,20,{"$f":"IF(AND(Y54=0,Z54=0),\"\",IF(Y54<Z54,W53,W55))","v":""}]
[null,null,null,null,null,null,null,null,null,null,null,null,null,null,1,{"$f":"IF(AND(K4=0,L4=0),\"\",IF(K4<L4,I2,I5))","v":""},null,null,null,null,null,null,null,null,null,null,null,null,null,null,null,null,null,null,null,28,{"$f":"IF(AND(AF57=0,AG57=0),\"\",IF(AF57<AG57,AD56,AD58))","v":""},null,null,null,null,null,null,"8."]
[null,null,null,null,null,null,null,null,null,null,null,null,null,null,null,null,null,{"$f":"CU34","v":0},{"$f":"CV34","v":0},"Y-13",null,29,{"$f":"IF(AND(R60=0,S60=0),\"\",IF(R60>S60,P59,P61))","v":""}]
[null,null,null,null,null,null,null,null,null,null,null,null,null,null,2,{"$f":"IF(AND(K10=0,L10=0),\"\",IF(K10<L10,I8,I11))","v":""},null,null,null,null,null,null,null,null,null,null,null,null,37]
[null,null,null,null,null,null,null,null,null,null,null,null,null,null,3,{"$f":"IF(AND(K16=0,L16=0),\"\",IF(K16<L16,I14,I17))","v":""},null,null,null,null,null,null,null,null,{"$f":"CU42","v":0},{"$f":"CV42","v":0},"Y-21",null,null,{"$f":"IF(AND(Y62=0,Z62=0),\"\",IF(Y62>Z62,W60,W63))","v":""}]
[null,null,null,null,null,null,null,null,null,null,null,null,null,null,null,null,null,{"$f":"CU35","v":0},{"$f":"CV35","v":0},"Y-14",null,30,{"$f":"IF(AND(R63=0,S63=0),\"\",IF(R63>S63,P62,P64))","v":""},null,null,null,null,null,null,null,null,null,null,null,null,45]
[null,null,null,null,null,null,null,null,null,null,null,null,null,null,4,{"$f":"IF(AND(K22=0,L22=0),\"\",IF(K22<L22,I20,I23))","v":""}]
[null,null,null,null,null,null,null,null,null,null,null,null,null,null,5,{"$f":"IF(AND(K28=0,L28=0),\"\",IF(K28<L28,I26,I29))","v":""},null,null,null,null,null,null,null,null,null,null,null,null,null,null,null,{"$f":"CU50","v":0},{"$f":"+CV50","v":0},"Y-29",null,null,{"$f":"IF(AND(AF65=0,AG65=0),\"\",IF(AF65>AG65,AD62,AD67))","v":""},null,null,null,null,null,null,"9."]
[null,null,null,null,null,null,null,null,null,null,null,null,null,null,null,null,null,{"$f":"CU36","v":0},{"$f":"CV36","v":0},"Y-15",null,31,{"$f":"IF(AND(R66=0,S66=0),\"\",IF(R66>S66,P65,P67))","v":""}]
[null,null,null,null,null,null,null,null,null,null,null,null,null,null,6,{"$f":"IF(AND(K34=0,L34=0),\"\",IF(K34<L34,I32,I35))","v":""},null,null,null,null,null,null,null,null,null,null,null,null,38,{"$f":"IF(AND(Y68=0,Z68=0),\"\",IF(Y68>Z68,W66,W69))","v":""}]
[null,null,null,null,null,null,null,null,null,null,null,null,null,null,7,{"$f":"IF(AND(K40=0,L40=0),\"\",IF(K40<L40,I38,I41))","v":""},null,null,null,null,null,null,null,null,{"$f":"CU43","v":0},{"$f":"CV43","v":0},"Y-22",null,null,null,null,null,null,null,null,29,{"$f":"IF(AND(AF65=0,AG65=0),\"\",IF(AF65<AG65,AD62,AD67))","v":""},null,null,null,null,null,null,"10."]
[null,null,null,null,null,null,null,null,null,null,null,null,null,null,null,null,null,{"$f":"CU37","v":0},{"$f":"CV37","v":0},"Y-16",null,32,{"$f":"IF(AND(R69=0,S69=0),\"\",IF(R69>S69,P68,P70))","v":""}]
[null,null,null,null,null,null,null,null,null,null,null,null,null,null,8,{"$f":"IF(AND(K46=0,L46=0),\"\",IF(K46<L46,I44,I47))","v":""}]
[null,null,null,null,null,null,null,null,null,null,null,null,null,null,null,null,null,null,null,null,null,null,null,null,null,null,null,null,21,{"$f":"IF(AND(Y62=0,Z62=0),\"\",IF(Y62<Z62,W60,W63))","v":""}]
[null,null,null,null,null,null,null,null,null,null,null,null,null,null,null,null,null,null,null,null,null,null,null,null,null,null,null,null,null,null,null,{"$f":"CU51","v":0},{"$f":"+CV51","v":0},"Y-30",null,46,{"$f":"IF(AND(AF72=0,AG72=0),\"\",IF(AF72>AG72,AD71,AD73))","v":""},null,null,null,null,null,null,"11."]
[null,null,null,null,null,null,null,null,null,null,null,null,null,null,null,null,null,null,null,null,null,null,null,null,null,null,null,null,22,{"$f":"IF(AND(Y68=0,Z68=0),\"\",IF(Y68<Z68,W66,W69))","v":""}]
[null,null,null,null,null,null,null,null,null,null,null,null,null,null,null,null,null,null,null,null,null,13,{"$f":"IF(AND(R60=0,S60=0),\"\",IF(R60<S60,P59,P61))","v":""},null,null,null,null,null,null,null,null,null,null,null,null,30,{"$f":"IF(AND(AF72=0,AG72=0),\"\",IF(AF72<AG72,AD71,AD73))","v":""},null,null,null,null,null,null,"12."]
[null,null,null,null,null,null,null,null,null,null,null,null,null,null,null,null,null,null,null,null,null,null,null,null,{"$f":"CU44","v":0},{"$f":"+CV44","v":0},"Y-23",null,39,{"$f":"IF(AND(Y75=0,Z75=0),\"\",IF(Y75>Z75,W74,W76))","v":""}]
[null,null,null,null,null,null,null,null,null,null,null,null,null,null,null,null,null,null,null,null,null,14,{"$f":"IF(AND(R63=0,S63=0),\"\",IF(R63<S63,P62,P64))","v":""},null,null,null,null,null,null,null,null,null,null,null,null,47]
[null,null,null,null,null,null,null,null,null,null,null,null,null,null,null,null,null,null,null,null,null,null,null,null,null,null,null,null,null,null,null,{"$f":"CU52","v":0},{"$f":"+CV52","v":0},"Y-31",null,null,{"$f":"IF(AND(AF77=0,AG77=0),\"\",IF(AF77>AG77,AD75,AD79))","v":""},null,null,null,null,null,null,"13."]
[null,null,null,null,null,null,null,null,null,null,null,null,null,null,null,null,null,null,null,null,null,15,{"$f":"IF(AND(R66=0,S66=0),\"\",IF(R66<S66,P65,P67))","v":""}]
[null,null,null,null,null,null,null,null,null,null,null,null,null,null,null,null,null,null,null,null,null,null,null,null,{"$f":"CU45","v":0},{"$f":"+CV45","v":0},"Y-24",null,40,{"$f":"IF(AND(Y79=0,Z79=0),\"\",IF(Y79>Z79,W78,W80))","v":""}]
[null,null,null,null,null,null,null,null,null,null,null,null,null,null,null,null,null,null,null,null,null,16,{"$f":"IF(AND(R69=0,S69=0),\"\",IF(R69<S69,P68,P70))","v":""},null,null,null,null,null,null,null,null,null,null,null,null,31,{"$f":"IF(AND(AF77=0,AG77=0),\"\",IF(AF77<AG77,AD75,AD79))","v":""},null,null,null,null,null,null,"14."]
[null,null,null,null,null,null,null,null,null,null,null,null,null,null,null,null,null,null,null,null,null,null,null,null,null,null,null,null,23,{"$f":"IF(AND(Y75=0,Z75=0),\"\",IF(Y75<Z75,W74,W76))","v":""}]
[null,null,null,null,null,null,null,null,null,null,null,null,null,null,null,null,null,null,null,null,null,null,null,null,null,null,null,null,null,null,null,{"$f":"CU53","v":0},{"$f":"+CV53","v":0},"Y-32",null,48,{"$f":"IF(AND(AF82=0,AG82=0),\"\",IF(AF82>AG82,AD81,AD83))","v":""},null,null,null,null,null,null,"15."]
[null,null,null,null,null,null,null,null,null,null,null,null,null,null,null,null,null,null,null,null,null,null,null,null,null,null,null,null,24,{"$f":"IF(AND(Y79=0,Z79=0),\"\",IF(Y79<Z79,W78,W80))","v":""}]
[null,null,null,null,null,null,null,null,null,null,null,null,null,null,null,null,null,null,null,null,null,null,null,null,null,null,null,null,null,null,null,null,null,null,null,32,{"$f":"IF(AND(AF82=0,AG82=0),\"\",IF(AF82<AG82,AD81,AD83))","v":""},null,null,null,null,null,null,"16"]

{"sheet":"16","index":5,"n_rows":63,"n_cols":1217,"rows_kept":63,"cut":false,"hidden":true,"merged":[[61,22,61,28],[62,29,62,35],[56,15,56,21],[57,22,57,28],[58,15,58,21],[58,29,58,35],[59,22,59,28],[60,29,60,35],[55,29,55,35],[46,8,46,14],[46,29,46,35],[47,15,47,21],[48,8,48,14],[49,22,49,28],[50,29,50,35],[51,22,51,28],[52,15,52,21],[52,29,52,35],[53,22,53,28],[54,15,54,21],[45,8,45,14],[45,22,45,28],[36,29,36,35],[37,8,37,14],[38,15,38,21],[39,8,39,14],[40,8,40,14],[40,22,40,28],[41,15,41,21],[42,8,42,14],[43,8,43,14],[43,29,43,35],[44,15,44,21],[35,22,35,28],[26,15,26,21],[26,29,26,35],[27,22,27,28],[28,15,28,21],[29,29,29,35],[30,15,30,21],[31,22,31,28],[32,15,32,21],[32,29,32,35],[33,22,33,28],[34,29,34,35],[25,22,25,28],[18,1,18,7],[18,22,18,28],[18,29,18,35],[19,8,19,14],[20,1,20,7],[20,15,20,21],[21,1,21,7],[22,8,22,14],[23,1,23,7],[23,22,23,28],[24,29,24,35],[17,22,17,28],[9,1,9,7],[10,8,10,14],[11,1,11,7],[12,1,12,7],[14,1,14,7],[15,1,15,7],[15,15,15,21],[16,8,16,14],[17,1,17,7],[12,29,12,35],[13,8,13,14],[5,1,5,7],[6,1,6,7],[6,22,6,28],[7,8,7,14],[8,1,8,7],[8,15,8,21],[1,81,1,82],[1,83,1,84],[1,85,1,86],[2,1,2,7],[3,1,3,7],[3,15,3,21],[3,23,4,36],[4,8,4,14],[1,79,1,80],[0,1,0,7],[0,23,2,36],[1,8,1,14],[1,75,1,76],[1,77,1,78]]}
[1,{"$f":"IF(#REF!=2,#REF!,IF(#REF!=3,#REF!,IF(#REF!=4,#REF!,IF(#REF!=5,#REF!,IF(#REF!=6,#REF!)))))","v":{"$error":"#REF!"}},null,null,null,null,null,null,null,null,null,null,null,null,null,null,null,null,null,null,null,null,null,{"$f":"KATILIM!AC1","v":"TÜRKİYE MASA TENİSİ FEDERASYONU\nYILDIZLAR KUZEYDOĞU BÖLGE YARIŞMALARI"},null,null,null,null,null,null,null,null,null,null,null,null,null,null,null,null,null,null,null,null,null,null,null,null,null,null,null,null,null,null,null,null,null,null,null,null,null,null,null,null,null,null,null,null,null,null,null,null,null,null,null,null,null,null,null,null,null,null,null,null,null,null,null,null,null,null,null,null,null,null,null,null,null,null,null,null,null,null,null,"1st Round",1]
[null,null,null,{"$f":"CH3","v":0},{"$f":"CI3","v":0},"Y1",null,1,{"$f":"IF(AND(D2=0,E2=0),\"\",IF(D2>E2,B1,B3))","v":""},null,null,null,null,null,null,null,null,null,null,null,null,null,null,null,null,null,null,null,null,null,null,null,null,null,null,null,null,null,null,null,null,null,null,null,null,null,null,null,null,null,null,null,null,null,null,null,null,null,null,null,null,null,null,null,null,null,null,null,"#","Date","Time","Table","Competition","Player A","Player B","Set1",null,"Set2",null,"Set3",null,"Set4",null,"Set5",null,"Result",null,null,null,null,null,null,null,null,null,null,null,null,null,null,null,null,null,"2sn Round"]
[2,{"$f":"IF(#REF!=2,#REF!,IF(#REF!=3,#REF!,IF(#REF!=4,#REF!,IF(#REF!=5,#REF!,IF(#REF!=6,#REF!)))))","v":{"$error":"#REF!"}},null,null,null,null,null,null,null,null,null,null,null,null,9,null,null,null,null,null,null,null,null,null,null,null,null,null,null,null,null,null,null,null,null,null,null,null,null,null,null,null,null,null,null,null,null,null,null,null,null,null,null,null,null,null,null,null,null,null,null,null,null,null,null,null,null,null,1,null,null,null,null,{"$f":"B1","v":{"$error":"#REF!"}},{"$f":"B3","v":{"$error":"#REF!"}},null,null,null,null,null,null,null,null,null,null,null,null,null,null,null,null,null,null,null,null,null,null,null,null,null,null,null,null,"3th Round"]
[3,{"$f":"IF(#REF!=2,#REF!,IF(#REF!=3,#REF!,IF(#REF!=4,#REF!,IF(#REF!=5,#REF!,IF(#REF!=6,#REF!)))))","v":{"$error":"#REF!"}},null,null,null,null,null,null,null,null,{"$f":"CH11","v":0},{"$f":"CI11","v":0},"Y-A",null,null,{"$f":"IF(AND(K4=0,L4=0),\"\",IF(K4>L4,I2,I5))","v":""},null,null,null,null,null,null,null,{"$f":"KATILIM!AC2&\" \"&KATILIM!AE3","v":"KIZ TAKIM  [01-02 Mart 2025 SİVAS] [ Ana Tablo ]"},null,null,null,null,null,null,null,null,null,null,null,null,null,null,null,null,null,null,null,null,null,null,null,null,null,null,null,null,null,null,null,null,null,null,null,null,null,null,null,null,null,null,null,null,2,null,null,null,null,{"$f":"B4","v":{"$error":"#REF!"}},{"$f":"B6","v":{"$error":"#REF!"}},null,null,null,null,null,null,null,null,null,null,null,null,null,null,null,null,null,null,null,null,null,null,null,null,null,null,null,null,"4th Round"]
[null,null,null,{"$f":"CH4","v":0},{"$f":"CI4","v":0},"Y2",null,2,{"$f":"IF(AND(D5=0,E5=0),\"\",IF(D5>E5,B4,B6))","v":""},null,null,null,null,null,null,null,null,null,null,null,null,17,null,null,null,null,null,null,null,null,null,null,null,null,null,null,null,null,null,null,null,null,null,null,null,null,null,null,null,null,null,null,null,null,null,null,null,null,null,null,null,null,null,null,null,null,null,null,3,null,null,null,null,{"$f":"B7","v":{"$error":"#REF!"}},{"$f":"B9","v":{"$error":"#REF!"}}]
[4,{"$f":"IF(#REF!=2,#REF!,IF(#REF!=3,#REF!,IF(#REF!=4,#REF!,IF(#REF!=5,#REF!,IF(#REF!=6,#REF!)))))","v":{"$error":"#REF!"}},null,null,null,null,null,null,null,null,null,null,null,null,null,null,null,null,null,null,null,null,null,null,null,null,null,null,null,null,null,null,null,null,null,null,null,null,null,null,null,null,null,null,null,null,null,null,null,null,null,null,null,null,null,null,null,null,null,null,null,null,null,null,null,null,null,null,4,null,null,null,null,{"$f":"B10","v":{"$error":"#REF!"}},{"$f":"B12","v":{"$error":"#REF!"}}]
[5,{"$f":"IF(#REF!=2,#REF!,IF(#REF!=3,#REF!,IF(#REF!=4,#REF!,IF(#REF!=5,#REF!,IF(#REF!=6,#REF!)))))","v":{"$error":"#REF!"}},null,null,null,null,null,null,null,null,null,null,null,null,null,null,null,{"$f":"CH19","v":0},{"$f":"CI19","v":0},"Y-E",null,null,{"$f":"IF(AND(R7=0,S7=0),\"\",IF(R7>S7,P4,P9))","v":""},null,null,null,null,null,null,null,null,null,null,null,null,null,null,null,null,null,null,null,null,null,null,null,null,null,null,null,null,null,null,null,null,null,null,null,null,null,null,null,null,null,null,null,null,null,5,null,null,null,null,{"$f":"B13","v":{"$error":"#REF!"}},{"$f":"B15","v":{"$error":"#REF!"}}]
[null,null,null,{"$f":"CH5","v":0},{"$f":"CI5","v":0},"Y3",null,3,{"$f":"IF(AND(D8=0,E8=0),\"\",IF(D8>E8,B7,B9))","v":""},null,null,null,null,null,null,null,null,null,null,null,null,null,null,null,null,null,null,null,25,null,null,null,null,null,null,null,null,null,null,null,null,null,null,null,null,null,null,null,null,null,null,null,null,null,null,null,null,null,null,null,null,null,null,null,null,null,null,null,6,null,null,null,null,{"$f":"B16","v":{"$error":"#REF!"}},{"$f":"B18","v":{"$error":"#REF!"}}]
[6,{"$f":"IF(#REF!=2,#REF!,IF(#REF!=3,#REF!,IF(#REF!=4,#REF!,IF(#REF!=5,#REF!,IF(#REF!=6,#REF!)))))","v":{"$error":"#REF!"}},null,null,null,null,null,null,null,null,null,null,null,null,10,{"$f":"IF(AND(K10=0,L10=0),\"\",IF(K10>L10,I8,I11))","v":""},null,null,null,null,null,null,null,null,null,null,null,null,null,null,null,null,null,null,null,null,null,null,null,null,null,null,null,null,null,null,null,null,null,null,null,null,null,null,null,null,null,null,null,null,null,null,null,null,null,null,null,null,7,null,null,null,null,{"$f":"B19","v":{"$error":"#REF!"}},{"$f":"B21","v":{"$error":"#REF!"}}]
[7,{"$f":"IF(#REF!=2,#REF!,IF(#REF!=3,#REF!,IF(#REF!=4,#REF!,IF(#REF!=5,#REF!,IF(#REF!=6,#REF!)))))","v":{"$error":"#REF!"}},null,null,null,null,null,null,null,null,{"$f":"CH12","v":0},{"$f":"CI12","v":0},"Y-B",null,null,null,null,null,null,null,null,null,null,null,null,null,null,null,null,null,null,null,null,null,null,null,null,null,null,null,null,null,null,null,null,null,null,null,null,null,null,null,null,null,null,null,null,null,null,null,null,null,null,null,null,null,null,null,8,null,null,null,null,{"$f":"B22","v":{"$error":"#REF!"}},{"$f":"B24","v":{"$error":"#REF!"}}]
[null,null,null,{"$f":"CH6","v":0},{"$f":"CI6","v":0},"Y4",null,4,{"$f":"IF(AND(D11=0,E11=0),\"\",IF(D11>E11,B10,B12))","v":""},null,null,null,null,null,null,null,null,null,null,null,null,null,null,null,null,null,null,null,null,null,null,null,null,null,null,null,null,null,null,null,null,null,null,null,null,null,null,null,null,null,null,null,null,null,null,null,null,null,null,null,null,null,null,null,null,null,null,null,9,null,null,null,null,{"$f":"I2","v":""},{"$f":"I5","v":""}]
[8,{"$f":"IF(#REF!=2,#REF!,IF(#REF!=3,#REF!,IF(#REF!=4,#REF!,IF(#REF!=5,#REF!,IF(#REF!=6,#REF!)))))","v":{"$error":"#REF!"}},null,null,null,null,null,null,null,null,null,null,null,null,null,null,null,null,null,null,null,null,null,null,null,null,null,null,null,null,null,null,null,null,null,null,null,null,null,null,null,null,null,null,null,null,null,null,null,null,null,null,null,null,null,null,null,null,null,null,null,null,null,null,null,null,null,null,10,null,null,null,null,{"$f":"I8","v":""},{"$f":"I11","v":""}]
[9,{"$f":"IF(#REF!=2,#REF!,IF(#REF!=3,#REF!,IF(#REF!=4,#REF!,IF(#REF!=5,#REF!,IF(#REF!=6,#REF!)))))","v":{"$error":"#REF!"}},null,null,null,null,null,null,null,null,null,null,null,null,null,null,null,null,null,null,null,null,null,null,{"$f":"CH27","v":0},{"$f":"+CI27","v":0},"Y-I",null,null,{"$f":"IF(AND(Y13=0,Z13=0),\"\",IF(Y13>Z13,W7,W18))","v":""},null,null,null,null,null,null,"1.",null,null,null,null,null,null,null,null,null,null,null,null,null,null,null,null,null,null,null,null,null,null,null,null,null,null,null,null,null,null,null,11,null,null,null,null,{"$f":"I14","v":""},{"$f":"I17","v":""}]
[null,null,null,{"$f":"CH7","v":0},{"$f":"CI7","v":0},"Y5",null,5,{"$f":"IF(AND(D14=0,E14=0),\"\",IF(D14>E14,B13,B15))","v":""},null,null,null,null,null,null,null,null,null,null,null,null,null,null,null,null,null,null,null,null,null,null,null,null,null,null,null,null,null,null,null,null,null,null,null,null,null,null,null,null,null,null,null,null,null,null,null,null,null,null,null,null,null,null,null,null,null,null,null,12,null,null,null,null,{"$f":"I20","v":""},{"$f":"I23","v":""}]
[10,{"$f":"IF(#REF!=2,#REF!,IF(#REF!=3,#REF!,IF(#REF!=4,#REF!,IF(#REF!=5,#REF!,IF(#REF!=6,#REF!)))))","v":{"$error":"#REF!"}},null,null,null,null,null,null,null,null,null,null,null,null,11,null,null,null,null,null,null,null,null,null,null,null,null,null,null,null,null,null,null,null,null,null,null,null,null,null,null,null,null,null,null,null,null,null,null,null,null,null,null,null,null,null,null,null,null,null,null,null,null,null,null,null,null,null,13,null,null,null,null,{"$f":"+I38","v":""},{"$f":"+I40","v":""}]
[11,{"$f":"IF(#REF!=2,#REF!,IF(#REF!=3,#REF!,IF(#REF!=4,#REF!,IF(#REF!=5,#REF!,IF(#REF!=6,#REF!)))))","v":{"$error":"#REF!"}},null,null,null,null,null,null,null,null,{"$f":"CH13","v":0},{"$f":"CI13","v":0},"Y-C",null,null,{"$f":"IF(AND(K16=0,L16=0),\"\",IF(K16>L16,I14,I17))","v":""},null,null,null,null,null,null,null,null,null,null,null,null,null,null,null,null,null,null,null,null,null,null,null,null,null,null,null,null,null,null,null,null,null,null,null,null,null,null,null,null,null,null,null,null,null,null,null,null,null,null,null,null,14,null,null,null,null,{"$f":"+I41","v":""},{"$f":"+I43","v":""}]
[null,null,null,{"$f":"CH8","v":0},{"$f":"CI8","v":0},"Y6",null,6,{"$f":"IF(AND(D17=0,E17=0),\"\",IF(D17>E17,B16,B18))","v":""},null,null,null,null,null,null,null,null,null,null,null,null,18,null,null,null,null,null,null,null,null,null,null,null,null,null,null,null,null,null,null,null,null,null,null,null,null,null,null,null,null,null,null,null,null,null,null,null,null,null,null,null,null,null,null,null,null,null,null,15,null,null,null,null,{"$f":"+I44","v":""},{"$f":"+I46","v":""}]
[12,{"$f":"IF(#REF!=2,#REF!,IF(#REF!=3,#REF!,IF(#REF!=4,#REF!,IF(#REF!=5,#REF!,IF(#REF!=6,#REF!)))))","v":{"$error":"#REF!"}},null,null,null,null,null,null,null,null,null,null,null,null,null,null,null,null,null,null,null,null,{"$f":"IF(AND(R19=0,S19=0),\"\",IF(R19>S19,P16,P21))","v":""},null,null,null,null,null,null,null,null,null,null,null,null,null,null,null,null,null,null,null,null,null,null,null,null,null,null,null,null,null,null,null,null,null,null,null,null,null,null,null,null,null,null,null,null,null,16,null,null,null,null,{"$f":"+I49","v":""},{"$f":"+I49","v":""}]
[13,{"$f":"IF(#REF!=2,#REF!,IF(#REF!=3,#REF!,IF(#REF!=4,#REF!,IF(#REF!=5,#REF!,IF(#REF!=6,#REF!)))))","v":{"$error":"#REF!"}},null,null,null,null,null,null,null,null,null,null,null,null,null,null,null,{"$f":"CH20","v":0},{"$f":"CI20","v":0},"Y-F",null,null,null,null,null,null,null,null,null,{"$f":"IF(AND(Y13=0,Z13=0),\"\",IF(Y13<Z13,W7,W18))","v":""},null,null,null,null,null,null,"2.",null,null,null,null,null,null,null,null,null,null,null,null,null,null,null,null,null,null,null,null,null,null,null,null,null,null,null,null,null,null,null,17,null,null,null,null,{"$f":"P4","v":""},{"$f":"P9","v":""}]
[null,null,null,{"$f":"CH9","v":0},{"$f":"CI9","v":0},"Y7",null,7,{"$f":"IF(AND(D20=0,E20=0),\"\",IF(D20>E20,B19,B21))","v":""},null,null,null,null,null,null,null,null,null,null,null,null,null,null,null,null,null,null,null,null,null,null,null,null,null,null,null,null,null,null,null,null,null,null,null,null,null,null,null,null,null,null,null,null,null,null,null,null,null,null,null,null,null,null,null,null,null,null,null,18,null,null,null,null,{"$f":"P16","v":""},{"$f":"P21","v":""}]
[14,{"$f":"IF(#REF!=2,#REF!,IF(#REF!=3,#REF!,IF(#REF!=4,#REF!,IF(#REF!=5,#REF!,IF(#REF!=6,#REF!)))))","v":{"$error":"#REF!"}},null,null,null,null,null,null,null,null,null,null,null,null,12,{"$f":"IF(AND(K22=0,L22=0),\"\",IF(K22>L22,I20,I23))","v":""},null,null,null,null,null,null,null,null,null,null,null,null,null,null,null,null,null,null,null,null,null,null,null,null,null,null,null,null,null,null,null,null,null,null,null,null,null,null,null,null,null,null,null,null,null,null,null,null,null,null,null,null,19,null,null,null,null,{"$f":"P27","v":""},{"$f":"P29","v":""}]
[15,{"$f":"IF(#REF!=2,#REF!,IF(#REF!=3,#REF!,IF(#REF!=4,#REF!,IF(#REF!=5,#REF!,IF(#REF!=6,#REF!)))))","v":{"$error":"#REF!"}},null,null,null,null,null,null,null,null,{"$f":"CH14","v":0},{"$f":"CI14","v":0},"Y-D",null,null,null,null,null,null,null,null,null,null,null,null,null,null,null,null,null,null,null,null,null,null,null,null,null,null,null,null,null,null,null,null,null,null,null,null,null,null,null,null,null,null,null,null,null,null,null,null,null,null,null,null,null,null,null,20,null,null,null,null,{"$f":"P31","v":""},{"$f":"P33","v":""}]
[null,null,null,{"$f":"CH10","v":0},{"$f":"CI10","v":0},"Y8",null,8,{"$f":"IF(AND(D23=0,E23=0),\"\",IF(D23>E23,B22,B24))","v":""},null,null,null,null,null,null,null,null,null,null,null,null,null,null,null,null,null,null,null,null,null,null,null,null,null,null,null,null,null,null,null,null,null,null,null,null,null,null,null,null,null,null,null,null,null,null,null,null,null,null,null,null,null,null,null,null,null,null,null,21,null,null,null,null,{"$f":"P39","v":""},{"$f":"P42","v":""}]
[16,{"$f":"IF(#REF!=2,#REF!,IF(#REF!=3,#REF!,IF(#REF!=4,#REF!,IF(#REF!=5,#REF!,IF(#REF!=6,#REF!)))))","v":{"$error":"#REF!"}},null,null,null,null,null,null,null,null,null,null,null,null,null,null,null,null,null,null,null,"E",{"$f":"IF(AND(R7=0,S7=0),\"\",IF(R7<S7,P4,P9))","v":""},null,null,null,null,null,null,null,null,null,null,null,null,null,null,null,null,null,null,null,null,null,null,null,null,null,null,null,null,null,null,null,null,null,null,null,null,null,null,null,null,null,null,null,null,null,22,null,null,null,null,{"$f":"P45","v":""},{"$f":"P48","v":""}]
[null,null,null,null,null,null,null,null,null,null,null,null,null,null,null,null,null,null,null,null,null,null,null,null,{"$f":"CH28","v":0},{"$f":"+CI28","v":0},"Y-J",null,26,{"$f":"IF(AND(Y25=0,Z25=0),\"\",IF(Y25>Z25,W24,W26))","v":""},null,null,null,null,null,null,"3.",null,null,null,null,null,null,null,null,null,null,null,null,null,null,null,null,null,null,null,null,null,null,null,null,null,null,null,null,null,null,null,23,null,null,null,null,{"$f":"P53","v":""},{"$f":"P55","v":""},null,null,null,null,null,null,null,null,null,null,null,null,null,null,null,null,null,null,null,null,null,null,null,null,null,null,null,null,null,null,null,null,null,null,null,null,null,null,null,null,null,null,null,null,null,null,null,null,null,null,null,null,null,null,null,null,null,null,null,null,null,null,null,null,null,null,null,null,null,null,null,null,null,null,null,null,null,null,null,null,null,null,null,null,null,null,null,null,null,null,null,null,null,null,null,null,null,null,null,null,null,null,null,null,null,null,null,null,null,null,null,null,null,null,null,null,null,null,null,null,null,null,null,null,null,null,null,null,null,null,null,null,null,null,null,null,null,null,null,null,null,null,null,null,null,null,null,null,null,null,null,null,null,null,null,null,null,null,null,null,null,null,null,null,null,null,null,null,null,null,null,null,null,null,null,null,null,null,null,null,null,null,null,null,null,null,null,null,null,null,null,null,null,null,null,null,null,null,null,null,null,null,null,null,null,null,null,null,null,null,null,null,null,null,null,null,null,null,null,null,null,null,null,null,null,null,null,null,null,null,null,null,null,null,null,null,null,null,null,null,null,null,null,null,null,null,null,null,null,null,null,null,null,null,null,null,null,null,null,null,null,null,null,null,null,null,null,null,null,null,null,null,null,null,null,null,null,null,null,null,null,null,null,null,null,null,null,null,null,null,null,null,null,null,null,null,null,null,null,null,null,null,null,null,null,null,null,null,null,null,null,null,null,null,null,null,null,null,null,null,null,null,null,null,null,null,null,null,null,null,null,null,null,null,null,null,null,null,null,null,null,null,null,null,null,null,null,null,null,null,null,null,null,null,null,null,null,null,null,null,null,null,null,null,null,null,null,null,null,null,null,null,null,null,null,null,null,null,null,null,null,null,null,null,null,null,null,null,null,null,null,null,null,null,null,null,null,null,null,null,null,null,null,null,null,null,null,null,null,null,null,null,null,null,null,null,null,null,null,null,null,null,null,null,null,null,null,null,null,null,null,null,null,null,null,null,null,null,null,null,null,null,null,null,null,null,null,null,null,null,null,null,null,null,null,null,null,null,null,null,null,null,null,null,null,null,null,null,null,null,null,null,null,null,null,null,null,null,null,null,null,null,null,null,null,null,null,null,null,null,null,null,null,null,null,null,null,null,null,null,null,null,null,null,null,null,null,null,null,null,null,null,null,null,null,null,null,null,null,null,null,null,null,null,null,null,null,null,null,null,null,null,null,null,null,null,null,null,null,null,null,null,null,null,null,null,null,null,null,null,null,null,null,null,null,null,null,null,null,null,null,null,null,null,null,null,null,null,null,null,null,null,null,null,null,null,null,null,null,null,null,null,null,null,null,null,null,null,null,null,null,null,null,null,null,null,null,null,null,null,null,null,null,null,null,null,null,null,null,null,null,null,null,null,null,null,null,null,null,null,null,null,null,null,null,null,null,null,null,null,null,null,null,null,null,null,null,null,null,null,null,null,null,null,null,null,null,null,null,null,null,null,null,null,null,null,null,null,null,null,null,null,null,null,null,null,null,null,null,null,null,null,null,null,null,null,null,null,null,null,null,null,null,null,null,null,null,null,null,null,null,null,null,null,null,null,null,null,null,null,null,null,null,null,null,null,null,null,null,null,null,null,null,null,null,null,null,null,null,null,null,null,null,null,null,null,null,null,null,null,null,null,null,null,null,null,null,null,null,null,null,null,null,null,null,null,null,null,null,null,null,null,null,null,null,null,null,null,null,null,null,null,null,null,null,null,null,null,null,null,null,null,null,null,null,null,null,null,null,null,null,null,null,null,null,null,null,null,null,null,null,null,null,null,null,null,null,null,null,null,null,null,null,null,null,null,null,null,null,null,null,null,null,null,null,null,null,null,null,null,null,null,null,null,null,null,null,null,null,null,null,null,null,null,null,null,null,null,null,null,null,null,null,null,null,null,null,null,null,null,null,null,null,null,null,null,null,null,null,null,null,null,null,null,null,null,null,null,null,null,null,null,null,null,null,null,null,null,null,null,null,null,null,null,null,null,null,null,null,null,null,null,null,null,null,null,null,null,null,null,null,null,null,null,null,null,null,null,null,null,null,null,null,null,null,null,null,null,null,null,null,null,null,null,null,null,null,null,null,null,null,null,null,null,null,null,null,null,null,null,null,null,null,null,null,null,null,null,null,null,null,null,null,null,null,null,null,null,null,null,null,null,null,null,null,null,null,null,null,null,null,null,null,null,null,null,null,null,null,null,null,null,null,null,null,null,null,null,null,null,null,null,null,null,null,null,null,null,null,null,null,null,null,null,null,null,null,null,null,null,null,null,null,null,null,null,null,null,null,null,null,null,null,null,null,null,null,null,null,null,null,null,null,null,null,null,null,null,null,null,null,null,null,null,null,null,null,null,null,null,null,null,null,null,null,null,null,null,null,null,null,null,null,null,null,null,null,null,null,null,null,null,null,null,null,null,null,null,null,null,null,null,null,null,null,null,null,null,null,null,null,null,null,null,null,null,null,null,null,null,null,null,null,null,null,null,null,null,null,null,null,null,null,null,null,null,null,null,null,null,null,null,null,null,null,null,null,null,null,null,null,null,null,null,null,null,null,null,null,null,null,0]
[null,null,null,null,null,null,null,null,null,null,null,null,null,null,null,null,null,null,null,null,null,"F",{"$f":"IF(AND(R19=0,S19=0),\"\",IF(R19<S19,P16,P21))","v":""},null,null,null,null,null,null,null,null,null,null,null,null,null,null,null,null,null,null,null,null,null,null,null,null,null,null,null,null,null,null,null,null,null,null,null,null,null,null,null,null,null,null,null,null,null,24,null,null,null,null,{"$f":"P57","v":""},{"$f":"P59","v":""}]
[null,null,null,null,null,null,null,null,null,null,null,null,null,null,"A",{"$f":"IF(AND(K4=0,L4=0),\"\",IF(K4<L4,I2,I5))","v":""},null,null,null,null,null,null,null,null,null,null,null,null,"J",{"$f":"IF(AND(Y25=0,Z25=0),\"\",IF(Y25<Z25,W24,W26))","v":""},null,null,null,null,null,null,"4.",null,null,null,null,null,null,null,null,null,null,null,null,null,null,null,null,null,null,null,null,null,null,null,null,null,null,null,null,null,null,null,25,null,null,null,null,{"$f":"W7","v":""},{"$f":"W18","v":""}]
[null,null,null,null,null,null,null,null,null,null,null,null,null,null,null,null,null,{"$f":"CH21","v":0},{"$f":"+CI21","v":0},"Y-G",null,19,{"$f":"IF(AND(R28=0,S28=0),\"\",IF(R28>S28,P27,P29))","v":""},null,null,null,null,null,null,null,null,null,null,null,null,null,null,null,null,null,null,null,null,null,null,null,null,null,null,null,null,null,null,null,null,null,null,null,null,null,null,null,null,null,null,null,null,null,26,null,null,null,null,{"$f":"W24","v":""},{"$f":"W26","v":""}]
[null,null,null,null,null,null,null,null,null,null,null,null,null,null,"B",{"$f":"IF(AND(K10=0,L10=0),\"\",IF(K10<L10,I8,I11))","v":""},null,null,null,null,null,null,null,null,null,null,null,null,27,null,null,null,null,null,null,null,null,null,null,null,null,null,null,null,null,null,null,null,null,null,null,null,null,null,null,null,null,null,null,null,null,null,null,null,null,null,null,null,27,null,null,null,null,{"$f":"W28","v":""},{"$f":"W32","v":""}]
[null,null,null,null,null,null,null,null,null,null,null,null,null,null,null,null,null,null,null,null,null,null,null,null,{"$f":"CH29","v":0},{"$f":"+CI29","v":0},"Y-K",null,null,{"$f":"IF(AND(Y30=0,Z30=0),\"\",IF(Y30>Z30,W28,W32))","v":""},null,null,null,null,null,null,"5.",null,null,null,null,null,null,null,null,null,null,null,null,null,null,null,null,null,null,null,null,null,null,null,null,null,null,null,null,null,null,null,28,null,null,null,null,{"$f":"W34","v":""},{"$f":"W36","v":""}]
[null,null,null,null,null,null,null,null,null,null,null,null,null,null,"C",{"$f":"IF(AND(K16=0,L16=0),\"\",IF(K16<L16,I14,I17))","v":""},null,null,null,null,null,null,null,null,null,null,null,null,null,null,null,null,null,null,null,null,null,null,null,null,null,null,null,null,null,null,null,null,null,null,null,null,null,null,null,null,null,null,null,null,null,null,null,null,null,null,null,null,29,null,null,null,null,{"$f":"W41","v":""},{"$f":"W46","v":""}]
[null,null,null,null,null,null,null,null,null,null,null,null,null,null,null,null,null,{"$f":"CH22","v":0},{"$f":"+CI22","v":0},"Y-H",null,20,{"$f":"IF(AND(R32=0,S32=0),\"\",IF(R32>S32,P31,P33))","v":""},null,null,null,null,null,null,null,null,null,null,null,null,null,null,null,null,null,null,null,null,null,null,null,null,null,null,null,null,null,null,null,null,null,null,null,null,null,null,null,null,null,null,null,null,null,30,null,null,null,null,{"$f":"W50","v":""},{"$f":"W52","v":""}]
[null,null,null,null,null,null,null,null,null,null,null,null,null,null,"D",{"$f":"IF(AND(K22=0,L22=0),\"\",IF(K22<L22,I20,I23))","v":""},null,null,null,null,null,null,null,null,null,null,null,null,"K",{"$f":"IF(AND(Y30=0,Z30=0),\"\",IF(Y30<Z30,W28,W32))","v":""},null,null,null,null,null,null,"6.",null,null,null,null,null,null,null,null,null,null,null,null,null,null,null,null,null,null,null,null,null,null,null,null,null,null,null,null,null,null,null,31,null,null,null,null,{"$f":"W54","v":""},{"$f":"W58","v":""}]
[null,null,null,null,null,null,null,null,null,null,null,null,null,null,null,null,null,null,null,null,null,"G",{"$f":"IF(AND(R28=0,S28=0),\"\",IF(R28<S28,P27,P29))","v":""},null,null,null,null,null,null,null,null,null,null,null,null,null,null,null,null,null,null,null,null,null,null,null,null,null,null,null,null,null,null,null,null,null,null,null,null,null,null,null,null,null,null,null,null,null,32,null,null,null,null,{"$f":"W60","v":""},{"$f":"W62","v":""}]
[null,null,null,null,null,null,null,null,null,null,null,null,null,null,null,null,null,null,null,null,null,null,null,null,{"$f":"CH30","v":0},{"$f":"+CI30","v":0},"Y-L",null,28,{"$f":"IF(AND(Y35=0,Z35=0),\"\",IF(Y35>Z35,W34,W36))","v":""},null,null,null,null,null,null,"7."]
[null,null,null,null,null,null,null,null,null,null,null,null,null,null,null,null,null,null,null,null,null,"H",{"$f":"IF(AND(R32=0,S32=0),\"\",IF(R32<S32,P31,P33))","v":""}]
[null,null,null,null,null,null,null,null,null,null,null,null,null,null,null,null,null,null,null,null,null,null,null,null,null,null,null,null,"L",{"$f":"IF(AND(Y35=0,Z35=0),\"\",IF(Y35<Z35,W34,W36))","v":""},null,null,null,null,null,null,"8."]
[null,null,null,null,null,null,null,"Y1",{"$f":"IF(AND(D2=0,E2=0),\"\",IF(D2<E2,B1,B3))","v":""}]
[null,null,null,null,null,null,null,null,null,null,{"$f":"CH15","v":0},{"$f":"CI15","v":0},"Y9",null,13,{"$f":"IF(AND(K39=0,L39=0),\"\",IF(K39>L39,I38,I40))","v":""}]
[null,null,null,null,null,null,null,"Y2",{"$f":"IF(AND(D5=0,E5=0),\"\",IF(D5<E5,B4,B6))","v":""},null,null,null,null,null,null,null,null,null,null,null,null,21]
[null,null,null,null,null,null,null,"Y3",{"$f":"IF(AND(D8=0,E8=0),\"\",IF(D8<E8,B7,B9))","v":""},null,null,null,null,null,null,null,null,{"$f":"CH23","v":0},{"$f":"CI23","v":0},"Y13",null,null,{"$f":"IF(AND(R41=0,S41=0),\"\",IF(R41>S41,P39,P42))","v":""}]
[null,null,null,null,null,null,null,null,null,null,{"$f":"CH16","v":0},{"$f":"CI16","v":0},"Y10",null,14,{"$f":"IF(AND(K42=0,L42=0),\"\",IF(K42>L42,I41,I43))","v":""},null,null,null,null,null,null,null,null,null,null,null,null,29]
[null,null,null,null,null,null,null,"Y4",{"$f":"IF(AND(D11=0,E11=0),\"\",IF(D11<E11,B10,B12))","v":""}]
[null,null,null,null,null,null,null,"Y5",{"$f":"IF(AND(D14=0,E14=0),\"\",IF(D14<E14,B13,B15))","v":""},null,null,null,null,null,null,null,null,null,null,null,null,null,null,null,{"$f":"CH31","v":0},{"$f":"CI31","v":0},"Y17",null,null,{"$f":"IF(AND(Y44=0,Z44=0),\"\",IF(Y44>Z44,W41,W46))","v":""},null,null,null,null,null,null,"9."]
[null,null,null,null,null,null,null,null,null,null,{"$f":"CH17","v":0},{"$f":"CI17","v":0},"Y11",null,15,{"$f":"IF(AND(K45=0,L45=0),\"\",IF(K45>L45,I44,I46))","v":""}]
[null,null,null,null,null,null,null,"Y6",{"$f":"IF(AND(D17=0,E17=0),\"\",IF(D17<E17,B16,B18))","v":""},null,null,null,null,null,null,null,null,null,null,null,null,22,{"$f":"IF(AND(R47=0,S47=0),\"\",IF(R47>S47,P45,P48))","v":""}]
[null,null,null,null,null,null,null,"Y7",{"$f":"IF(AND(D20=0,E20=0),\"\",IF(D20<E20,B19,B21))","v":""},null,null,null,null,null,null,null,null,{"$f":"CH24","v":0},{"$f":"CI24","v":0},"Y14",null,null,null,null,null,null,null,null,"Y17",{"$f":"IF(AND(Y44=0,Z44=0),\"\",IF(Y44<Z44,W41,W46))","v":""},null,null,null,null,null,null,"10."]
[null,null,null,null,null,null,null,null,null,null,{"$f":"CH18","v":0},{"$f":"CI18","v":0},"Y12",null,16,{"$f":"IF(AND(K48=0,L48=0),\"\",IF(K48>L48,I47,I49))","v":""}]
[null,null,null,null,null,null,null,"Y8",{"$f":"IF(AND(D23=0,E23=0),\"\",IF(D23<E23,B22,B24))","v":""}]
[null,null,null,null,null,null,null,null,null,null,null,null,null,null,null,null,null,null,null,null,null,"E",{"$f":"IF(AND(R41=0,S41=0),\"\",IF(R41<S41,P39,P42))","v":""}]
[null,null,null,null,null,null,null,null,null,null,null,null,null,null,null,null,null,null,null,null,null,null,null,null,{"$f":"CH32","v":0},{"$f":"+CI32","v":0},"Y18",null,30,{"$f":"IF(AND(Y51=0,Z51=0),\"\",IF(Y51>Z51,W50,W52))","v":""},null,null,null,null,null,null,"11."]
[null,null,null,null,null,null,null,null,null,null,null,null,null,null,null,null,null,null,null,null,null,"F",{"$f":"IF(AND(R47=0,S47=0),\"\",IF(R47<S47,P45,P48))","v":""}]
[null,null,null,null,null,null,null,null,null,null,null,null,null,null,"Y1",{"$f":"IF(AND(K39=0,L39=0),\"\",IF(K39<L39,I38,I40))","v":""},null,null,null,null,null,null,null,null,null,null,null,null,"Y18",{"$f":"IF(AND(Y51=0,Z51=0),\"\",IF(Y51<Z51,W50,W52))","v":""},null,null,null,null,null,null,"12."]
[null,null,null,null,null,null,null,null,null,null,null,null,null,null,null,null,null,{"$f":"CH25","v":0},{"$f":"+CI25","v":0},"Y15",null,23,{"$f":"IF(AND(R54=0,S54=0),\"\",IF(R54>S54,P53,P55))","v":""}]
[null,null,null,null,null,null,null,null,null,null,null,null,null,null,"Y2",{"$f":"IF(AND(K42=0,L42=0),\"\",IF(K42<L42,I41,I43))","v":""},null,null,null,null,null,null,null,null,null,null,null,null,31]
[null,null,null,null,null,null,null,null,null,null,null,null,null,null,null,null,null,null,null,null,null,null,null,null,{"$f":"CH33","v":0},{"$f":"+CI33","v":0},"Y19",null,null,{"$f":"IF(AND(Y56=0,Z56=0),\"\",IF(Y56>Z56,W54,W58))","v":""},null,null,null,null,null,null,"13."]
[null,null,null,null,null,null,null,null,null,null,null,null,null,null,"Y3",{"$f":"IF(AND(K45=0,L45=0),\"\",IF(K45<L45,I44,I46))","v":""}]
[null,null,null,null,null,null,null,null,null,null,null,null,null,null,null,null,null,{"$f":"CH26","v":0},{"$f":"+CI26","v":0},"Y16",null,24,{"$f":"IF(AND(R58=0,S58=0),\"\",IF(R58>S58,P57,P59))","v":""}]
[null,null,null,null,null,null,null,null,null,null,null,null,null,null,"Y4",{"$f":"IF(AND(K48=0,L48=0),\"\",IF(K48<L48,I47,I49))","v":""},null,null,null,null,null,null,null,null,null,null,null,null,"Y19",{"$f":"IF(AND(Y56=0,Z56=0),\"\",IF(Y56<Z56,W54,W58))","v":""},null,null,null,null,null,null,"14."]
[null,null,null,null,null,null,null,null,null,null,null,null,null,null,null,null,null,null,null,null,null,"Y15",{"$f":"IF(AND(R54=0,S54=0),\"\",IF(R54<S54,P53,P55))","v":""}]
[null,null,null,null,null,null,null,null,null,null,null,null,null,null,null,null,null,null,null,null,null,null,null,null,{"$f":"CH34","v":0},{"$f":"+CI34","v":0},"Y20",null,32,{"$f":"IF(AND(Y61=0,Z61=0),\"\",IF(Y61>Z61,W60,W62))","v":""},null,null,null,null,null,null,"15."]
[null,null,null,null,null,null,null,null,null,null,null,null,null,null,null,null,null,null,null,null,null,"Y16",{"$f":"IF(AND(R58=0,S58=0),\"\",IF(R58<S58,P57,P59))","v":""}]
[null,null,null,null,null,null,null,null,null,null,null,null,null,null,null,null,null,null,null,null,null,null,null,null,null,null,null,null,"Y20",{"$f":"IF(AND(Y61=0,Z61=0),\"\",IF(Y61<Z61,W60,W62))","v":""},null,null,null,null,null,null,"16"]

{"sheet":"16DE","index":6,"n_rows":63,"n_cols":1217,"rows_kept":63,"cut":false,"hidden":true,"merged":[[8,1,8,7],[8,15,8,21],[9,1,9,7],[10,8,10,14],[11,1,11,7],[7,8,7,14],[0,1,0,7],[0,24,2,46],[1,8,1,14],[2,1,2,7],[3,1,3,7],[3,15,3,21],[4,8,4,14],[5,1,5,7],[6,1,6,7],[6,22,6,28],[3,24,4,46],[19,8,19,14],[19,43,19,49],[12,50,12,56],[13,8,13,14],[14,1,14,7],[15,1,15,7],[15,15,15,21],[16,8,16,14],[12,1,12,7],[17,1,17,7],[17,22,17,28],[18,1,18,7],[18,22,18,28],[20,1,20,7],[20,15,20,21],[21,1,21,7],[22,8,22,14],[23,1,23,7],[23,29,23,35],[24,15,24,21],[24,50,24,56],[25,8,25,14],[25,22,25,28],[25,36,25,42],[30,15,30,21],[30,50,30,55],[31,8,31,14],[31,29,31,35],[32,15,32,21],[26,15,26,21],[27,8,27,14],[27,29,27,35],[28,15,28,21],[29,8,29,14],[29,22,29,28],[38,15,38,21],[38,36,38,42],[33,8,33,14],[33,22,33,28],[33,36,33,42],[34,15,34,21],[36,15,36,21],[36,36,36,42],[37,8,37,14],[37,22,37,28],[35,8,35,14],[35,29,35,35],[39,8,39,14],[39,43,39,49],[40,29,40,35],[41,36,41,42],[42,29,42,35],[43,22,43,28],[43,36,43,42],[44,29,44,35],[45,22,45,28],[62,29,62,35],[54,15,54,21],[55,29,55,35],[56,15,56,21],[57,22,57,28],[58,15,58,21],[58,29,58,35],[50,29,50,35],[51,36,51,42],[52,15,52,21],[52,29,52,35],[53,22,53,28],[53,36,53,42],[1,85,1,86],[1,75,1,76],[1,77,1,78],[1,79,1,80],[1,81,1,82],[1,83,1,84],[59,22,59,28],[60,29,60,35],[61,22,61,28],[37,43,37,49],[49,22,49,28],[49,36,49,42],[46,36,46,42],[47,22,47,28],[48,29,48,35],[34,43,34,49],[29,43,29,49],[18,57,18,63],[25,57,25,63]]}
[1,{"$f":"IF(#REF!=2,#REF!,IF(#REF!=3,#REF!,IF(#REF!=4,#REF!,IF(#REF!=5,#REF!,IF(#REF!=6,#REF!)))))","v":{"$error":"#REF!"}},null,null,null,null,null,null,null,null,null,null,null,null,null,null,null,null,null,null,null,null,null,null,{"$f":"KATILIM!AC1","v":"TÜRKİYE MASA TENİSİ FEDERASYONU\nYILDIZLAR KUZEYDOĞU BÖLGE YARIŞMALARI"},null,null,null,null,null,null,null,null,null,null,null,null,null,null,null,null,null,null,null,null,null,null,null,null,null,null,null,null,null,null,null,null,null,null,null,null,null,null,null,null,null,null,null,null,null,null,null,null,null,null,null,null,null,null,null,null,null,null,null,null,null,null,null,null,null,null,null,null,null,null,null,null,null,null,null,null,null,null,"1st Round",1]
[null,null,null,{"$f":"CH3","v":0},{"$f":"CI3","v":0},"Y1",null,1,{"$f":"IF(AND(D2=0,E2=0),\"\",IF(D2>E2,B1,B3))","v":""},null,null,null,null,null,null,null,null,null,null,null,null,null,null,null,null,null,null,null,null,null,null,null,null,null,null,null,null,null,null,null,null,null,null,null,null,null,null,null,null,null,null,null,null,null,null,null,null,null,null,null,null,null,null,null,null,null,null,null,"#","Date","Time","Table","Competition","Player A","Player B","Set1",null,"Set2",null,"Set3",null,"Set4",null,"Set5",null,"Result",null,null,null,null,null,null,null,null,null,null,null,null,null,null,null,null,null,"2sn Round"]
[2,{"$f":"IF(#REF!=2,#REF!,IF(#REF!=3,#REF!,IF(#REF!=4,#REF!,IF(#REF!=5,#REF!,IF(#REF!=6,#REF!)))))","v":{"$error":"#REF!"}},null,null,null,null,null,null,null,null,null,null,null,null,9,null,null,null,null,null,null,null,null,null,null,null,null,null,null,null,null,null,null,null,null,null,null,null,null,null,null,null,null,null,null,null,null,null,null,null,null,null,null,null,null,null,null,null,null,null,null,null,null,null,null,null,null,null,1,null,null,null,null,{"$f":"B1","v":{"$error":"#REF!"}},{"$f":"B3","v":{"$error":"#REF!"}},null,null,null,null,null,null,null,null,null,null,null,null,null,null,null,null,null,null,null,null,null,null,null,null,null,null,null,null,"3th Round"]
[3,{"$f":"IF(#REF!=2,#REF!,IF(#REF!=3,#REF!,IF(#REF!=4,#REF!,IF(#REF!=5,#REF!,IF(#REF!=6,#REF!)))))","v":{"$error":"#REF!"}},null,null,null,null,null,null,null,null,{"$f":"CH11","v":0},{"$f":"CI11","v":0},"Y9",null,null,{"$f":"IF(AND(K4=0,L4=0),\"\",IF(K4>L4,I2,I5))","v":""},null,null,null,null,null,null,null,null,{"$f":"KATILIM!AC2&\" \"&KATILIM!AE3","v":"KIZ TAKIM  [01-02 Mart 2025 SİVAS] [ Ana Tablo ]"},null,null,null,null,null,null,null,null,null,null,null,null,null,null,null,null,null,null,null,null,null,null,null,null,null,null,null,null,null,null,null,null,null,null,null,null,null,null,null,null,null,null,null,2,null,null,null,null,{"$f":"B4","v":{"$error":"#REF!"}},{"$f":"B6","v":{"$error":"#REF!"}},null,null,null,null,null,null,null,null,null,null,null,null,null,null,null,null,null,null,null,null,null,null,null,null,null,null,null,null,"4th Round"]
[null,null,null,{"$f":"CH4","v":0},{"$f":"CI4","v":0},"Y2",null,2,{"$f":"IF(AND(D5=0,E5=0),\"\",IF(D5>E5,B4,B6))","v":""},null,null,null,null,null,null,null,null,null,null,null,null,17,null,null,null,null,null,null,null,null,null,null,null,null,null,null,null,null,null,null,null,null,null,null,null,null,null,null,null,null,null,null,null,null,null,null,null,null,null,null,null,null,null,null,null,null,null,null,3,null,null,null,null,{"$f":"B7","v":{"$error":"#REF!"}},{"$f":"B9","v":{"$error":"#REF!"}},null,null,null,null,null,null,null,null,null,null,null,null,null,null,null,null,null,null,null,null,null,null,null,null,null,null,null,null,"5th Round"]
[4,{"$f":"IF(#REF!=2,#REF!,IF(#REF!=3,#REF!,IF(#REF!=4,#REF!,IF(#REF!=5,#REF!,IF(#REF!=6,#REF!)))))","v":{"$error":"#REF!"}},null,null,null,null,null,null,null,null,null,null,null,null,null,null,null,null,null,null,null,null,null,null,null,null,null,null,null,null,null,null,null,null,null,null,null,null,null,null,null,null,null,null,null,null,null,null,null,null,null,null,null,null,null,null,null,null,null,null,null,null,null,null,null,null,null,null,4,null,null,null,null,{"$f":"B10","v":{"$error":"#REF!"}},{"$f":"B12","v":{"$error":"#REF!"}},null,null,null,null,null,null,null,null,null,null,null,null,null,null,null,null,null,null,null,null,null,null,null,null,null,null,null,null,"6th Round"]
[5,{"$f":"IF(#REF!=2,#REF!,IF(#REF!=3,#REF!,IF(#REF!=4,#REF!,IF(#REF!=5,#REF!,IF(#REF!=6,#REF!)))))","v":{"$error":"#REF!"}},null,null,null,null,null,null,null,null,null,null,null,null,null,null,null,{"$f":"CH19","v":0},{"$f":"CI19","v":0},"Y17",null,null,{"$f":"IF(AND(R7=0,S7=0),\"\",IF(R7>S7,P4,P9))","v":""},null,null,null,null,null,null,null,null,null,null,null,null,null,null,null,null,null,null,null,null,null,null,null,null,null,null,null,null,null,null,null,null,null,null,null,null,null,null,null,null,null,null,null,null,null,5,null,null,null,null,{"$f":"B13","v":{"$error":"#REF!"}},{"$f":"B15","v":{"$error":"#REF!"}},null,null,null,null,null,null,null,null,null,null,null,null,null,null,null,null,null,null,null,null,null,null,null,null,null,null,null,null,"7th Round"]
[null,null,null,{"$f":"CH5","v":0},{"$f":"CI5","v":0},"Y3",null,3,{"$f":"IF(AND(D8=0,E8=0),\"\",IF(D8>E8,B7,B9))","v":""},null,null,null,null,null,null,null,null,null,null,null,null,null,null,null,null,null,null,null,25,null,null,null,null,null,null,null,null,null,null,null,null,null,null,null,null,null,null,null,null,null,null,null,null,null,null,null,null,null,null,null,null,null,null,null,null,null,null,null,6,null,null,null,null,{"$f":"B16","v":{"$error":"#REF!"}},{"$f":"B18","v":{"$error":"#REF!"}},null,null,null,null,null,null,null,null,null,null,null,null,null,null,null,null,null,null,null,null,null,null,null,null,null,null,null,null,"8th Round"]
[6,{"$f":"IF(#REF!=2,#REF!,IF(#REF!=3,#REF!,IF(#REF!=4,#REF!,IF(#REF!=5,#REF!,IF(#REF!=6,#REF!)))))","v":{"$error":"#REF!"}},null,null,null,null,null,null,null,null,null,null,null,null,10,{"$f":"IF(AND(K10=0,L10=0),\"\",IF(K10>L10,I8,I11))","v":""},null,null,null,null,null,null,null,null,null,null,null,null,null,null,null,null,null,null,null,null,null,null,null,null,null,null,null,null,null,null,null,null,null,null,null,null,null,null,null,null,null,null,null,null,null,null,null,null,null,null,null,null,7,null,null,null,null,{"$f":"B19","v":{"$error":"#REF!"}},{"$f":"B21","v":{"$error":"#REF!"}}]
[7,{"$f":"IF(#REF!=2,#REF!,IF(#REF!=3,#REF!,IF(#REF!=4,#REF!,IF(#REF!=5,#REF!,IF(#REF!=6,#REF!)))))","v":{"$error":"#REF!"}},null,null,null,null,null,null,null,null,{"$f":"CH12","v":0},{"$f":"CI12","v":0},"Y10",null,null,null,null,null,null,null,null,null,null,null,null,null,null,null,null,null,null,null,null,null,null,null,null,null,null,null,null,null,null,null,null,null,null,null,null,null,null,null,null,null,null,null,null,null,null,null,null,null,null,null,null,null,null,null,8,null,null,null,null,{"$f":"B22","v":{"$error":"#REF!"}},{"$f":"B24","v":{"$error":"#REF!"}}]
[null,null,null,{"$f":"CH6","v":0},{"$f":"CI6","v":0},"Y4",null,4,{"$f":"IF(AND(D11=0,E11=0),\"\",IF(D11>E11,B10,B12))","v":""},null,null,null,null,null,null,null,null,null,null,null,null,null,null,null,null,null,null,null,null,null,null,null,null,null,null,null,null,null,null,null,null,null,null,null,null,null,null,null,null,null,null,null,null,null,null,null,null,null,null,null,null,null,null,null,null,null,null,null,9,null,null,null,null,{"$f":"I2","v":""},{"$f":"I5","v":""}]
[8,{"$f":"IF(#REF!=2,#REF!,IF(#REF!=3,#REF!,IF(#REF!=4,#REF!,IF(#REF!=5,#REF!,IF(#REF!=6,#REF!)))))","v":{"$error":"#REF!"}},null,null,null,null,null,null,null,null,null,null,null,null,null,null,null,null,null,null,null,null,null,null,null,null,null,null,null,null,null,null,null,null,null,null,null,null,null,null,null,null,null,null,null,null,null,null,null,null,null,null,null,null,null,null,null,null,null,null,null,null,null,null,null,null,null,null,10,null,null,null,null,{"$f":"I8","v":""},{"$f":"I11","v":""}]
[9,{"$f":"IF(#REF!=2,#REF!,IF(#REF!=3,#REF!,IF(#REF!=4,#REF!,IF(#REF!=5,#REF!,IF(#REF!=6,#REF!)))))","v":{"$error":"#REF!"}},null,null,null,null,null,null,null,null,null,null,null,null,null,null,null,null,null,null,null,null,null,null,{"$f":"CH27","v":0},{"$f":"+CI27","v":0},"Y25",null,null,null,null,null,null,null,null,null,null,null,null,null,null,null,null,null,null,null,null,null,null,null,{"$f":"IF(AND(Y13=0,Z13=0),\"\",IF(Y13>Z13,W7,W18))","v":""},null,null,null,null,null,null,null,null,null,null,null,null,null,null,null,null,null,11,null,null,null,null,{"$f":"I14","v":""},{"$f":"I17","v":""}]
[null,null,null,{"$f":"CH7","v":0},{"$f":"CI7","v":0},"Y5",null,5,{"$f":"IF(AND(D14=0,E14=0),\"\",IF(D14>E14,B13,B15))","v":""},null,null,null,null,null,null,null,null,null,null,null,null,null,null,null,null,null,null,null,null,null,null,null,null,null,null,null,null,null,null,null,null,null,null,null,null,null,null,null,null,null,null,null,null,null,null,null,40,null,null,null,null,null,null,null,null,null,null,null,12,null,null,null,null,{"$f":"I20","v":""},{"$f":"I23","v":""}]
[10,{"$f":"IF(#REF!=2,#REF!,IF(#REF!=3,#REF!,IF(#REF!=4,#REF!,IF(#REF!=5,#REF!,IF(#REF!=6,#REF!)))))","v":{"$error":"#REF!"}},null,null,null,null,null,null,null,null,null,null,null,null,11,null,null,null,null,null,null,null,null,null,null,null,null,null,null,null,null,null,null,null,null,null,null,null,null,null,null,null,null,null,null,null,null,null,null,null,null,null,null,null,null,null,null,null,null,null,null,null,null,null,null,null,null,null,13,null,null,null,null,{"$f":"I26","v":""},{"$f":"I28","v":""}]
[11,{"$f":"IF(#REF!=2,#REF!,IF(#REF!=3,#REF!,IF(#REF!=4,#REF!,IF(#REF!=5,#REF!,IF(#REF!=6,#REF!)))))","v":{"$error":"#REF!"}},null,null,null,null,null,null,null,null,{"$f":"CH13","v":0},{"$f":"CI13","v":0},"Y11",null,null,{"$f":"IF(AND(K16=0,L16=0),\"\",IF(K16>L16,I14,I17))","v":""},null,null,null,null,null,null,null,null,null,null,null,null,null,null,null,null,null,null,null,null,null,null,null,null,null,null,null,null,null,null,null,null,null,null,null,null,null,null,null,null,null,null,null,null,null,null,null,null,null,null,null,null,14,null,null,null,null,{"$f":"I30","v":""},{"$f":"I32","v":""}]
[null,null,null,{"$f":"CH8","v":0},{"$f":"CI8","v":0},"Y6",null,6,{"$f":"IF(AND(D17=0,E17=0),\"\",IF(D17>E17,B16,B18))","v":""},null,null,null,null,null,null,null,null,null,null,null,null,18,null,null,null,null,null,null,null,null,null,null,null,null,null,null,null,null,null,null,null,null,null,null,null,null,null,null,null,null,null,null,null,null,null,null,null,null,null,null,null,null,null,null,null,null,null,null,15,null,null,null,null,{"$f":"I34","v":""},{"$f":"I36","v":""}]
[12,{"$f":"IF(#REF!=2,#REF!,IF(#REF!=3,#REF!,IF(#REF!=4,#REF!,IF(#REF!=5,#REF!,IF(#REF!=6,#REF!)))))","v":{"$error":"#REF!"}},null,null,null,null,null,null,null,null,null,null,null,null,null,null,null,null,null,null,null,null,{"$f":"IF(AND(R19=0,S19=0),\"\",IF(R19>S19,P16,P21))","v":""},null,null,null,null,null,null,null,null,null,null,null,null,null,null,null,null,null,null,null,null,null,null,null,null,null,null,null,null,null,null,null,null,null,null,null,null,null,null,null,null,null,null,null,null,null,16,null,null,null,null,{"$f":"I38","v":""},{"$f":"I40","v":""}]
[13,{"$f":"IF(#REF!=2,#REF!,IF(#REF!=3,#REF!,IF(#REF!=4,#REF!,IF(#REF!=5,#REF!,IF(#REF!=6,#REF!)))))","v":{"$error":"#REF!"}},null,null,null,null,null,null,null,null,null,null,null,null,null,null,null,{"$f":"CH20","v":0},{"$f":"CI20","v":0},"Y18",null,null,null,null,null,null,null,null,null,null,null,null,null,null,null,null,null,null,null,null,null,null,null,null,null,null,null,null,null,null,null,null,{"$f":"CH42","v":0},{"$f":"CI42","v":0},"Y40",null,null,{"$f":"IF(AND(BA19=0,BB19=0),\"\",IF(BA19>BB19,AY13,AY25))","v":""},null,null,null,null,null,null,"1.",null,null,null,17,null,null,null,null,{"$f":"P4","v":""},{"$f":"P9","v":""}]
[null,null,null,{"$f":"CH9","v":0},{"$f":"CI9","v":0},"Y7",null,7,{"$f":"IF(AND(D20=0,E20=0),\"\",IF(D20>E20,B19,B21))","v":""},null,null,null,null,null,null,null,null,null,null,null,null,null,null,null,null,null,null,null,null,null,null,null,null,null,null,null,null,null,null,null,null,null,"Y25",{"$f":"IF(AND(Y13=0,Z13=0),\"\",IF(Y13<Z13,W7,W18))","v":""},null,null,null,null,null,null,null,null,null,null,null,null,null,null,null,null,null,null,null,null,null,null,null,null,18,null,null,null,null,{"$f":"P16","v":""},{"$f":"P21","v":""}]
[14,{"$f":"IF(#REF!=2,#REF!,IF(#REF!=3,#REF!,IF(#REF!=4,#REF!,IF(#REF!=5,#REF!,IF(#REF!=6,#REF!)))))","v":{"$error":"#REF!"}},null,null,null,null,null,null,null,null,null,null,null,null,12,{"$f":"IF(AND(K22=0,L22=0),\"\",IF(K22>L22,I20,I23))","v":""},null,null,null,null,null,null,null,null,null,null,null,null,null,null,null,null,null,null,null,null,null,null,null,null,null,null,null,null,null,null,null,null,null,39,null,null,null,null,null,null,null,null,null,null,null,null,null,null,null,null,null,null,19,null,null,null,null,{"$f":"P25","v":""},{"$f":"P27","v":""}]
[15,{"$f":"IF(#REF!=2,#REF!,IF(#REF!=3,#REF!,IF(#REF!=4,#REF!,IF(#REF!=5,#REF!,IF(#REF!=6,#REF!)))))","v":{"$error":"#REF!"}},null,null,null,null,null,null,null,null,{"$f":"CH14","v":0},{"$f":"CI14","v":0},"Y12",null,null,null,null,null,null,null,null,null,null,null,null,null,null,null,null,null,null,null,null,null,null,null,null,null,null,null,null,null,null,null,null,null,null,null,null,null,null,null,null,null,null,null,null,null,null,null,null,null,null,null,null,null,null,null,20,null,null,null,null,{"$f":"P29","v":""},{"$f":"P31","v":""}]
[null,null,null,{"$f":"CH10","v":0},{"$f":"CI10","v":0},"Y8",null,8,{"$f":"IF(AND(D23=0,E23=0),\"\",IF(D23>E23,B22,B24))","v":""},null,null,null,null,null,null,null,null,null,null,null,null,null,null,null,null,null,null,null,null,null,null,null,null,null,null,null,null,null,null,null,null,null,null,null,null,null,null,null,null,null,null,null,null,null,null,null,null,null,null,null,null,null,null,null,null,null,null,null,21,null,null,null,null,{"$f":"P33","v":""},{"$f":"P35","v":""}]
[16,{"$f":"IF(#REF!=2,#REF!,IF(#REF!=3,#REF!,IF(#REF!=4,#REF!,IF(#REF!=5,#REF!,IF(#REF!=6,#REF!)))))","v":{"$error":"#REF!"}},null,null,null,null,null,null,null,null,null,null,null,null,null,null,null,null,null,null,null,null,null,null,null,null,null,null,"Y17",{"$f":"IF(AND(R7=0,S7=0),\"\",IF(R7<S7,P4,P9))","v":""},null,null,null,null,null,null,null,null,null,null,null,null,null,null,null,null,null,null,null,null,null,null,null,null,null,null,null,null,null,null,null,null,null,null,null,null,null,null,22,null,null,null,null,{"$f":"P37","v":""},{"$f":"P39","v":""}]
[null,null,null,null,null,null,null,null,null,null,null,null,null,null,"Y12",{"$f":"IF(AND(K22=0,L22=0),\"\",IF(K22<L22,I20,I23))","v":""},null,null,null,null,null,null,null,null,null,null,null,null,null,null,null,null,null,null,null,32,null,null,null,null,null,null,null,null,null,{"$f":"CH41","v":0},{"$f":"+CI41","v":0},"Y39",null,null,{"$f":"IF(AND(AT25=0,AU25=0),\"\",IF(AT25>AU25,AR20,AR30))","v":""},null,null,null,null,null,null,null,null,null,null,null,null,null,null,null,null,null,23,null,null,null,null,{"$f":"P53","v":""},{"$f":"P55","v":""},null,null,null,null,null,null,null,null,null,null,null,null,null,null,null,null,null,null,null,null,null,null,null,null,null,null,null,null,null,null,null,null,null,null,null,null,null,null,null,null,null,null,null,null,null,null,null,null,null,null,null,null,null,null,null,null,null,null,null,null,null,null,null,null,null,null,null,null,null,null,null,null,null,null,null,null,null,null,null,null,null,null,null,null,null,null,null,null,null,null,null,null,null,null,null,null,null,null,null,null,null,null,null,null,null,null,null,null,null,null,null,null,null,null,null,null,null,null,null,null,null,null,null,null,null,null,null,null,null,null,null,null,null,null,null,null,null,null,null,null,null,null,null,null,null,null,null,null,null,null,null,null,null,null,null,null,null,null,null,null,null,null,null,null,null,null,null,null,null,null,null,null,null,null,null,null,null,null,null,null,null,null,null,null,null,null,null,null,null,null,null,null,null,null,null,null,null,null,null,null,null,null,null,null,null,null,null,null,null,null,null,null,null,null,null,null,null,null,null,null,null,null,null,null,null,null,null,null,null,null,null,null,null,null,null,null,null,null,null,null,null,null,null,null,null,null,null,null,null,null,null,null,null,null,null,null,null,null,null,null,null,null,null,null,null,null,null,null,null,null,null,null,null,null,null,null,null,null,null,null,null,null,null,null,null,null,null,null,null,null,null,null,null,null,null,null,null,null,null,null,null,null,null,null,null,null,null,null,null,null,null,null,null,null,null,null,null,null,null,null,null,null,null,null,null,null,null,null,null,null,null,null,null,null,null,null,null,null,null,null,null,null,null,null,null,null,null,null,null,null,null,null,null,null,null,null,null,null,null,null,null,null,null,null,null,null,null,null,null,null,null,null,null,null,null,null,null,null,null,null,null,null,null,null,null,null,null,null,null,null,null,null,null,null,null,null,null,null,null,null,null,null,null,null,null,null,null,null,null,null,null,null,null,null,null,null,null,null,null,null,null,null,null,null,null,null,null,null,null,null,null,null,null,null,null,null,null,null,null,null,null,null,null,null,null,null,null,null,null,null,null,null,null,null,null,null,null,null,null,null,null,null,null,null,null,null,null,null,null,null,null,null,null,null,null,null,null,null,null,null,null,null,null,null,null,null,null,null,null,null,null,null,null,null,null,null,null,null,null,null,null,null,null,null,null,null,null,null,null,null,null,null,null,null,null,null,null,null,null,null,null,null,null,null,null,null,null,null,null,null,null,null,null,null,null,null,null,null,null,null,null,null,null,null,null,null,null,null,null,null,null,null,null,null,null,null,null,null,null,null,null,null,null,null,null,null,null,null,null,null,null,null,null,null,null,null,null,null,null,null,null,null,null,null,null,null,null,null,null,null,null,null,null,null,null,null,null,null,null,null,null,null,null,null,null,null,null,null,null,null,null,null,null,null,null,null,null,null,null,null,null,null,null,null,null,null,null,null,null,null,null,null,null,null,null,null,null,null,null,null,null,null,null,null,null,null,null,null,null,null,null,null,null,null,null,null,null,null,null,null,null,null,null,null,null,null,null,null,null,null,null,null,null,null,null,null,null,null,null,null,null,null,null,null,null,null,null,null,null,null,null,null,null,null,null,null,null,null,null,null,null,null,null,null,null,null,null,null,null,null,null,null,null,null,null,null,null,null,null,null,null,null,null,null,null,null,null,null,null,null,null,null,null,null,null,null,null,null,null,null,null,null,null,null,null,null,null,null,null,null,null,null,null,null,null,null,null,null,null,null,null,null,null,null,null,null,null,null,null,null,null,null,null,null,null,null,null,null,null,null,null,null,null,null,null,null,null,null,null,null,null,null,null,null,null,null,null,null,null,null,null,null,null,null,null,null,null,null,null,null,null,null,null,null,null,null,null,null,null,null,null,null,null,null,null,null,null,null,null,null,null,null,null,null,null,null,null,null,null,null,null,null,null,null,null,null,null,null,null,null,null,null,null,null,null,null,null,null,null,null,null,null,null,null,null,null,null,null,null,null,null,null,null,null,null,null,null,null,null,null,null,null,null,null,null,null,null,null,null,null,null,null,null,null,null,null,null,null,null,null,null,null,null,null,null,null,null,null,null,null,null,null,null,null,null,null,null,null,null,null,null,null,null,null,null,null,null,null,null,null,null,null,null,null,null,null,null,null,null,null,null,null,null,null,null,null,null,null,null,null,null,null,null,null,null,null,null,null,null,null,null,null,null,null,null,null,null,null,null,null,null,null,null,null,null,null,null,null,null,null,null,null,null,null,null,null,null,null,null,null,null,null,null,null,null,null,null,null,null,null,null,null,null,null,null,null,null,null,null,null,null,null,null,null,null,null,null,null,null,null,null,null,null,null,null,null,null,null,null,null,null,null,null,null,null,null,null,null,null,null,null,null,null,null,null,null,null,null,null,null,null,null,null,null,null,null,null,null,null,null,null,null,null,null,null,null,null,null,null,null,null,null,null,null,null,null,null,null,null,null,null,null,null,null,null,null,null,null,null,null,null,null,null,null,null,null,null,null,null,null,null,null,null,null,null,null,null,null,null,null,null,null,null,null,null,null,null,null,null,null,null,null,null,null,null,null,null,null,null,null,null,null,null,null,null,null,null,null,null,null,null,0]
[null,null,null,null,null,null,null,"Y1",{"$f":"IF(AND(D2=0,E2=0),\"\",IF(D2<E2,B1,B3))","v":""},null,null,null,null,null,null,null,null,{"$f":"CH21","v":0},{"$f":"CI21","v":0},"Y19",null,19,{"$f":"IF(AND(R26=0,S26=0),\"\",IF(R26>S26,P25,P27))","v":""},null,null,null,null,null,null,null,null,{"$f":"CH34","v":0},{"$f":"+CI34","v":0},"Y32",null,null,{"$f":"IF(AND(AF26=0,AG26=0),\"\",IF(AF26>AG26,AD24,AD28))","v":""},null,null,null,null,null,null,null,null,null,null,null,null,null,null,null,null,null,null,null,"Y40",{"$f":"IF(AND(BA19=0,BB19=0),\"\",IF(BA19<BB19,AY13,AY25))","v":""},null,null,null,null,null,null,"2.",null,null,null,24,null,null,null,null,{"$f":"P57","v":""},{"$f":"P59","v":""}]
[null,null,null,null,null,null,null,null,null,null,{"$f":"CH15","v":0},{"$f":"CI15","v":0},"Y13",null,13,{"$f":"IF(AND(K27=0,L27=0),\"\",IF(K27>L27,I26,I28))","v":""},null,null,null,null,null,null,null,null,null,null,null,null,26,null,null,null,null,null,null,null,null,null,null,null,null,null,37,null,null,null,null,null,null,null,null,null,null,null,null,null,null,null,null,null,null,null,null,null,null,null,null,null,25,null,null,null,null,{"$f":"W7","v":""},{"$f":"W18","v":""}]
[null,null,null,null,null,null,null,"Y2",{"$f":"IF(AND(D5=0,E5=0),\"\",IF(D5<E5,B4,B6))","v":""},null,null,null,null,null,null,null,null,null,null,null,null,null,null,null,{"$f":"CH28","v":0},{"$f":"+CI28","v":0},"Y26",null,null,{"$f":"IF(AND(Y28=0,Z28=0),\"\",IF(Y28>Z28,W26,W30))","v":""},null,null,null,null,null,null,null,null,null,null,null,null,null,null,null,null,null,null,null,null,null,null,null,null,null,null,null,null,null,null,null,null,null,null,null,null,null,null,26,null,null,null,null,{"$f":"W26","v":""},{"$f":"W30","v":""}]
[null,null,null,null,null,null,null,null,null,null,null,null,null,null,"Y11",{"$f":"IF(AND(K16=0,L16=0),\"\",IF(K16<L16,I14,I17))","v":""},null,null,null,null,null,null,null,null,null,null,null,null,null,null,null,null,null,null,null,null,null,null,null,null,null,null,null,null,null,null,null,null,null,null,null,null,null,null,null,null,null,null,null,null,null,null,null,null,null,null,null,null,27,null,null,null,null,{"$f":"W34","v":""},{"$f":"W38","v":""}]
[null,null,null,null,null,null,null,"Y3",{"$f":"IF(AND(D8=0,E8=0),\"\",IF(D8<E8,B7,B9))","v":""},null,null,null,null,null,null,null,null,{"$f":"CH22","v":0},{"$f":"CI22","v":0},"Y20",null,20,{"$f":"IF(AND(R30=0,S30=0),\"\",IF(R30>S30,P29,P31))","v":""},null,null,null,null,null,null,null,null,null,null,null,null,null,null,null,{"$f":"CH39","v":0},{"$f":"+CI39","v":0},"Y37",null,null,{"$f":"IF(AND(AM30=0,AN30=0),\"\",IF(AM30>AN30,AK26,AK34))","v":""},null,null,null,null,null,null,null,null,null,null,null,null,null,null,null,null,null,null,null,null,null,null,null,null,28,null,null,null,null,{"$f":"W44","v":""},{"$f":"W46","v":""}]
[null,null,null,null,null,null,null,null,null,null,{"$f":"CH16","v":0},{"$f":"CI16","v":0},"Y14",null,14,{"$f":"IF(AND(K31=0,L31=0),\"\",IF(K31>L31,I30,I32))","v":""},null,null,null,null,null,null,null,null,null,null,null,null,null,null,null,null,null,null,null,null,null,null,null,null,null,null,null,null,null,null,null,null,null,"Y39",{"$f":"IF(AND(AT25=0,AU25=0),\"\",IF(AT25<AU25,AR20,AR30))","v":""},null,null,null,null,null,"3.",null,null,null,null,null,null,null,null,null,null,null,29,null,null,null,null,{"$f":"W48","v":""},{"$f":"W50","v":""}]
[null,null,null,null,null,null,null,"Y4",{"$f":"IF(AND(D11=0,E11=0),\"\",IF(D11<E11,B10,B12))","v":""},null,null,null,null,null,null,null,null,null,null,null,null,null,null,null,null,null,null,null,"Y18",{"$f":"IF(AND(R19=0,S19=0),\"\",IF(R19<S19,P16,P21))","v":""},null,null,null,null,null,null,null,null,null,null,null,null,null,null,null,null,null,null,null,null,null,null,null,null,null,null,null,null,null,null,null,null,null,null,null,null,null,null,30,null,null,null,null,{"$f":"W54","v":""},{"$f":"W58","v":""}]
[null,null,null,null,null,null,null,null,null,null,null,null,null,null,"Y10",{"$f":"IF(AND(K10=0,L10=0),\"\",IF(K10<L10,I8,I11))","v":""},null,null,null,null,null,null,null,null,null,null,null,null,null,null,null,null,null,null,null,33,null,null,null,null,null,null,null,null,null,null,null,null,null,null,null,null,null,null,null,null,null,null,null,null,null,null,null,null,null,null,null,null,31,null,null,null,null,{"$f":"W60","v":""},{"$f":"W62","v":""}]
[null,null,null,null,null,null,null,"Y5",{"$f":"IF(AND(D14=0,E14=0),\"\",IF(D14<E14,B13,B15))","v":""},null,null,null,null,null,null,null,null,{"$f":"CH23","v":0},{"$f":"CI23","v":0},"Y21",null,21,{"$f":"IF(AND(R34=0,S34=0),\"\",IF(R34>S34,P33,P35))","v":""},null,null,null,null,null,null,null,null,{"$f":"CH35","v":0},{"$f":"+CI35","v":0},"Y33",null,null,{"$f":"IF(AND(AF34=0,AG34=0),\"\",IF(AF34>AG34,AD32,AD36))","v":""},null,null,null,null,null,null,null,null,null,null,null,null,null,null,null,null,null,null,null,null,null,null,null,null,null,null,null,null,null,null,null,32,null,null,null,null,{"$f":"AD24","v":""},{"$f":"AD28","v":""}]
[null,null,null,null,null,null,null,null,null,null,{"$f":"CH17","v":0},{"$f":"CI17","v":0},"Y15",null,15,{"$f":"IF(AND(K35=0,L35=0),\"\",IF(K35>L35,I34,I36))","v":""},null,null,null,null,null,null,null,null,null,null,null,null,27,null,null,null,null,null,null,null,null,null,null,null,null,null,"Y37",{"$f":"IF(AND(AM30=0,AN30=0),\"\",IF(AM30<AN30,AK26,AK34))","v":""},null,null,null,null,null,null,"4.",null,null,null,null,null,null,null,null,null,null,null,null,null,null,null,null,null,33,null,null,null,null,{"$f":"AD32","v":""},{"$f":"AD36","v":""}]
[null,null,null,null,null,null,null,"Y6",{"$f":"IF(AND(D17=0,E17=0),\"\",IF(D17<E17,B16,B18))","v":""},null,null,null,null,null,null,null,null,null,null,null,null,null,null,null,{"$f":"CH29","v":0},{"$f":"+CI29","v":0},"Y27",null,null,{"$f":"IF(AND(Y36=0,Z36=0),\"\",IF(Y36>Z36,W34,W38))","v":""},null,null,null,null,null,null,null,null,null,null,null,null,null,null,null,null,null,null,null,null,null,null,null,null,null,null,null,null,null,null,null,null,null,null,null,null,null,null,34,null,null,null,null,{"$f":"AD41","v":""},{"$f":"AD43","v":""}]
[null,null,null,null,null,null,null,null,null,null,null,null,null,null,"Y9",{"$f":"IF(AND(K4=0,L4=0),\"\",IF(K4<L4,I2,I5))","v":""},null,null,null,null,null,null,null,null,null,null,null,null,null,null,null,null,null,null,null,"Y32",{"$f":"IF(AND(AF26=0,AG26=0),\"\",IF(AF26<AG26,AD24,AD28))","v":""},null,null,null,null,null,null,null,null,null,null,null,null,null,null,null,null,null,null,null,null,null,null,null,null,null,null,null,null,null,null,null,35,null,null,null,null,{"$f":"AD45","v":""},{"$f":"AD49","v":""}]
[null,null,null,null,null,null,null,"Y7",{"$f":"IF(AND(D20=0,E20=0),\"\",IF(D20<E20,B19,B21))","v":""},null,null,null,null,null,null,null,null,{"$f":"CH24","v":0},{"$f":"CI24","v":0},"Y22",null,22,{"$f":"IF(AND(R38=0,S38=0),\"\",IF(R38>S38,P37,P39))","v":""},null,null,null,null,null,null,null,null,null,null,null,null,null,null,null,{"$f":"CH40","v":0},{"$f":"+CI40","v":0},"Y38",null,38,{"$f":"IF(AND(AM38=0,AN38=0),\"\",IF(AM38>AN38,AK37,AK39))","v":""},null,null,null,null,null,null,"5.",null,null,null,null,null,null,null,null,null,null,null,null,null,null,null,null,null,36,null,null,null,null,{"$f":"AD51","v":""},{"$f":"AD53","v":""}]
[null,null,null,null,null,null,null,null,null,null,{"$f":"CH18","v":0},{"$f":"CI18","v":0},"Y16",null,16,{"$f":"IF(AND(K39=0,L39=0),\"\",IF(K39>L39,I38,I40))","v":""},null,null,null,null,null,null,null,null,null,null,null,null,null,null,null,null,null,null,null,"Y33",{"$f":"IF(AND(AF34=0,AG34=0),\"\",IF(AF34<AG34,AD32,AD36))","v":""},null,null,null,null,null,null,null,null,null,null,null,null,null,null,null,null,null,null,null,null,null,null,null,null,null,null,null,null,null,null,null,37,null,null,null,null,{"$f":"AK26","v":""},{"$f":"AK34","v":""}]
[null,null,null,null,null,null,null,"Y8",{"$f":"IF(AND(D23=0,E23=0),\"\",IF(D23<E23,B22,B24))","v":""},null,null,null,null,null,null,null,null,null,null,null,null,null,null,null,null,null,null,null,null,null,null,null,null,null,null,null,null,null,null,null,null,null,"Y38",{"$f":"IF(AND(AM38=0,AN38=0),\"\",IF(AM38<AN38,AK37,AK39))","v":""},null,null,null,null,null,null,"6.",null,null,null,null,null,null,null,null,null,null,null,null,null,null,null,null,null,38,null,null,null,null,{"$f":"AK37","v":""},{"$f":"AK39","v":""}]
[null,null,null,null,null,null,null,null,null,null,null,null,null,null,null,null,null,null,null,null,null,null,null,null,null,null,null,null,"Y26",{"$f":"IF(AND(Y28=0,Z28=0),\"\",IF(Y28<Z28,W26,W30))","v":""},null,null,null,null,null,null,null,null,null,null,null,null,null,null,null,null,null,null,null,null,null,null,null,null,null,null,null,null,null,null,null,null,null,null,null,null,null,null,39,null,null,null,null,{"$f":"AR20","v":""},{"$f":"AR30","v":""}]
[null,null,null,null,null,null,null,null,null,null,null,null,null,null,null,null,null,null,null,null,null,null,null,null,null,null,null,null,null,null,null,{"$f":"CH36","v":0},{"$f":"+CI36","v":0},"Y34",null,34,{"$f":"IF(AND(AF42=0,AG42=0),\"\",IF(AF42>AG42,AD41,AD43))","v":""},null,null,null,null,null,null,"7.",null,null,null,null,null,null,null,null,null,null,null,null,null,null,null,null,null,null,null,null,null,null,null,null,40,null,null,null,null,{"$f":"AY13","v":""},{"$f":"AY25","v":""}]
[null,null,null,null,null,null,null,null,null,null,null,null,null,null,null,null,null,null,null,null,null,null,null,null,null,null,null,null,"Y27",{"$f":"IF(AND(Y36=0,Z36=0),\"\",IF(Y36<Z36,W34,W38))","v":""}]
[null,null,null,null,null,null,null,null,null,null,null,null,null,null,null,null,null,null,null,null,null,"Y19",{"$f":"IF(AND(R26=0,S26=0),\"\",IF(R26<S26,P25,P27))","v":""},null,null,null,null,null,null,null,null,null,null,null,null,"Y34",{"$f":"IF(AND(AF42=0,AG42=0),\"\",IF(AF42<AG42,AD41,AD43))","v":""},null,null,null,null,null,null,"8."]
[null,null,null,null,null,null,null,null,null,null,null,null,null,null,null,null,null,null,null,null,null,null,null,null,{"$f":"CH30","v":0},{"$f":"+CI30","v":0},"Y28",null,28,{"$f":"IF(AND(Y45=0,Z45=0),\"\",IF(Y45>Z45,W44,W46))","v":""}]
[null,null,null,null,null,null,null,null,null,null,null,null,null,null,null,null,null,null,null,null,null,"Y20",{"$f":"IF(AND(R30=0,S30=0),\"\",IF(R30<S30,P29,P31))","v":""},null,null,null,null,null,null,null,null,null,null,null,null,35]
[null,null,null,null,null,null,null,null,null,null,null,null,null,null,null,null,null,null,null,null,null,null,null,null,null,null,null,null,null,null,null,{"$f":"CH37","v":0},{"$f":"+CI37","v":0},"Y35",null,null,{"$f":"IF(AND(AF47=0,AG47=0),\"\",IF(AF47>AG47,AD45,AD49))","v":""},null,null,null,null,null,null,"9."]
[null,null,null,null,null,null,null,null,null,null,null,null,null,null,null,null,null,null,null,null,null,"Y21",{"$f":"IF(AND(R34=0,S34=0),\"\",IF(R34<S34,P33,P35))","v":""}]
[null,null,null,null,null,null,null,null,null,null,null,null,null,null,null,null,null,null,null,null,null,null,null,null,{"$f":"CH31","v":0},{"$f":"+CI31","v":0},"Y29",null,29,{"$f":"IF(AND(Y49=0,Z49=0),\"\",IF(Y49>Z49,W48,W50))","v":""}]
[null,null,null,null,null,null,null,null,null,null,null,null,null,null,null,null,null,null,null,null,null,"Y22",{"$f":"IF(AND(R38=0,S38=0),\"\",IF(R38<S38,P37,P39))","v":""},null,null,null,null,null,null,null,null,null,null,null,null,"Y35",{"$f":"IF(AND(AF47=0,AG47=0),\"\",IF(AF47<AG47,AD45,AD49))","v":""},null,null,null,null,null,null,"10."]
[null,null,null,null,null,null,null,null,null,null,null,null,null,null,null,null,null,null,null,null,null,null,null,null,null,null,null,null,"Y28",{"$f":"IF(AND(Y45=0,Z45=0),\"\",IF(Y45<Z45,W44,W46))","v":""}]
[null,null,null,null,null,null,null,null,null,null,null,null,null,null,null,null,null,null,null,null,null,null,null,null,null,null,null,null,null,null,null,{"$f":"CH38","v":0},{"$f":"+CI38","v":0},"Y36",null,36,{"$f":"IF(AND(AF52=0,AG52=0),\"\",IF(AF52>AG52,AD51,AD53))","v":""},null,null,null,null,null,null,"11."]
[null,null,null,null,null,null,null,null,null,null,null,null,null,null,"Y13",{"$f":"IF(AND(K27=0,L27=0),\"\",IF(K27<L27,I26,I28))","v":""},null,null,null,null,null,null,null,null,null,null,null,null,"Y29",{"$f":"IF(AND(Y49=0,Z49=0),\"\",IF(Y49<Z49,W48,W50))","v":""}]
[null,null,null,null,null,null,null,null,null,null,null,null,null,null,null,null,null,{"$f":"CH25","v":0},{"$f":"CI25","v":0},"Y23",null,23,{"$f":"IF(AND(R54=0,S54=0),\"\",IF(R54>S54,P53,P55))","v":""},null,null,null,null,null,null,null,null,null,null,null,null,"Y36",{"$f":"IF(AND(AF52=0,AG52=0),\"\",IF(AF52<AG52,AD51,AD53))","v":""},null,null,null,null,null,null,"12."]
[null,null,null,null,null,null,null,null,null,null,null,null,null,null,"Y14",{"$f":"IF(AND(K31=0,L31=0),\"\",IF(K31<L31,I30,I32))","v":""},null,null,null,null,null,null,null,null,null,null,null,null,30]
[null,null,null,null,null,null,null,null,null,null,null,null,null,null,null,null,null,null,null,null,null,null,null,null,{"$f":"CH32","v":0},{"$f":"+CI32","v":0},"Y30",null,null,{"$f":"IF(AND(Y56=0,Z56=0),\"\",IF(Y56>Z56,W54,W58))","v":""},null,null,null,null,null,null,"13."]
[null,null,null,null,null,null,null,null,null,null,null,null,null,null,"Y15",{"$f":"IF(AND(K35=0,L35=0),\"\",IF(K35<L35,I34,I36))","v":""}]
[null,null,null,null,null,null,null,null,null,null,null,null,null,null,null,null,null,{"$f":"CH26","v":0},{"$f":"CI26","v":0},"Y24",null,24,{"$f":"IF(AND(R58=0,S58=0),\"\",IF(R58>S58,P57,P59))","v":""}]
[null,null,null,null,null,null,null,null,null,null,null,null,null,null,"Y16",{"$f":"IF(AND(K39=0,L39=0),\"\",IF(K39<L39,I38,I40))","v":""},null,null,null,null,null,null,null,null,null,null,null,null,"Y30",{"$f":"IF(AND(Y56=0,Z56=0),\"\",IF(Y56<Z56,W54,W58))","v":""},null,null,null,null,null,null,"14."]
[null,null,null,null,null,null,null,null,null,null,null,null,null,null,null,null,null,null,null,null,null,"Y23",{"$f":"IF(AND(R54=0,S54=0),\"\",IF(R54<S54,P53,P55))","v":""}]
[null,null,null,null,null,null,null,null,null,null,null,null,null,null,null,null,null,null,null,null,null,null,null,null,{"$f":"CH33","v":0},{"$f":"+CI33","v":0},"Y31",null,31,{"$f":"IF(AND(Y61=0,Z61=0),\"\",IF(Y61>Z61,W60,W62))","v":""},null,null,null,null,null,null,"15."]
[null,null,null,null,null,null,null,null,null,null,null,null,null,null,null,null,null,null,null,null,null,"Y24",{"$f":"IF(AND(R58=0,S58=0),\"\",IF(R58<S58,P57,P59))","v":""}]
[null,null,null,null,null,null,null,null,null,null,null,null,null,null,null,null,null,null,null,null,null,null,null,null,null,null,null,null,"Y31",{"$f":"IF(AND(Y61=0,Z61=0),\"\",IF(Y61<Z61,W60,W62))","v":""},null,null,null,null,null,null,"16."]

{"sheet":"16(8DE)","index":7,"n_rows":41,"n_cols":105,"rows_kept":41,"cut":false,"hidden":true,"merged":[[32,15,32,21],[37,22,37,28],[39,22,39,28],[28,22,28,28],[40,29,40,35],[35,36,35,42],[38,29,38,35],[31,22,31,28],[20,1,20,7],[20,15,20,21],[21,1,21,7],[22,8,22,14],[27,36,27,42],[24,29,24,35],[26,15,26,21],[30,15,30,21],[29,29,29,35],[22,36,22,42],[23,1,23,7],[22,22,22,28],[24,15,24,21],[19,8,19,14],[12,1,12,7],[17,1,17,7],[17,22,17,28],[18,1,18,7],[18,22,18,28],[13,8,13,14],[14,1,14,7],[15,1,15,7],[15,15,15,21],[16,8,16,14],[8,1,8,7],[8,15,8,21],[9,1,9,7],[10,8,10,14],[11,1,11,7],[4,8,4,14],[5,1,5,7],[6,1,6,7],[6,22,6,28],[7,8,7,14],[3,26,4,48],[0,1,0,7],[1,8,1,14],[2,1,2,7],[3,1,3,7],[3,15,3,21],[0,26,2,48],[26,50,26,56],[32,29,32,35],[33,36,33,42],[34,29,34,35],[30,36,30,42],[28,43,28,49],[18,50,18,56],[12,43,12,49],[25,43,25,49],[25,22,25,28],[1,77,1,78],[1,67,1,68],[1,69,1,70],[1,71,1,72],[1,73,1,74],[1,75,1,76]]}
[1,{"$f":"IF(#REF!=2,#REF!,IF(#REF!=3,#REF!,IF(#REF!=4,#REF!,IF(#REF!=5,#REF!,IF(#REF!=6,#REF!)))))","v":{"$error":"#REF!"}},null,null,null,null,null,null,null,null,null,null,null,null,null,null,null,null,null,null,null,null,null,null,null,null,{"$f":"KATILIM!AC1","v":"TÜRKİYE MASA TENİSİ FEDERASYONU\nYILDIZLAR KUZEYDOĞU BÖLGE YARIŞMALARI"},null,null,null,null,null,null,null,null,null,null,null,null,null,null,null,null,null,null,null,null,null,null,null,null,null,null,null,null,null,null,null,null,null,null,null,null,null,null,null,null,null,null,null,null,null,null,null,null,null,null,null,null,null,null,null,null,null,null,null,null,null,null,null,null,null,null,null,null,null,null,null,null,null,null,null,null,"1st Round",1]
[null,null,null,{"$f":"BZ3","v":0},{"$f":"CA3","v":0},null,null,1,{"$f":"IF(AND(D2=0,E2=0),\"\",IF(D2>E2,B1,B3))","v":""},null,null,null,null,null,null,null,null,null,null,null,null,null,null,null,null,null,null,null,null,null,null,null,null,null,null,null,null,null,null,null,null,null,null,null,null,null,null,null,null,null,null,null,null,null,null,null,null,null,null,null,"#","Date","Time","Table","Competition","Player A","Player B","Set1",null,"Set2",null,"Set3",null,"Set4",null,"Set5",null,"Result",null,null,null,null,null,null,null,null,null,null,null,null,null,null,null,null,null,null,null,null,null,null,null,null,null,"2sn Round"]
[2,{"$f":"IF(#REF!=2,#REF!,IF(#REF!=3,#REF!,IF(#REF!=4,#REF!,IF(#REF!=5,#REF!,IF(#REF!=6,#REF!)))))","v":{"$error":"#REF!"}},null,null,null,null,null,null,null,null,null,null,null,null,9,null,null,null,null,null,null,null,null,null,null,null,null,null,null,null,null,null,null,null,null,null,null,null,null,null,null,null,null,null,null,null,null,null,null,null,null,null,null,null,null,null,null,null,null,null,1,null,null,null,null,{"$f":"B1","v":{"$error":"#REF!"}},{"$f":"B3","v":{"$error":"#REF!"}},null,null,null,null,null,null,null,null,null,null,null,null,null,null,null,null,null,null,null,null,null,null,null,null,null,null,null,null,null,null,null,null,null,null,null,null,"3th Round"]
[3,{"$f":"IF(#REF!=2,#REF!,IF(#REF!=3,#REF!,IF(#REF!=4,#REF!,IF(#REF!=5,#REF!,IF(#REF!=6,#REF!)))))","v":{"$error":"#REF!"}},null,null,null,null,null,null,null,null,{"$f":"+BZ11","v":0},{"$f":"+CA11","v":0},"Y1",null,null,{"$f":"IF(AND(K4=0,L4=0),\"\",IF(K4>L4,I2,I5))","v":""},null,null,null,null,null,null,null,null,null,null,{"$f":"KATILIM!AC2&\" \"&KATILIM!AE3","v":"KIZ TAKIM  [01-02 Mart 2025 SİVAS] [ Ana Tablo ]"},null,null,null,null,null,null,null,null,null,null,null,null,null,null,null,null,null,null,null,null,null,null,null,null,null,null,null,null,null,null,null,null,null,2,null,null,null,null,{"$f":"B4","v":{"$error":"#REF!"}},{"$f":"B6","v":{"$error":"#REF!"}},null,null,null,null,null,null,null,null,null,null,null,null,null,null,null,null,null,null,null,null,null,null,null,null,null,null,null,null,null,null,null,null,null,null,null,null,"4th Round"]
[null,null,null,{"$f":"BZ4","v":0},{"$f":"CA4","v":0},null,null,2,{"$f":"IF(AND(D5=0,E5=0),\"\",IF(D5>E5,B4,B6))","v":""},null,null,null,null,null,null,null,null,null,null,null,null,13,null,null,null,null,null,null,null,null,null,null,null,null,null,null,null,null,null,null,null,null,null,null,null,null,null,null,null,null,null,null,null,null,null,null,null,null,null,null,3,null,null,null,null,{"$f":"B7","v":{"$error":"#REF!"}},{"$f":"B9","v":{"$error":"#REF!"}},null,null,null,null,null,null,null,null,null,null,null,null,null,null,null,null,null,null,null,null,null,null,null,null,null,null,null,null,null,null,null,null,null,null,null,null,"5th Round"]
[4,{"$f":"IF(#REF!=2,#REF!,IF(#REF!=3,#REF!,IF(#REF!=4,#REF!,IF(#REF!=5,#REF!,IF(#REF!=6,#REF!)))))","v":{"$error":"#REF!"}},null,null,null,null,null,null,null,null,null,null,null,null,null,null,null,null,null,null,null,null,null,null,null,null,null,null,null,null,null,null,null,null,null,null,null,null,null,null,null,null,null,null,null,null,null,null,null,null,null,null,null,null,null,null,null,null,null,null,4,null,null,null,null,{"$f":"B10","v":{"$error":"#REF!"}},{"$f":"B12","v":{"$error":"#REF!"}},null,null,null,null,null,null,null,null,null,null,null,null,null,null,null,null,null,null,null,null,null,null,null,null,null,null,null,null,null,null,null,null,null,null,null,null,"6th Round"]
[5,{"$f":"IF(#REF!=2,#REF!,IF(#REF!=3,#REF!,IF(#REF!=4,#REF!,IF(#REF!=5,#REF!,IF(#REF!=6,#REF!)))))","v":{"$error":"#REF!"}},null,null,null,null,null,null,null,null,null,null,null,null,null,null,null,{"$f":"+BZ15","v":0},{"$f":"+CA15","v":0},"Y5",null,null,{"$f":"IF(AND(R7=0,S7=0),\"\",IF(R7>S7,P4,P9))","v":""},null,null,null,null,null,null,null,null,null,null,null,null,null,null,null,null,null,null,null,null,null,null,null,null,null,null,null,null,null,null,null,null,null,null,null,null,null,5,null,null,null,null,{"$f":"B13","v":{"$error":"#REF!"}},{"$f":"B15","v":{"$error":"#REF!"}},null,null,null,null,null,null,null,null,null,null,null,null,null,null,null,null,null,null,null,null,null,null,null,null,null,null,null,null,null,null,null,null,null,null,null,null,"7th Round"]
[null,null,null,{"$f":"BZ5","v":0},{"$f":"CA5","v":0},null,null,3,{"$f":"IF(AND(D8=0,E8=0),\"\",IF(D8>E8,B7,B9))","v":""},null,null,null,null,null,null,null,null,null,null,null,null,null,null,null,null,null,null,null,17,null,null,null,null,null,null,null,null,null,null,null,null,null,null,null,null,null,null,null,null,null,null,null,null,null,null,null,null,null,null,null,6,null,null,null,null,{"$f":"B16","v":{"$error":"#REF!"}},{"$f":"B18","v":{"$error":"#REF!"}}]
[6,{"$f":"IF(#REF!=2,#REF!,IF(#REF!=3,#REF!,IF(#REF!=4,#REF!,IF(#REF!=5,#REF!,IF(#REF!=6,#REF!)))))","v":{"$error":"#REF!"}},null,null,null,null,null,null,null,null,null,null,null,null,10,{"$f":"IF(AND(K10=0,L10=0),\"\",IF(K10>L10,I8,I11))","v":""},null,null,null,null,null,null,null,null,null,null,null,null,null,null,null,null,null,null,null,null,null,null,null,null,null,null,null,null,null,null,null,null,null,null,null,null,null,null,null,null,null,null,null,null,7,null,null,null,null,{"$f":"B19","v":{"$error":"#REF!"}},{"$f":"B21","v":{"$error":"#REF!"}}]
[7,{"$f":"IF(#REF!=2,#REF!,IF(#REF!=3,#REF!,IF(#REF!=4,#REF!,IF(#REF!=5,#REF!,IF(#REF!=6,#REF!)))))","v":{"$error":"#REF!"}},null,null,null,null,null,null,null,null,{"$f":"+BZ12","v":0},{"$f":"+CA12","v":0},"Y2",null,null,null,null,null,null,null,null,null,null,null,null,null,null,null,null,null,null,null,null,null,null,null,null,null,null,null,null,null,null,null,null,null,null,null,null,null,null,null,null,null,null,null,null,null,null,null,8,null,null,null,null,{"$f":"B22","v":{"$error":"#REF!"}},{"$f":"B24","v":{"$error":"#REF!"}}]
[null,null,null,{"$f":"BZ6","v":0},{"$f":"CA6","v":0},null,null,4,{"$f":"IF(AND(D11=0,E11=0),\"\",IF(D11>E11,B10,B12))","v":""},null,null,null,null,null,null,null,null,null,null,null,null,null,null,null,null,null,null,null,null,null,null,null,null,null,null,null,null,null,null,null,null,null,null,null,null,null,null,null,null,null,null,null,null,null,null,null,null,null,null,null,9,null,null,null,null,{"$f":"I2","v":""},{"$f":"I5","v":""}]
[8,{"$f":"IF(#REF!=2,#REF!,IF(#REF!=3,#REF!,IF(#REF!=4,#REF!,IF(#REF!=5,#REF!,IF(#REF!=6,#REF!)))))","v":{"$error":"#REF!"}},null,null,null,null,null,null,null,null,null,null,null,null,null,null,null,null,null,null,null,null,null,null,null,null,null,null,null,null,null,null,null,null,null,null,null,null,null,null,null,null,null,null,null,null,null,null,null,null,null,null,null,null,null,null,null,null,null,null,10,null,null,null,null,{"$f":"I8","v":""},{"$f":"I11","v":""}]
[9,{"$f":"IF(#REF!=2,#REF!,IF(#REF!=3,#REF!,IF(#REF!=4,#REF!,IF(#REF!=5,#REF!,IF(#REF!=6,#REF!)))))","v":{"$error":"#REF!"}},null,null,null,null,null,null,null,null,null,null,null,null,null,null,null,null,null,null,null,null,null,null,{"$f":"+BZ19","v":0},{"$f":"+CA19","v":0},"Y9",null,null,null,null,null,null,null,null,null,null,null,null,null,null,null,null,{"$f":"IF(AND(Y13=0,Z13=0),\"\",IF(Y13>Z13,W7,W18))","v":""},null,null,null,null,null,null,null,null,null,null,null,null,null,null,null,null,11,null,null,null,null,{"$f":"I14","v":""},{"$f":"I17","v":""}]
[null,null,null,{"$f":"BZ7","v":0},{"$f":"CA7","v":0},null,null,5,{"$f":"IF(AND(D14=0,E14=0),\"\",IF(D14>E14,B13,B15))","v":""},null,null,null,null,null,null,null,null,null,null,null,null,null,null,null,null,null,null,null,null,null,null,null,null,null,null,null,null,null,null,null,null,null,null,null,null,null,null,null,null,24,null,null,null,null,null,null,null,null,null,null,12,null,null,null,null,{"$f":"I20","v":""},{"$f":"I23","v":""}]
[10,{"$f":"IF(#REF!=2,#REF!,IF(#REF!=3,#REF!,IF(#REF!=4,#REF!,IF(#REF!=5,#REF!,IF(#REF!=6,#REF!)))))","v":{"$error":"#REF!"}},null,null,null,null,null,null,null,null,null,null,null,null,11,null,null,null,null,null,null,null,null,null,null,null,null,null,null,null,null,null,null,null,null,null,null,null,null,null,null,null,null,null,null,null,null,null,null,null,null,null,null,null,null,null,null,null,null,null,13,null,null,null,null,{"$f":"P4","v":""},{"$f":"P9","v":""}]
[11,{"$f":"IF(#REF!=2,#REF!,IF(#REF!=3,#REF!,IF(#REF!=4,#REF!,IF(#REF!=5,#REF!,IF(#REF!=6,#REF!)))))","v":{"$error":"#REF!"}},null,null,null,null,null,null,null,null,{"$f":"+BZ13","v":0},{"$f":"+CA13","v":0},"Y3",null,null,{"$f":"IF(AND(K16=0,L16=0),\"\",IF(K16>L16,I14,I17))","v":""},null,null,null,null,null,null,null,null,null,null,null,null,null,null,null,null,null,null,null,null,null,null,null,null,null,null,null,null,null,null,null,null,null,null,null,null,null,null,null,null,null,null,null,null,14,null,null,null,null,{"$f":"P16","v":""},{"$f":"P21","v":""}]
[null,null,null,{"$f":"BZ8","v":0},{"$f":"CA8","v":0},null,null,6,{"$f":"IF(AND(D17=0,E17=0),\"\",IF(D17>E17,B16,B18))","v":""},null,null,null,null,null,null,null,null,null,null,null,null,14,null,null,null,null,null,null,null,null,null,null,null,null,null,null,null,null,null,null,null,null,null,null,null,null,null,null,null,null,null,null,null,null,null,null,null,null,null,null,15,null,null,null,null,{"$f":"P25","v":""},{"$f":"P27","v":""}]
[12,{"$f":"IF(#REF!=2,#REF!,IF(#REF!=3,#REF!,IF(#REF!=4,#REF!,IF(#REF!=5,#REF!,IF(#REF!=6,#REF!)))))","v":{"$error":"#REF!"}},null,null,null,null,null,null,null,null,null,null,null,null,null,null,null,null,null,null,null,null,{"$f":"IF(AND(R19=0,S19=0),\"\",IF(R19>S19,P16,P21))","v":""},null,null,null,null,null,null,null,null,null,null,null,null,null,null,null,null,null,null,null,null,null,null,null,null,null,null,null,null,null,null,null,null,null,null,null,null,null,16,null,null,null,null,{"$f":"P31","v":""},{"$f":"P33","v":""}]
[13,{"$f":"IF(#REF!=2,#REF!,IF(#REF!=3,#REF!,IF(#REF!=4,#REF!,IF(#REF!=5,#REF!,IF(#REF!=6,#REF!)))))","v":{"$error":"#REF!"}},null,null,null,null,null,null,null,null,null,null,null,null,null,null,null,{"$f":"+BZ16","v":0},{"$f":"+CA16","v":0},"Y6",null,null,null,null,null,null,null,null,null,null,null,null,null,null,null,null,null,null,null,null,null,null,null,null,null,{"$f":"+BZ26","v":0},{"$f":"+CA26","v":0},"Y16",null,null,{"$f":"IF(AND(AT19=0,AU19=0),\"\",IF(AT19>AU19,AR13,AR26))","v":""},null,null,null,null,null,null,"1.",null,null,17,null,null,null,null,{"$f":"W7","v":""},{"$f":"W18","v":""}]
[null,null,null,{"$f":"BZ9","v":0},{"$f":"CA9","v":0},null,null,7,{"$f":"IF(AND(D20=0,E20=0),\"\",IF(D20>E20,B19,B21))","v":""},null,null,null,null,null,null,null,null,null,null,null,null,null,null,null,null,null,null,null,null,null,null,null,null,null,null,null,null,null,null,null,null,null,null,null,null,null,null,null,null,null,null,null,null,null,null,null,null,null,null,null,18,null,null,null,null,{"$f":"W23","v":""},{"$f":"W26","v":""}]
[14,{"$f":"IF(#REF!=2,#REF!,IF(#REF!=3,#REF!,IF(#REF!=4,#REF!,IF(#REF!=5,#REF!,IF(#REF!=6,#REF!)))))","v":{"$error":"#REF!"}},null,null,null,null,null,null,null,null,null,null,null,null,12,{"$f":"IF(AND(K22=0,L22=0),\"\",IF(K22>L22,I20,I23))","v":""},null,null,null,null,null,null,null,null,null,null,null,null,null,null,null,null,null,null,null,null,null,null,null,null,null,null,null,null,null,null,null,null,null,null,null,null,null,null,null,null,null,null,null,null,19,null,null,null,null,{"$f":"W29","v":""},{"$f":"W32","v":""}]
[15,{"$f":"IF(#REF!=2,#REF!,IF(#REF!=3,#REF!,IF(#REF!=4,#REF!,IF(#REF!=5,#REF!,IF(#REF!=6,#REF!)))))","v":{"$error":"#REF!"}},null,null,null,null,null,null,null,null,{"$f":"+BZ14","v":0},{"$f":"+CA14","v":0},"Y4",null,null,null,null,null,null,null,null,null,null,null,null,null,null,null,null,null,null,null,null,null,null,null,null,null,null,null,null,null,null,null,null,null,null,null,null,null,null,null,null,null,null,null,null,null,null,null,20,null,null,null,null,{"$f":"W38","v":""},{"$f":"W40","v":""}]
[null,null,null,{"$f":"BZ10","v":0},{"$f":"CA10","v":0},null,null,8,{"$f":"IF(AND(D23=0,E23=0),\"\",IF(D23>E23,B22,B24))","v":""},null,null,null,null,null,null,null,null,null,null,null,null,"Y6",{"$f":"IF(AND(R19=0,S19=0),\"\",IF(R19<S19,P16,P21))","v":""},null,null,null,null,null,null,null,null,null,null,null,null,"Y9",{"$f":"IF(AND(Y13=0,Z13=0),\"\",IF(Y13<Z13,W7,W18))","v":""},null,null,null,null,null,null,null,null,null,null,null,null,null,null,null,null,null,null,null,null,null,null,null,21,null,null,null,null,{"$f":"AD25","v":""},{"$f":"AD30","v":""}]
[16,{"$f":"IF(#REF!=2,#REF!,IF(#REF!=3,#REF!,IF(#REF!=4,#REF!,IF(#REF!=5,#REF!,IF(#REF!=6,#REF!)))))","v":{"$error":"#REF!"}},null,null,null,null,null,null,null,null,null,null,null,null,null,null,null,null,null,null,null,null,null,null,null,null,null,null,18,null,null,null,null,null,null,null,null,null,null,null,null,null,23,null,null,null,null,null,null,null,null,null,null,null,null,null,null,null,null,null,22,null,null,null,null,{"$f":"AD33","v":""},{"$f":"AD35","v":""}]
[null,null,null,null,null,null,null,null,null,null,null,null,null,null,"Y1",{"$f":"IF(AND(K4=0,L4=0),\"\",IF(K4<L4,I2,I5))","v":""},null,null,null,null,null,null,null,null,{"$f":"+BZ20","v":0},{"$f":"+CA20","v":0},"Y10",null,null,{"$f":"IF(AND(Y25=0,Z25=0),\"\",IF(Y25>Z25,W23,W26))","v":""},null,null,null,null,null,null,null,null,null,null,null,null,null,null,null,null,null,null,null,null,null,null,null,null,null,null,null,null,null,null,23,null,null,null,null,{"$f":"AK23","v":""},{"$f":"AK28","v":""}]
[null,null,null,null,null,null,null,null,null,null,null,null,null,null,null,null,null,{"$f":"+BZ17","v":0},{"$f":"+CA17","v":0},"Y7",null,15,{"$f":"IF(AND(R26=0,S26=0),\"\",IF(R26>S26,P25,P27))","v":""},null,null,null,null,null,null,null,null,null,null,null,null,21,null,null,{"$f":"+BZ25","v":0},{"$f":"+CA25","v":0},"Y15",null,null,{"$f":"IF(AND(AM26=0,AN26=0),\"\",IF(AM26>AN26,AK23,AK28))","v":""},null,null,null,null,null,null,null,null,null,null,null,null,null,null,null,null,24,null,null,null,null,{"$f":"AR13","v":""},{"$f":"AR26","v":""}]
[null,null,null,null,null,null,null,null,null,null,null,null,null,null,"Y2",{"$f":"IF(AND(K10=0,L10=0),\"\",IF(K10<L10,I8,I11))","v":""},null,null,null,null,null,null,null,null,null,null,null,null,null,null,null,null,null,null,null,null,null,null,null,null,null,null,null,null,null,null,null,null,null,"Y16",{"$f":"IF(AND(AT19=0,AU19=0),\"\",IF(AT19<AU19,AR13,AR26))","v":""},null,null,null,null,null,null,"2."]
[null,null,null,null,null,null,null,null,null,null,null,null,null,null,null,null,null,null,null,null,null,null,null,null,null,null,null,null,null,null,null,{"$f":"+BZ23","v":0},{"$f":"+CA23","v":0},"Y13",null,null,{"$f":"IF(AND(AF28=0,AG28=0),\"\",IF(AF28>AG28,AD25,AD30))","v":""}]
[null,null,null,null,null,null,null,null,null,null,null,null,null,null,null,null,null,null,null,null,null,"Y5",{"$f":"IF(AND(R7=0,S7=0),\"\",IF(R7<S7,P4,P9))","v":""},null,null,null,null,null,null,null,null,null,null,null,null,null,null,null,null,null,null,null,"Y15",{"$f":"IF(AND(AM26=0,AN26=0),\"\",IF(AM26<AN26,AK23,AK28))","v":""},null,null,null,null,null,null,"3."]
[null,null,null,null,null,null,null,null,null,null,null,null,null,null,null,null,null,null,null,null,null,null,null,null,null,null,null,null,19,{"$f":"IF(AND(Y31=0,Z31=0),\"\",IF(Y31>Z31,W29,W32))","v":""}]
[null,null,null,null,null,null,null,null,null,null,null,null,null,null,"Y3",{"$f":"IF(AND(K16=0,L16=0),\"\",IF(K16<L16,I14,I17))","v":""},null,null,null,null,null,null,null,null,{"$f":"+BZ21","v":0},{"$f":"+CA21","v":0},"Y11",null,null,null,null,null,null,null,null,"Y13",{"$f":"IF(AND(AF28=0,AG28=0),\"\",IF(AF28<AG28,AD25,AD30))","v":""},null,null,null,null,null,null,"4."]
[null,null,null,null,null,null,null,null,null,null,null,null,null,null,null,null,null,{"$f":"+BZ18","v":0},{"$f":"+CA18","v":0},"Y8",null,16,{"$f":"IF(AND(R32=0,S32=0),\"\",IF(R32>S32,P31,P33))","v":""}]
[null,null,null,null,null,null,null,null,null,null,null,null,null,null,"Y4",{"$f":"IF(AND(K22=0,L22=0),\"\",IF(K22<L22,I20,I23))","v":""},null,null,null,null,null,null,null,null,null,null,null,null,"Y10",{"$f":"IF(AND(Y25=0,Z25=0),\"\",IF(Y25<Z25,W23,W26))","v":""}]
[null,null,null,null,null,null,null,null,null,null,null,null,null,null,null,null,null,null,null,null,null,null,null,null,null,null,null,null,null,null,null,{"$f":"+BZ24","v":0},{"$f":"+CA24","v":0},"Y14",null,22,{"$f":"IF(AND(AF34=0,AG34=0),\"\",IF(AF34>AG34,AD33,AD35))","v":""},null,null,null,null,null,null,"5."]
[null,null,null,null,null,null,null,null,null,null,null,null,null,null,null,null,null,null,null,null,null,null,null,null,null,null,null,null,"Y11",{"$f":"IF(AND(Y31=0,Z31=0),\"\",IF(Y31<Z31,W29,W32))","v":""}]
[null,null,null,null,null,null,null,null,null,null,null,null,null,null,null,null,null,null,null,null,null,null,null,null,null,null,null,null,null,null,null,null,null,null,null,"Y14",{"$f":"IF(AND(AF34=0,AG34=0),\"\",IF(AF34<AG34,AD33,AD35))","v":""},null,null,null,null,null,null,"6."]
[]
[null,null,null,null,null,null,null,null,null,null,null,null,null,null,null,null,null,null,null,null,null,"Y7",{"$f":"IF(AND(R26=0,S26=0),\"\",IF(R26<S26,P25,P27))","v":""}]
[null,null,null,null,null,null,null,null,null,null,null,null,null,null,null,null,null,null,null,null,null,null,null,null,{"$f":"+BZ22","v":0},{"$f":"+CA22","v":0},"Y12",null,20,{"$f":"IF(AND(Y39=0,Z39=0),\"\",IF(Y39>Z39,W38,W40))","v":""},null,null,null,null,null,null,"7."]
[null,null,null,null,null,null,null,null,null,null,null,null,null,null,null,null,null,null,null,null,null,"Y8",{"$f":"IF(AND(R32=0,S32=0),\"\",IF(R32<S32,P31,P33))","v":""}]
[null,null,null,null,null,null,null,null,null,null,null,null,null,null,null,null,null,null,null,null,null,null,null,null,null,null,null,null,"Y12",{"$f":"IF(AND(Y39=0,Z39=0),\"\",IF(Y39<Z39,W38,W40))","v":""},null,null,null,null,null,null,"8."]

{"sheet":"KIZ ANA TABLO","index":8,"n_rows":41,"n_cols":37,"rows_kept":41,"cut":false,"hidden":false,"merged":[[9,8,9,14],[5,1,5,7],[6,8,6,14],[7,1,7,7],[8,1,8,7],[8,15,8,21],[10,1,10,7],[11,1,11,7],[11,22,11,28],[12,8,12,14],[13,1,13,7],[13,15,13,21],[20,1,20,7],[20,15,20,21],[21,8,21,14],[22,1,22,7],[17,29,17,35],[18,8,18,14],[14,1,14,7],[15,8,15,14],[16,1,16,7],[17,1,17,7],[19,1,19,7],[23,1,23,7],[24,8,24,14],[25,1,25,7],[25,15,25,21],[22,22,22,28],[37,22,37,28],[32,15,32,21],[26,1,26,7],[27,8,27,14],[28,1,28,7],[30,15,30,21],[23,29,23,35],[30,29,30,35],[36,29,36,35],[40,29,40,35],[0,0,2,36],[3,0,4,36],[31,22,31,28],[35,22,35,28],[27,22,27,28],[29,22,29,28],[28,29,28,35],[33,29,33,35],[38,29,38,35],[39,22,39,28],[34,15,34,21],[36,15,36,21]]}
["TÜRKİYE MASA TENİSİ FEDERASYONU\nYILDIZLAR KUZEYDOĞU BÖLGE YARIŞMALARI"]
[]
[]
["KIZ TAKIM  [01-02 Mart 2025 SİVAS] [ Ana Tablo ]"]
[]
[1,"ŞAFAKTEPE SPOR KULÜBÜ (ANK)"]
[null,null,null,3,0,null,null,1,"ŞAFAKTEPE SPOR KULÜBÜ (ANK)"]
[2,"KIRIKKALE YURDUM SPOR (A) (KRK)",null,null,null,null,null,null,null,null,null,null,null,null,9]
[3,"KUTLUBEY OKULLARI (C) (AMS)",null,null,null,null,null,null,null,null,3,0,"Y-A",null,null,"ŞAFAKTEPE SPOR KULÜBÜ (ANK)"]
[null,null,null,1,3,null,null,2,"ÇORUM SPOR İHTİSAS (A) (ÇRM)",null,null,null,null,null,null,null,null,null,null,null,null,13]
[4,"ÇORUM SPOR İHTİSAS (A) (ÇRM)"]
[5,"KUTLUBEY OKULLARI (B) (AMS)",null,null,null,null,null,null,null,null,null,null,null,null,null,null,null,3,0,"Y-E",null,null,"ŞAFAKTEPE SPOR KULÜBÜ (ANK)"]
[null,null,null,3,0,null,null,3,"KUTLUBEY OKULLARI (B) (AMS)",null,null,null,null,null,null,null,null,null,null,null,null,null,null,null,null,null,null,null,17]
[6,"ŞEKER 06 SPOR  KULÜBÜ (A) (ANK)",null,null,null,null,null,null,null,null,null,null,null,null,10,"KUTLUBEY OKULLARI (A) (AMS)"]
[7,"AĞRI GSK (A) (AĞR)",null,null,null,null,null,null,null,null,0,3,"Y-B"]
[null,null,null,0,3,null,null,4,"KUTLUBEY OKULLARI (A) (AMS)"]
[8,"KUTLUBEY OKULLARI (A) (AMS)"]
[9,"ÇORUM ARENA SPOR (A) (ÇRM)",null,null,null,null,null,null,null,null,null,null,null,null,null,null,null,null,null,null,null,null,null,null,3,0,"Y-I",null,null,"ŞAFAKTEPE SPOR KULÜBÜ (ANK)",null,null,null,null,null,null,"1."]
[null,null,null,3,0,null,null,5,"ÇORUM ARENA SPOR (A) (ÇRM)"]
[10,"ANKARA B. ŞEH. BLD. SPOR (ANK)",null,null,null,null,null,null,null,null,null,null,null,null,11]
[11,"GENÇLİK SPOR (A) (SVS)",null,null,null,null,null,null,null,null,3,0,"Y-C",null,null,"ÇORUM ARENA SPOR (A) (ÇRM)"]
[null,null,null,0,3,null,null,6,"GİRESUN GSK (A) (GRS)",null,null,null,null,null,null,null,null,null,null,null,null,14]
[12,"GİRESUN GSK (A) (GRS)",null,null,null,null,null,null,null,null,null,null,null,null,null,null,null,null,null,null,null,null,"ÇORUM ARENA SPOR (A) (ÇRM)"]
[13,"SİVAS OKÇULUK SPOR (A) (SVS)",null,null,null,null,null,null,null,null,null,null,null,null,null,null,null,3,2,"Y-F",null,null,null,null,null,null,null,null,"I","ÇORUM ARENA SPOR (A) (ÇRM)",null,null,null,null,null,null,"2."]
[null,null,null,0,3,null,null,7,"FINDIKLI 1974 SPOR (A) (RİZ)"]
[14,"FINDIKLI 1974 SPOR (A) (RİZ)",null,null,null,null,null,null,null,null,null,null,null,null,12,"FINDIKLI 1974 SPOR (A) (RİZ)"]
[15,"MASA-DER (A) (ANK)",null,null,null,null,null,null,null,null,3,0,"Y-D"]
[null,null,null,0,3,null,null,8,"YALIKÖY ŞEHİT BARIŞ ÇAKIR (A) (GRS)",null,null,null,null,null,null,null,null,null,null,null,null,"E","KUTLUBEY OKULLARI (A) (AMS)"]
[16,"YALIKÖY ŞEHİT BARIŞ ÇAKIR (A) (GRS)",null,null,null,null,null,null,null,null,null,null,null,null,null,null,null,null,null,null,null,null,null,null,2,3,"Y-J",null,18,"FINDIKLI 1974 SPOR (A) (RİZ)",null,null,null,null,null,null,"3."]
[null,null,null,null,null,null,null,null,null,null,null,null,null,null,null,null,null,null,null,null,null,"F","FINDIKLI 1974 SPOR (A) (RİZ)"]
[null,null,null,null,null,null,null,null,null,null,null,null,null,null,"A","ÇORUM SPOR İHTİSAS (A) (ÇRM)",null,null,null,null,null,null,null,null,null,null,null,null,"J","KUTLUBEY OKULLARI (A) (AMS)",null,null,null,null,null,null,"4."]
[null,null,null,null,null,null,null,null,null,null,null,null,null,null,null,null,null,1,3,"Y-G",null,15,"KUTLUBEY OKULLARI (B) (AMS)"]
[null,null,null,null,null,null,null,null,null,null,null,null,null,null,"B","KUTLUBEY OKULLARI (B) (AMS)",null,null,null,null,null,null,null,null,null,null,null,null,19]
[null,null,null,null,null,null,null,null,null,null,null,null,null,null,null,null,null,null,null,null,null,null,null,null,0,3,"Y-K",null,null,"YALIKÖY ŞEHİT BARIŞ ÇAKIR (A) (GRS)",null,null,null,null,null,null,"5."]
[null,null,null,null,null,null,null,null,null,null,null,null,null,null,"C","GİRESUN GSK (A) (GRS)"]
[null,null,null,null,null,null,null,null,null,null,null,null,null,null,null,null,null,1,3,"Y-H",null,16,"YALIKÖY ŞEHİT BARIŞ ÇAKIR (A) (GRS)"]
[null,null,null,null,null,null,null,null,null,null,null,null,null,null,"D","YALIKÖY ŞEHİT BARIŞ ÇAKIR (A) (GRS)",null,null,null,null,null,null,null,null,null,null,null,null,"K","KUTLUBEY OKULLARI (B) (AMS)",null,null,null,null,null,null,"6."]
[null,null,null,null,null,null,null,null,null,null,null,null,null,null,null,null,null,null,null,null,null,"G","ÇORUM SPOR İHTİSAS (A) (ÇRM)"]
[null,null,null,null,null,null,null,null,null,null,null,null,null,null,null,null,null,null,null,null,null,null,null,null,1,3,"Y-L",null,20,"GİRESUN GSK (A) (GRS)",null,null,null,null,null,null,"7."]
[null,null,null,null,null,null,null,null,null,null,null,null,null,null,null,null,null,null,null,null,null,"H","GİRESUN GSK (A) (GRS)"]
[null,null,null,null,null,null,null,null,null,null,null,null,null,null,null,null,null,null,null,null,null,null,null,null,null,null,null,null,"L","ÇORUM SPOR İHTİSAS (A) (ÇRM)",null,null,null,null,null,null,"8."]

{"sheet":"8DE","index":9,"n_rows":33,"n_cols":105,"rows_kept":33,"cut":false,"hidden":true,"merged":[[32,22,32,28],[25,29,25,35],[26,22,26,28],[27,29,27,35],[29,15,29,21],[30,22,30,28],[31,15,31,21],[24,22,24,28],[17,36,17,42],[18,15,18,21],[18,43,18,49],[19,8,19,14],[19,29,19,35],[20,15,20,21],[20,36,20,41],[21,8,21,14],[21,22,21,28],[22,15,22,21],[22,29,22,35],[23,8,23,14],[15,1,15,7],[15,29,15,35],[16,1,16,7],[16,15,16,21],[17,8,17,14],[17,22,17,28],[14,43,14,49],[7,1,7,7],[7,15,7,21],[8,8,8,14],[9,1,9,7],[10,1,10,7],[10,36,10,42],[11,8,11,14],[12,1,12,7],[12,15,12,21],[13,1,13,7],[14,8,14,14],[6,1,6,7],[0,0,1,50],[4,1,4,7],[5,8,5,14],[2,0,3,50],[1,71,1,72],[1,61,1,62],[1,63,1,64],[1,65,1,66],[1,67,1,68],[1,69,1,70]]}
[{"$f":"KATILIM!AC1","v":"TÜRKİYE MASA TENİSİ FEDERASYONU\nYILDIZLAR KUZEYDOĞU BÖLGE YARIŞMALARI"},null,null,null,null,null,null,null,null,null,null,null,null,null,null,null,null,null,null,null,null,null,null,null,null,null,null,null,null,null,null,null,null,null,null,null,null,null,null,null,null,null,null,null,null,null,null,null,null,null,null,null,null,null,null,null,null,null,null,null,null,null,null,null,null,null,null,null,null,null,null,null,null,null,null,null,null,null,null,null,null,null,null,null,null,null,null,null,null,null,null,null,null,null,null,null,null,null,null,null,null,null,null,"1st Round",1]
[null,null,null,null,null,null,null,null,null,null,null,null,null,null,null,null,null,null,null,null,null,null,null,null,null,null,null,null,null,null,null,null,null,null,null,null,null,null,null,null,null,null,null,null,null,null,null,null,null,null,null,null,null,null,"#","Date","Time","Table","Competition","Player A","Player B","Set1",null,"Set2",null,"Set3",null,"Set4",null,"Set5",null,"Result",null,null,null,null,null,null,null,null,null,null,null,null,null,null,null,null,null,null,null,null,null,null,null,null,null,null,null,null,null,null,null,"2sn Round"]
[{"$f":"KATILIM!AC2&\" \"&KATILIM!AE3","v":"KIZ TAKIM  [01-02 Mart 2025 SİVAS] [ Ana Tablo ]"},null,null,null,null,null,null,null,null,null,null,null,null,null,null,null,null,null,null,null,null,null,null,null,null,null,null,null,null,null,null,null,null,null,null,null,null,null,null,null,null,null,null,null,null,null,null,null,null,null,null,null,null,null,1,null,null,null,null,{"$f":"+B5","v":{"$error":"#REF!"}},{"$f":"+B7","v":{"$error":"#REF!"}},null,null,null,null,null,null,null,null,null,null,3,null,null,null,null,null,null,null,null,null,null,null,null,null,null,null,null,null,null,null,null,null,null,null,null,null,null,null,null,null,null,null,"3th Round"]
[null,null,null,null,null,null,null,null,null,null,null,null,null,null,null,null,null,null,null,null,null,null,null,null,null,null,null,null,null,null,null,null,null,null,null,null,null,null,null,null,null,null,null,null,null,null,null,null,null,null,null,null,null,null,2,null,null,null,null,{"$f":"+B8","v":{"$error":"#REF!"}},{"$f":"+B10","v":{"$error":"#REF!"}},null,null,null,null,null,null,null,null,null,null,3,null,null,null,null,null,null,null,null,null,null,null,null,null,null,null,null,null,null,null,null,null,null,null,null,null,null,null,null,null,null,null,"4th Round"]
[1,{"$f":"IF(#REF!=2,#REF!,IF(#REF!=3,#REF!,IF(#REF!=4,#REF!,IF(#REF!=5,#REF!,IF(#REF!=6,#REF!,IF(#REF!=7,#REF!))))))","v":{"$error":"#REF!"}},null,null,null,null,null,null,null,null,null,null,null,null,null,null,null,null,null,null,null,null,null,null,null,null,null,null,null,null,null,null,null,null,null,null,null,null,null,null,null,null,null,null,null,null,null,null,null,null,null,null,null,null,3,null,null,null,null,{"$f":"+B11","v":{"$error":"#REF!"}},{"$f":"+B13","v":{"$error":"#REF!"}},null,null,null,null,null,null,null,null,null,null,3,null,null,null,null,null,null,null,null,null,null,null,null,null,null,null,null,null,null,null,null,null,null,null,null,null,null,null,null,null,null,null,"5th Round"]
[null,null,null,{"$f":"+BT3","v":3},{"$f":"+BU3","v":0},"Y1",null,1,{"$f":"IF(AND(D6=0,E6=0),\"\",IF(D6>E6,B5,B7))","v":{"$error":"#REF!"}},null,null,null,null,null,null,null,null,null,null,null,null,null,null,null,null,null,null,null,null,null,null,null,null,null,null,null,null,null,null,null,null,null,null,null,null,null,null,null,null,null,null,null,null,null,4,null,null,null,null,{"$f":"+B14","v":{"$error":"#REF!"}},{"$f":"+B16","v":{"$error":"#REF!"}},null,null,null,null,null,null,null,null,null,null,3,null,null,null,null,null,null,null,null,null,null,null,null,null,null,null,null,null,null,null,null,null,null,null,null,null,null,null,null,null,null,null,"6th Round"]
[2,{"$f":"IF(#REF!=2,#REF!,IF(#REF!=3,#REF!,IF(#REF!=4,#REF!,IF(#REF!=5,#REF!,IF(#REF!=6,#REF!,IF(#REF!=7,#REF!))))))","v":{"$error":"#REF!"}},null,null,null,null,null,null,null,null,null,null,null,null,5,null,null,null,null,null,null,null,null,null,null,null,null,null,null,null,null,null,null,null,null,null,null,null,null,null,null,null,null,null,null,null,null,null,null,null,null,null,null,null,5,null,null,null,null,{"$f":"+I6","v":{"$error":"#REF!"}},{"$f":"+I9","v":{"$error":"#REF!"}},null,null,null,null,null,null,null,null,null,null,3]
[3,{"$f":"IF(#REF!=2,#REF!,IF(#REF!=3,#REF!,IF(#REF!=4,#REF!,IF(#REF!=5,#REF!,IF(#REF!=6,#REF!,IF(#REF!=7,#REF!))))))","v":{"$error":"#REF!"}},null,null,null,null,null,null,null,null,{"$f":"+BT7","v":3},{"$f":"+BU7","v":0},"Y5",null,null,{"$f":"IF(AND(K8=0,L8=0),\"\",IF(K8>L8,I6,I9))","v":{"$error":"#REF!"}},null,null,null,null,null,null,null,null,null,null,null,null,null,null,null,null,null,null,null,null,null,null,null,null,null,null,null,null,null,null,null,null,null,null,null,null,null,null,6,null,null,null,null,{"$f":"+I12","v":{"$error":"#REF!"}},{"$f":"+I15","v":{"$error":"#REF!"}},null,null,null,null,null,null,null,null,null,null,3]
[null,null,null,{"$f":"+BT4","v":3},{"$f":"+BU4","v":0},"Y2",null,2,{"$f":"IF(AND(D9=0,E9=0),\"\",IF(D9>E9,B8,B10))","v":{"$error":"#REF!"}},null,null,null,null,null,null,null,null,null,null,null,null,9,null,null,null,null,null,null,null,null,null,null,null,null,null,null,null,null,null,null,null,null,null,null,null,null,null,null,null,null,null,null,null,null,7,null,null,null,null,{"$f":"+I18","v":{"$error":"#REF!"}},{"$f":"+I20","v":{"$error":"#REF!"}},null,null,null,null,null,null,null,null,null,null,3]
[4,{"$f":"IF(#REF!=2,#REF!,IF(#REF!=3,#REF!,IF(#REF!=4,#REF!,IF(#REF!=5,#REF!,IF(#REF!=6,#REF!,IF(#REF!=7,#REF!))))))","v":{"$error":"#REF!"}},null,null,null,null,null,null,null,null,null,null,null,null,null,null,null,null,null,null,null,null,null,null,null,null,null,null,null,null,null,null,null,null,null,null,null,null,null,null,null,null,null,null,null,null,null,null,null,null,null,null,null,null,8,null,null,null,null,{"$f":"+I22","v":{"$error":"#REF!"}},{"$f":"+I24","v":{"$error":"#REF!"}},null,null,null,null,null,null,null,null,null,null,3]
[5,{"$f":"IF(#REF!=2,#REF!,IF(#REF!=3,#REF!,IF(#REF!=4,#REF!,IF(#REF!=5,#REF!,IF(#REF!=6,#REF!,IF(#REF!=7,#REF!))))))","v":{"$error":"#REF!"}},null,null,null,null,null,null,null,null,null,null,null,null,null,null,null,{"$f":"+BT11","v":3},{"$f":"+BU11","v":0},"Y9",null,null,null,null,null,null,null,null,null,null,null,null,null,null,null,null,{"$f":"IF(AND(R11=0,S11=0),\"\",IF(R11>S11,P8,P13))","v":{"$error":"#REF!"}},null,null,null,null,null,null,null,null,null,null,null,null,null,null,null,null,null,9,null,null,null,null,{"$f":"+P8","v":{"$error":"#REF!"}},{"$f":"+P13","v":{"$error":"#REF!"}},null,null,null,null,null,null,null,null,null,null,3]
[null,null,null,{"$f":"+BT5","v":3},{"$f":"+BU5","v":0},"Y3",null,3,{"$f":"IF(AND(D12=0,E12=0),\"\",IF(D12>E12,B11,B13))","v":{"$error":"#REF!"}},null,null,null,null,null,null,null,null,null,null,null,null,null,null,null,null,null,null,null,null,null,null,null,null,null,null,null,null,null,null,null,null,null,16,null,null,null,null,null,null,null,null,null,null,null,10,null,null,null,null,{"$f":"+P17","v":{"$error":"#REF!"}},{"$f":"+P19","v":{"$error":"#REF!"}},null,null,null,null,null,null,null,null,null,null,3]
[6,{"$f":"IF(#REF!=2,#REF!,IF(#REF!=3,#REF!,IF(#REF!=4,#REF!,IF(#REF!=5,#REF!,IF(#REF!=6,#REF!,IF(#REF!=7,#REF!))))))","v":{"$error":"#REF!"}},null,null,null,null,null,null,null,null,null,null,null,null,6,{"$f":"IF(AND(K14=0,L14=0),\"\",IF(K14>L14,I12,I15))","v":{"$error":"#REF!"}},null,null,null,null,null,null,null,null,null,null,null,null,null,null,null,null,null,null,null,null,null,null,null,null,null,null,null,null,null,null,null,null,null,null,null,null,null,null,11,null,null,null,null,{"$f":"+P21","v":{"$error":"#REF!"}},{"$f":"+P23","v":{"$error":"#REF!"}},null,null,null,null,null,null,null,null,null,null,3]
[7,{"$f":"IF(#REF!=2,#REF!,IF(#REF!=3,#REF!,IF(#REF!=4,#REF!,IF(#REF!=5,#REF!,IF(#REF!=6,#REF!,IF(#REF!=7,#REF!))))))","v":{"$error":"#REF!"}},null,null,null,null,null,null,null,null,{"$f":"+BT8","v":3},{"$f":"+BU8","v":0},"Y6",null,null,null,null,null,null,null,null,null,null,null,null,null,null,null,null,null,null,null,null,null,null,null,null,null,null,null,null,null,null,null,null,null,null,null,null,null,null,null,null,null,12,null,null,null,null,{"$f":"+P30","v":{"$error":"#REF!"}},{"$f":"+P32","v":{"$error":"#REF!"}},null,null,null,null,null,null,null,null,null,null,3]
[null,null,null,{"$f":"+BT6","v":3},{"$f":"+BU6","v":0},"Y4",null,4,{"$f":"IF(AND(D15=0,E15=0),\"\",IF(D15>E15,B14,B16))","v":{"$error":"#REF!"}},null,null,null,null,null,null,null,null,null,null,null,null,null,null,null,null,null,null,null,null,null,null,null,null,null,null,null,null,null,{"$f":"+BT18","v":3},{"$f":"+BU18","v":0},"Y16",null,null,{"$f":"IF(AND(AM15=0,AN15=0),\"\",IF(AM15>AN15,AK11,AK18))","v":{"$error":"#REF!"}},null,null,null,null,null,null,"1.",null,null,null,13,null,null,null,null,{"$f":"+W18","v":{"$error":"#REF!"}},{"$f":"+W22","v":{"$error":"#REF!"}},null,null,null,null,null,null,null,null,null,null,3]
[8,{"$f":"IF(#REF!=2,#REF!,IF(#REF!=3,#REF!,IF(#REF!=4,#REF!,IF(#REF!=5,#REF!,IF(#REF!=6,#REF!,IF(#REF!=7,#REF!))))))","v":{"$error":"#REF!"}},null,null,null,null,null,null,null,null,null,null,null,null,null,null,null,null,null,null,null,null,null,null,null,null,null,null,"Y9",{"$f":"IF(AND(R11=0,S11=0),\"\",IF(R11<S11,P8,P13))","v":{"$error":"#REF!"}},null,null,null,null,null,null,null,null,null,null,null,null,null,null,null,null,null,null,null,null,null,null,null,null,14,null,null,null,null,{"$f":"+W25","v":{"$error":"#REF!"}},{"$f":"+W27","v":{"$error":"#REF!"}},null,null,null,null,null,null,null,null,null,null,3]
[null,null,null,null,null,null,null,null,null,null,null,null,null,null,"Y6",{"$f":"IF(AND(K14=0,L14=0),\"\",IF(K14<L14,I12,I15))","v":{"$error":"#REF!"}},null,null,null,null,null,null,null,null,null,null,null,null,null,null,null,null,null,null,null,15,null,null,null,null,null,null,null,null,null,null,null,null,null,null,null,null,null,null,15,null,null,null,null,{"$f":"+AD16","v":{"$error":"#REF!"}},{"$f":"+AD20","v":{"$error":"#REF!"}},null,null,null,null,null,null,null,null,null,null,3]
[null,null,null,null,null,null,null,"Y1",{"$f":"IF(AND(D6=0,E6=0),\"\",IF(D6<E6,B5,B7))","v":{"$error":"#REF!"}},null,null,null,null,null,null,null,null,{"$f":"+BT12","v":3},{"$f":"+BU12","v":0},"Y10",null,10,{"$f":"IF(AND(R18=0,S18=0),\"\",IF(R18>S18,P17,P19))","v":{"$error":"#REF!"}},null,null,null,null,null,null,null,null,{"$f":"+BT17","v":3},{"$f":"+BU17","v":0},"Y15",null,null,{"$f":"IF(AND(AF18=0,AG18=0),\"\",IF(AF18>AG18,AD16,AD20))","v":{"$error":"#REF!"}},null,null,null,null,null,null,null,null,null,null,null,null,null,null,null,null,null,16,null,null,null,null,{"$f":"+AK11","v":{"$error":"#REF!"}},{"$f":"+AK18","v":{"$error":"#REF!"}},null,null,null,null,null,null,null,null,null,null,3]
[null,null,null,null,null,null,null,null,null,null,{"$f":"+BT9","v":3},{"$f":"+BU9","v":0},"Y7",null,7,{"$f":"IF(AND(K19=0,L19=0),\"\",IF(K19>L19,I18,I20))","v":{"$error":"#REF!"}},null,null,null,null,null,null,null,null,null,null,null,null,13,null,null,null,null,null,null,null,null,null,null,null,null,null,"Y16",{"$f":"IF(AND(AM15=0,AN15=0),\"\",IF(AM15<AN15,AK11,AK18))","v":{"$error":"#REF!"}},null,null,null,null,null,null,"2."]
[null,null,null,null,null,null,null,"Y2",{"$f":"IF(AND(D9=0,E9=0),\"\",IF(D9<E9,B8,B10))","v":{"$error":"#REF!"}},null,null,null,null,null,null,null,null,null,null,null,null,null,null,null,{"$f":"+BT15","v":3},{"$f":"+BU15","v":0},"Y13",null,null,{"$f":"IF(AND(Y20=0,Z20=0),\"\",IF(Y20>Z20,W18,W22))","v":{"$error":"#REF!"}}]
[null,null,null,null,null,null,null,null,null,null,null,null,null,null,"Y5",{"$f":"IF(AND(K8=0,L8=0),\"\",IF(K8<L8,I6,I9))","v":{"$error":"#REF!"}},null,null,null,null,null,null,null,null,null,null,null,null,null,null,null,null,null,null,null,"Y15",{"$f":"IF(AND(AF18=0,AG18=0),\"\",IF(AF18<AG18,AD16,AD20))","v":{"$error":"#REF!"}},null,null,null,null,null,"3."]
[null,null,null,null,null,null,null,"Y3",{"$f":"IF(AND(D12=0,E12=0),\"\",IF(D12<E12,B11,B13))","v":{"$error":"#REF!"}},null,null,null,null,null,null,null,null,{"$f":"+BT13","v":3},{"$f":"+BU13","v":0},"Y11",null,11,{"$f":"IF(AND(R22=0,S22=0),\"\",IF(R22>S22,P21,P23))","v":{"$error":"#REF!"}}]
[null,null,null,null,null,null,null,null,null,null,{"$f":"+BT10","v":3},{"$f":"+BU10","v":0},"Y8",null,8,{"$f":"IF(AND(K23=0,L23=0),\"\",IF(K23>L23,I22,I24))","v":{"$error":"#REF!"}},null,null,null,null,null,null,null,null,null,null,null,null,"Y13",{"$f":"IF(AND(Y20=0,Z20=0),\"\",IF(Y20<Z20,W18,W22))","v":{"$error":"#REF!"}},null,null,null,null,null,null,"4."]
[null,null,null,null,null,null,null,"Y4",{"$f":"IF(AND(D15=0,E15=0),\"\",IF(D15<E15,B14,B16))","v":{"$error":"#REF!"}}]
[null,null,null,null,null,null,null,null,null,null,null,null,null,null,null,null,null,null,null,null,null,"Y10",{"$f":"IF(AND(R18=0,S18=0),\"\",IF(R18<S18,P17,P19))","v":{"$error":"#REF!"}}]
[null,null,null,null,null,null,null,null,null,null,null,null,null,null,null,null,null,null,null,null,null,null,null,null,{"$f":"+BT16","v":3},{"$f":"+BU16","v":0},"Y14",null,14,{"$f":"IF(AND(Y26=0,Z26=0),\"\",IF(Y26>Z26,W25,W27))","v":{"$error":"#REF!"}},null,null,null,null,null,null,"5."]
[null,null,null,null,null,null,null,null,null,null,null,null,null,null,null,null,null,null,null,null,null,"Y11",{"$f":"IF(AND(R22=0,S22=0),\"\",IF(R22<S22,P21,P23))","v":{"$error":"#REF!"}}]
[null,null,null,null,null,null,null,null,null,null,null,null,null,null,null,null,null,null,null,null,null,null,null,null,null,null,null,null,"Y14",{"$f":"IF(AND(Y26=0,Z26=0),\"\",IF(Y26<Z26,W25,W27))","v":{"$error":"#REF!"}},null,null,null,null,null,null,"6."]
[]
[null,null,null,null,null,null,null,null,null,null,null,null,null,null,"Y7",{"$f":"IF(AND(K19=0,L19=0),\"\",IF(K19<L19,I18,I20))","v":{"$error":"#REF!"}}]
[null,null,null,null,null,null,null,null,null,null,null,null,null,null,null,null,null,{"$f":"+BT14","v":3},{"$f":"+BU14","v":0},"Y12",null,12,{"$f":"IF(AND(R31=0,S31=0),\"\",IF(R31>S31,P30,P32))","v":{"$error":"#REF!"}},null,null,null,null,null,null,"7."]
[null,null,null,null,null,null,null,null,null,null,null,null,null,null,"Y8",{"$f":"IF(AND(K23=0,L23=0),\"\",IF(K23<L23,I22,I24))","v":{"$error":"#REF!"}}]
[null,null,null,null,null,null,null,null,null,null,null,null,null,null,null,null,null,null,null,null,null,"Y12",{"$f":"IF(AND(R31=0,S31=0),\"\",IF(R31<S31,P30,P32))","v":{"$error":"#REF!"}},null,null,null,null,null,null,"8."]

{"sheet":"8TE","index":10,"n_rows":34,"n_cols":105,"rows_kept":34,"cut":false,"hidden":true,"merged":[[29,15,29,21],[30,22,30,28],[33,22,33,28],[24,22,24,28],[27,22,27,28],[31,15,31,21],[24,8,24,14],[25,15,25,21],[26,8,26,14],[21,8,21,14],[22,15,22,21],[23,8,23,14],[12,1,12,7],[12,15,12,21],[1,71,1,72],[4,1,4,7],[5,8,5,14],[6,1,6,7],[7,1,7,7],[7,15,7,21],[1,61,1,62],[1,63,1,64],[1,65,1,66],[1,67,1,68],[1,69,1,70],[14,22,14,28],[20,22,20,28],[0,0,1,29],[2,0,3,29],[17,22,17,28],[18,15,18,21],[13,1,13,7],[14,8,14,14],[15,1,15,7],[16,1,16,7],[16,15,16,21],[8,8,8,14],[9,1,9,7],[10,1,10,7],[10,22,10,28],[11,8,11,14]]}
[{"$f":"KATILIM!AC1","v":"TÜRKİYE MASA TENİSİ FEDERASYONU\nYILDIZLAR KUZEYDOĞU BÖLGE YARIŞMALARI"},null,null,null,null,null,null,null,null,null,null,null,null,null,null,null,null,null,null,null,null,null,null,null,null,null,null,null,null,null,null,null,null,null,null,null,null,null,null,null,null,null,null,null,null,null,null,null,null,null,null,null,null,null,null,null,null,null,null,null,null,null,null,null,null,null,null,null,null,null,null,null,null,null,null,null,null,null,null,null,null,null,null,null,null,null,null,null,null,null,null,null,null,null,null,null,null,null,null,null,null,null,null,"1st Round",1]
[null,null,null,null,null,null,null,null,null,null,null,null,null,null,null,null,null,null,null,null,null,null,null,null,null,null,null,null,null,null,null,null,null,null,null,null,null,null,null,null,null,null,null,null,null,null,null,null,null,null,null,null,null,null,"#","Date","Time","Table","Competition","Player A","Player B","Set1",null,"Set2",null,"Set3",null,"Set4",null,"Set5",null,"Result",null,null,null,null,null,null,null,null,null,null,null,null,null,null,null,null,null,null,null,null,null,null,null,null,null,null,null,null,null,null,null,"2sn Round"]
[{"$f":"KATILIM!AC2&\" \"&KATILIM!AE3","v":"KIZ TAKIM  [01-02 Mart 2025 SİVAS] [ Ana Tablo ]"},null,null,null,null,null,null,null,null,null,null,null,null,null,null,null,null,null,null,null,null,null,null,null,null,null,null,null,null,null,null,null,null,null,null,null,null,null,null,null,null,null,null,null,null,null,null,null,null,null,null,null,null,null,1,null,null,null,null,{"$f":"+B5","v":{"$error":"#REF!"}},{"$f":"+B7","v":{"$error":"#REF!"}},null,null,null,null,null,null,null,null,null,null,null,null,null,null,null,null,null,null,null,null,null,null,null,null,null,null,null,null,null,null,null,null,null,null,null,null,null,null,null,null,null,null,"3th Round"]
[null,null,null,null,null,null,null,null,null,null,null,null,null,null,null,null,null,null,null,null,null,null,null,null,null,null,null,null,null,null,null,null,null,null,null,null,null,null,null,null,null,null,null,null,null,null,null,null,null,null,null,null,null,null,2,null,null,null,null,{"$f":"+B8","v":{"$error":"#REF!"}},{"$f":"+B10","v":{"$error":"#REF!"}}]
[1,{"$f":"IF(#REF!=2,#REF!,IF(#REF!=3,#REF!,IF(#REF!=4,#REF!,IF(#REF!=5,#REF!,IF(#REF!=6,#REF!,IF(#REF!=7,#REF!))))))","v":{"$error":"#REF!"}},null,null,null,null,null,null,null,null,null,null,null,null,null,null,null,null,null,null,null,null,null,null,null,null,null,null,null,null,null,null,null,null,null,null,null,null,null,null,null,null,null,null,null,null,null,null,null,null,null,null,null,null,3,null,null,null,null,{"$f":"+B11","v":{"$error":"#REF!"}},{"$f":"+B13","v":{"$error":"#REF!"}}]
[null,null,null,{"$f":"+BT3","v":0},{"$f":"+BU3","v":0},"Y-A",null,1,{"$f":"IF(AND(D6=0,E6=0),\"\",IF(D6>E6,B5,B7))","v":""},null,null,null,null,null,null,null,null,null,null,null,null,null,null,null,null,null,null,null,null,null,null,null,null,null,null,null,null,null,null,null,null,null,null,null,null,null,null,null,null,null,null,null,null,null,4,null,null,null,null,{"$f":"+B14","v":{"$error":"#REF!"}},{"$f":"+B16","v":{"$error":"#REF!"}}]
[2,{"$f":"IF(#REF!=2,#REF!,IF(#REF!=3,#REF!,IF(#REF!=4,#REF!,IF(#REF!=5,#REF!,IF(#REF!=6,#REF!,IF(#REF!=7,#REF!))))))","v":{"$error":"#REF!"}},null,null,null,null,null,null,null,null,null,null,null,null,5,null,null,null,null,null,null,null,null,null,null,null,null,null,null,null,null,null,null,null,null,null,null,null,null,null,null,null,null,null,null,null,null,null,null,null,null,null,null,null,5,null,null,null,null,{"$f":"+I6","v":""},{"$f":"+I9","v":""}]
[3,{"$f":"IF(#REF!=2,#REF!,IF(#REF!=3,#REF!,IF(#REF!=4,#REF!,IF(#REF!=5,#REF!,IF(#REF!=6,#REF!,IF(#REF!=7,#REF!))))))","v":{"$error":"#REF!"}},null,null,null,null,null,null,null,null,{"$f":"+BT7","v":0},{"$f":"+BU7","v":0},"Y-E",null,null,{"$f":"IF(AND(K8=0,L8=0),\"\",IF(K8>L8,I6,I9))","v":""},null,null,null,null,null,null,null,null,null,null,null,null,null,null,null,null,null,null,null,null,null,null,null,null,null,null,null,null,null,null,null,null,null,null,null,null,null,null,6,null,null,null,null,{"$f":"+I12","v":""},{"$f":"+I15","v":""}]
[null,null,null,{"$f":"+BT4","v":0},{"$f":"+BU4","v":0},"Y-B",null,2,{"$f":"IF(AND(D9=0,E9=0),\"\",IF(D9>E9,B8,B10))","v":""},null,null,null,null,null,null,null,null,null,null,null,null,9,null,null,null,null,null,null,null,null,null,null,null,null,null,null,null,null,null,null,null,null,null,null,null,null,null,null,null,null,null,null,null,null,7,null,null,null,null,{"$f":"+I22","v":""},{"$f":"+I24","v":""}]
[4,{"$f":"IF(#REF!=2,#REF!,IF(#REF!=3,#REF!,IF(#REF!=4,#REF!,IF(#REF!=5,#REF!,IF(#REF!=6,#REF!,IF(#REF!=7,#REF!))))))","v":{"$error":"#REF!"}},null,null,null,null,null,null,null,null,null,null,null,null,null,null,null,null,null,null,null,null,null,null,null,null,null,null,null,null,null,null,null,null,null,null,null,null,null,null,null,null,null,null,null,null,null,null,null,null,null,null,null,null,8,null,null,null,null,{"$f":"+I25","v":""},{"$f":"+I27","v":""}]
[5,{"$f":"IF(#REF!=2,#REF!,IF(#REF!=3,#REF!,IF(#REF!=4,#REF!,IF(#REF!=5,#REF!,IF(#REF!=6,#REF!,IF(#REF!=7,#REF!))))))","v":{"$error":"#REF!"}},null,null,null,null,null,null,null,null,null,null,null,null,null,null,null,{"$f":"+BT11","v":0},{"$f":"+BU11","v":0},"Y-I",null,null,{"$f":"IF(AND(R11=0,S11=0),\"\",IF(R11>S11,P8,P13))","v":""},null,null,null,null,null,null,"1.",null,null,null,null,null,null,null,null,null,null,null,null,null,null,null,null,null,null,null,null,null,null,null,null,9,null,null,null,null,{"$f":"+P8","v":""},{"$f":"+P13","v":""}]
[null,null,null,{"$f":"+BT5","v":0},{"$f":"+BU5","v":0},"Y-C",null,3,{"$f":"IF(AND(D12=0,E12=0),\"\",IF(D12>E12,B11,B13))","v":""},null,null,null,null,null,null,null,null,null,null,null,null,null,null,null,null,null,null,null,null,null,null,null,null,null,null,null,null,null,null,null,null,null,null,null,null,null,null,null,null,null,null,null,null,null,10,null,null,null,null,{"$f":"+P17","v":""},{"$f":"+P19","v":""}]
[6,{"$f":"IF(#REF!=2,#REF!,IF(#REF!=3,#REF!,IF(#REF!=4,#REF!,IF(#REF!=5,#REF!,IF(#REF!=6,#REF!,IF(#REF!=7,#REF!))))))","v":{"$error":"#REF!"}},null,null,null,null,null,null,null,null,null,null,null,null,6,{"$f":"IF(AND(K14=0,L14=0),\"\",IF(K14>L14,I12,I15))","v":""},null,null,null,null,null,null,null,null,null,null,null,null,null,null,null,null,null,null,null,null,null,null,null,null,null,null,null,null,null,null,null,null,null,null,null,null,null,null,11,null,null,null,null,{"$f":"+P23","v":""},{"$f":"+P26","v":""}]
[7,{"$f":"IF(#REF!=2,#REF!,IF(#REF!=3,#REF!,IF(#REF!=4,#REF!,IF(#REF!=5,#REF!,IF(#REF!=6,#REF!,IF(#REF!=7,#REF!))))))","v":{"$error":"#REF!"}},null,null,null,null,null,null,null,null,{"$f":"+BT8","v":0},{"$f":"+BU8","v":0},"Y-F",null,null,null,null,null,null,null,null,null,null,null,null,null,null,null,null,null,null,null,null,null,null,null,null,null,null,null,null,null,null,null,null,null,null,null,null,null,null,null,null,null,12,null,null,null,null,{"$f":"+P30","v":""},{"$f":"+P32","v":""}]
[null,null,null,{"$f":"+BT6","v":0},{"$f":"+BU6","v":0},"Y-D",null,4,{"$f":"IF(AND(D15=0,E15=0),\"\",IF(D15>E15,B14,B16))","v":""},null,null,null,null,null,null,null,null,null,null,null,null,"I",{"$f":"IF(AND(R11=0,S11=0),\"\",IF(R11<S11,P8,P13))","v":""},null,null,null,null,null,null,"2."]
[8,{"$f":"IF(#REF!=2,#REF!,IF(#REF!=3,#REF!,IF(#REF!=4,#REF!,IF(#REF!=5,#REF!,IF(#REF!=6,#REF!,IF(#REF!=7,#REF!))))))","v":{"$error":"#REF!"}}]
[null,null,null,null,null,null,null,null,null,null,null,null,null,null,"E",{"$f":"IF(AND(K8=0,L8=0),\"\",IF(K8<L8,I6,I9))","v":""}]
[null,null,null,null,null,null,null,null,null,null,null,null,null,null,null,null,null,{"$f":"+BT12","v":0},{"$f":"+BU12","v":0},"Y-J",null,10,{"$f":"IF(AND(R18=0,S18=0),\"\",IF(R18>S18,P17,P19))","v":""},null,null,null,null,null,null,"3."]
[null,null,null,null,null,null,null,null,null,null,null,null,null,null,"F",{"$f":"IF(AND(K14=0,L14=0),\"\",IF(K14<L14,I12,I15))","v":""}]
[]
[null,null,null,null,null,null,null,null,null,null,null,null,null,null,null,null,null,null,null,null,null,"J",{"$f":"IF(AND(R18=0,S18=0),\"\",IF(R18<S18,P17,P19))","v":""},null,null,null,null,null,null,"4."]
[null,null,null,null,null,null,null,"A",{"$f":"IF(AND(D6=0,E6=0),\"\",IF(D6<E6,B5,B7))","v":""}]
[null,null,null,null,null,null,null,null,null,null,{"$f":"+BT9","v":0},{"$f":"+BU9","v":0},"Y-G",null,7,{"$f":"IF(AND(K23=0,L23=0),\"\",IF(K23>L23,I22,I24))","v":""}]
[null,null,null,null,null,null,null,"B",{"$f":"IF(AND(D9=0,E9=0),\"\",IF(D9<E9,B8,B10))","v":""},null,null,null,null,null,null,null,null,null,null,null,null,11]
[null,null,null,null,null,null,null,"C",{"$f":"IF(AND(D12=0,E12=0),\"\",IF(D12<E12,B11,B13))","v":""},null,null,null,null,null,null,null,null,{"$f":"+BT13","v":0},{"$f":"+BU13","v":0},"Y-K",null,null,{"$f":"IF(AND(R25=0,S25=0),\"\",IF(R25>S25,P23,P26))","v":""},null,null,null,null,null,null,"5."]
[null,null,null,null,null,null,null,null,null,null,{"$f":"+BT10","v":0},{"$f":"+BU10","v":0},"Y-H",null,8,{"$f":"IF(AND(K26=0,L26=0),\"\",IF(K26>L26,I25,I27))","v":""}]
[null,null,null,null,null,null,null,"D",{"$f":"IF(AND(D15=0,E15=0),\"\",IF(D15<E15,B14,B16))","v":""}]
[null,null,null,null,null,null,null,null,null,null,null,null,null,null,null,null,null,null,null,null,null,"K",{"$f":"IF(AND(R25=0,S25=0),\"\",IF(R25<S25,P23,P26))","v":""},null,null,null,null,null,null,"6."]
[]
[null,null,null,null,null,null,null,null,null,null,null,null,null,null,"G",{"$f":"IF(AND(K23=0,L23=0),\"\",IF(K23<L23,I22,I24))","v":""}]
[null,null,null,null,null,null,null,null,null,null,null,null,null,null,null,null,null,{"$f":"+BT14","v":0},{"$f":"+BU14","v":0},"Y-L",null,12,{"$f":"IF(AND(R31=0,S31=0),\"\",IF(R31>S31,P30,P32))","v":""},null,null,null,null,null,null,"7."]
[null,null,null,null,null,null,null,null,null,null,null,null,null,null,"H",{"$f":"IF(AND(K26=0,L26=0),\"\",IF(K26<L26,I25,I27))","v":""}]
[]
[null,null,null,null,null,null,null,null,null,null,null,null,null,null,null,null,null,null,null,null,null,"L",{"$f":"IF(AND(R31=0,S31=0),\"\",IF(R31<S31,P30,P32))","v":""},null,null,null,null,null,null,"8."]

{"sheet":"Cift_Mix","index":11,"n_rows":25,"n_cols":1217,"rows_kept":25,"cut":false,"hidden":true,"merged":[[0,1,0,7],[0,23,2,36],[1,8,1,14],[1,75,1,76],[1,77,1,78],[1,81,1,82],[1,83,1,84],[1,85,1,86],[2,1,2,7],[3,1,3,7],[3,15,3,21],[3,23,4,36],[4,8,4,14],[1,79,1,80],[12,29,12,35],[13,8,13,14],[5,1,5,7],[6,1,6,7],[6,22,6,28],[7,8,7,14],[8,1,8,7],[8,15,8,21],[17,22,17,28],[9,1,9,7],[10,8,10,14],[11,1,11,7],[12,1,12,7],[14,1,14,7],[15,1,15,7],[15,15,15,21],[16,8,16,14],[17,1,17,7],[18,1,18,7],[18,22,18,28],[18,29,18,35],[19,8,19,14],[20,1,20,7],[20,15,20,21],[22,29,22,35],[21,1,21,7],[22,8,22,14],[23,1,23,7],[20,29,20,35]]}
[1,{"$f":"IF(#REF!=2,#REF!,IF(#REF!=3,#REF!,IF(#REF!=4,#REF!,IF(#REF!=5,#REF!,IF(#REF!=6,#REF!)))))","v":{"$error":"#REF!"}},null,null,null,null,null,null,null,null,null,null,null,null,null,null,null,null,null,null,null,null,null,{"$f":"KATILIM!AC1","v":"TÜRKİYE MASA TENİSİ FEDERASYONU\nYILDIZLAR KUZEYDOĞU BÖLGE YARIŞMALARI"},null,null,null,null,null,null,null,null,null,null,null,null,null,null,null,null,null,null,null,null,null,null,null,null,null,null,null,null,null,null,null,null,null,null,null,null,null,null,null,null,null,null,null,null,null,null,null,null,null,null,null,null,null,null,null,null,null,null,null,null,null,null,null,null,null,null,null,null,null,null,null,null,null,null,null,null,null,null,null,"1st Round",1]
[null,null,null,{"$f":"CH3","v":0},{"$f":"CI3","v":0},null,null,1,{"$f":"IF(AND(D2=0,E2=0),\"\",IF(D2>E2,B1,B3))","v":""},null,null,null,null,null,null,null,null,null,null,null,null,null,null,null,null,null,null,null,null,null,null,null,null,null,null,null,null,null,null,null,null,null,null,null,null,null,null,null,null,null,null,null,null,null,null,null,null,null,null,null,null,null,null,null,null,null,null,null,"#","Date","Time","Table","Competition","Player A","Player B","Set1",null,"Set2",null,"Set3",null,"Set4",null,"Set5",null,"Result",null,null,null,null,null,null,null,null,null,null,null,null,null,null,null,null,null,"2sn Round"]
[2,{"$f":"IF(#REF!=2,#REF!,IF(#REF!=3,#REF!,IF(#REF!=4,#REF!,IF(#REF!=5,#REF!,IF(#REF!=6,#REF!)))))","v":{"$error":"#REF!"}},null,null,null,null,null,null,null,null,null,null,null,null,9,null,null,null,null,null,null,null,null,null,null,null,null,null,null,null,null,null,null,null,null,null,null,null,null,null,null,null,null,null,null,null,null,null,null,null,null,null,null,null,null,null,null,null,null,null,null,null,null,null,null,null,null,null,1,null,null,null,null,{"$f":"B1","v":{"$error":"#REF!"}},{"$f":"B3","v":{"$error":"#REF!"}},null,null,null,null,null,null,null,null,null,null,null,null,null,null,null,null,null,null,null,null,null,null,null,null,null,null,null,null,"3th Round"]
[3,{"$f":"IF(#REF!=2,#REF!,IF(#REF!=3,#REF!,IF(#REF!=4,#REF!,IF(#REF!=5,#REF!,IF(#REF!=6,#REF!)))))","v":{"$error":"#REF!"}},null,null,null,null,null,null,null,null,{"$f":"CH11","v":0},{"$f":"CI11","v":0},null,null,null,{"$f":"IF(AND(K4=0,L4=0),\"\",IF(K4>L4,I2,I5))","v":""},null,null,null,null,null,null,null,{"$f":"KATILIM!AC2&\" \"&KATILIM!AE3","v":"KIZ TAKIM  [01-02 Mart 2025 SİVAS] [ Ana Tablo ]"},null,null,null,null,null,null,null,null,null,null,null,null,null,null,null,null,null,null,null,null,null,null,null,null,null,null,null,null,null,null,null,null,null,null,null,null,null,null,null,null,null,null,null,null,2,null,null,null,null,{"$f":"B4","v":{"$error":"#REF!"}},{"$f":"B6","v":{"$error":"#REF!"}},null,null,null,null,null,null,null,null,null,null,null,null,null,null,null,null,null,null,null,null,null,null,null,null,null,null,null,null,"4th Round"]
[null,null,null,{"$f":"CH4","v":0},{"$f":"CI4","v":0},null,null,2,{"$f":"IF(AND(D5=0,E5=0),\"\",IF(D5>E5,B4,B6))","v":""},null,null,null,null,null,null,null,null,null,null,null,null,13,null,null,null,null,null,null,null,null,null,null,null,null,null,null,null,null,null,null,null,null,null,null,null,null,null,null,null,null,null,null,null,null,null,null,null,null,null,null,null,null,null,null,null,null,null,null,3,null,null,null,null,{"$f":"B7","v":{"$error":"#REF!"}},{"$f":"B9","v":{"$error":"#REF!"}}]
[4,{"$f":"IF(#REF!=2,#REF!,IF(#REF!=3,#REF!,IF(#REF!=4,#REF!,IF(#REF!=5,#REF!,IF(#REF!=6,#REF!)))))","v":{"$error":"#REF!"}},null,null,null,null,null,null,null,null,null,null,null,null,null,null,null,null,null,null,null,null,null,null,null,null,null,null,null,null,null,null,null,null,null,null,null,null,null,null,null,null,null,null,null,null,null,null,null,null,null,null,null,null,null,null,null,null,null,null,null,null,null,null,null,null,null,null,4,null,null,null,null,{"$f":"B10","v":{"$error":"#REF!"}},{"$f":"B12","v":{"$error":"#REF!"}}]
[5,{"$f":"IF(#REF!=2,#REF!,IF(#REF!=3,#REF!,IF(#REF!=4,#REF!,IF(#REF!=5,#REF!,IF(#REF!=6,#REF!)))))","v":{"$error":"#REF!"}},null,null,null,null,null,null,null,null,null,null,null,null,null,null,null,{"$f":"CH15","v":0},{"$f":"CI15","v":0},null,null,null,{"$f":"IF(AND(R7=0,S7=0),\"\",IF(R7>S7,P4,P9))","v":""},null,null,null,null,null,null,null,null,null,null,null,null,null,null,null,null,null,null,null,null,null,null,null,null,null,null,null,null,null,null,null,null,null,null,null,null,null,null,null,null,null,null,null,null,null,5,null,null,null,null,{"$f":"B13","v":{"$error":"#REF!"}},{"$f":"B15","v":{"$error":"#REF!"}}]
[null,null,null,{"$f":"CH5","v":0},{"$f":"CI5","v":0},null,null,3,{"$f":"IF(AND(D8=0,E8=0),\"\",IF(D8>E8,B7,B9))","v":""},null,null,null,null,null,null,null,null,null,null,null,null,null,null,null,null,null,null,null,15,null,null,null,null,null,null,null,null,null,null,null,null,null,null,null,null,null,null,null,null,null,null,null,null,null,null,null,null,null,null,null,null,null,null,null,null,null,null,null,6,null,null,null,null,{"$f":"B16","v":{"$error":"#REF!"}},{"$f":"B18","v":{"$error":"#REF!"}}]
[6,{"$f":"IF(#REF!=2,#REF!,IF(#REF!=3,#REF!,IF(#REF!=4,#REF!,IF(#REF!=5,#REF!,IF(#REF!=6,#REF!)))))","v":{"$error":"#REF!"}},null,null,null,null,null,null,null,null,null,null,null,null,10,{"$f":"IF(AND(K10=0,L10=0),\"\",IF(K10>L10,I8,I11))","v":""},null,null,null,null,null,null,null,null,null,null,null,null,null,null,null,null,null,null,null,null,null,null,null,null,null,null,null,null,null,null,null,null,null,null,null,null,null,null,null,null,null,null,null,null,null,null,null,null,null,null,null,null,7,null,null,null,null,{"$f":"B19","v":{"$error":"#REF!"}},{"$f":"B21","v":{"$error":"#REF!"}}]
[7,{"$f":"IF(#REF!=2,#REF!,IF(#REF!=3,#REF!,IF(#REF!=4,#REF!,IF(#REF!=5,#REF!,IF(#REF!=6,#REF!)))))","v":{"$error":"#REF!"}},null,null,null,null,null,null,null,null,{"$f":"CH12","v":0},{"$f":"CI12","v":0},null,null,null,null,null,null,null,null,null,null,null,null,null,null,null,null,null,null,null,null,null,null,null,null,null,null,null,null,null,null,null,null,null,null,null,null,null,null,null,null,null,null,null,null,null,null,null,null,null,null,null,null,null,null,null,null,8,null,null,null,null,{"$f":"B22","v":{"$error":"#REF!"}},{"$f":"B24","v":{"$error":"#REF!"}}]
[null,null,null,{"$f":"CH6","v":0},{"$f":"CI6","v":0},null,null,4,{"$f":"IF(AND(D11=0,E11=0),\"\",IF(D11>E11,B10,B12))","v":""},null,null,null,null,null,null,null,null,null,null,null,null,null,null,null,null,null,null,null,null,null,null,null,null,null,null,null,null,null,null,null,null,null,null,null,null,null,null,null,null,null,null,null,null,null,null,null,null,null,null,null,null,null,null,null,null,null,null,null,9,null,null,null,null,{"$f":"I2","v":""},{"$f":"I5","v":""}]
[8,{"$f":"IF(#REF!=2,#REF!,IF(#REF!=3,#REF!,IF(#REF!=4,#REF!,IF(#REF!=5,#REF!,IF(#REF!=6,#REF!)))))","v":{"$error":"#REF!"}},null,null,null,null,null,null,null,null,null,null,null,null,null,null,null,null,null,null,null,null,null,null,null,null,null,null,null,null,null,null,null,null,null,null,null,null,null,null,null,null,null,null,null,null,null,null,null,null,null,null,null,null,null,null,null,null,null,null,null,null,null,null,null,null,null,null,10,null,null,null,null,{"$f":"I8","v":""},{"$f":"I11","v":""}]
[9,{"$f":"IF(#REF!=2,#REF!,IF(#REF!=3,#REF!,IF(#REF!=4,#REF!,IF(#REF!=5,#REF!,IF(#REF!=6,#REF!)))))","v":{"$error":"#REF!"}},null,null,null,null,null,null,null,null,null,null,null,null,null,null,null,null,null,null,null,null,null,null,{"$f":"CH17","v":0},{"$f":"+CI17","v":0},null,null,null,{"$f":"IF(AND(Y13=0,Z13=0),\"\",IF(Y13>Z13,W7,W18))","v":""},null,null,null,null,null,null,"1.",null,null,null,null,null,null,null,null,null,null,null,null,null,null,null,null,null,null,null,null,null,null,null,null,null,null,null,null,null,null,null,11,null,null,null,null,{"$f":"I14","v":""},{"$f":"I17","v":""}]
[null,null,null,{"$f":"CH7","v":0},{"$f":"CI7","v":0},null,null,5,{"$f":"IF(AND(D14=0,E14=0),\"\",IF(D14>E14,B13,B15))","v":""},null,null,null,null,null,null,null,null,null,null,null,null,null,null,null,null,null,null,null,null,null,null,null,null,null,null,null,null,null,null,null,null,null,null,null,null,null,null,null,null,null,null,null,null,null,null,null,null,null,null,null,null,null,null,null,null,null,null,null,12,null,null,null,null,{"$f":"I20","v":""},{"$f":"I23","v":""}]
[10,{"$f":"IF(#REF!=2,#REF!,IF(#REF!=3,#REF!,IF(#REF!=4,#REF!,IF(#REF!=5,#REF!,IF(#REF!=6,#REF!)))))","v":{"$error":"#REF!"}},null,null,null,null,null,null,null,null,null,null,null,null,11,null,null,null,null,null,null,null,null,null,null,null,null,null,null,null,null,null,null,null,null,null,null,null,null,null,null,null,null,null,null,null,null,null,null,null,null,null,null,null,null,null,null,null,null,null,null,null,null,null,null,null,null,null,13,null,null,null,null,{"$f":"+P4","v":""},{"$f":"+P9","v":""}]
[11,{"$f":"IF(#REF!=2,#REF!,IF(#REF!=3,#REF!,IF(#REF!=4,#REF!,IF(#REF!=5,#REF!,IF(#REF!=6,#REF!)))))","v":{"$error":"#REF!"}},null,null,null,null,null,null,null,null,{"$f":"CH13","v":0},{"$f":"CI13","v":0},null,null,null,{"$f":"IF(AND(K16=0,L16=0),\"\",IF(K16>L16,I14,I17))","v":""},null,null,null,null,null,null,null,null,null,null,null,null,null,null,null,null,null,null,null,null,null,null,null,null,null,null,null,null,null,null,null,null,null,null,null,null,null,null,null,null,null,null,null,null,null,null,null,null,null,null,null,null,14,null,null,null,null,{"$f":"+P16","v":""},{"$f":"+P21","v":""}]
[null,null,null,{"$f":"CH8","v":0},{"$f":"CI8","v":0},null,null,6,{"$f":"IF(AND(D17=0,E17=0),\"\",IF(D17>E17,B16,B18))","v":""},null,null,null,null,null,null,null,null,null,null,null,null,14,null,null,null,null,null,null,null,null,null,null,null,null,null,null,null,null,null,null,null,null,null,null,null,null,null,null,null,null,null,null,null,null,null,null,null,null,null,null,null,null,null,null,null,null,null,null,15,null,null,null,null,{"$f":"+W7","v":""},{"$f":"+W18","v":""}]
[12,{"$f":"IF(#REF!=2,#REF!,IF(#REF!=3,#REF!,IF(#REF!=4,#REF!,IF(#REF!=5,#REF!,IF(#REF!=6,#REF!)))))","v":{"$error":"#REF!"}},null,null,null,null,null,null,null,null,null,null,null,null,null,null,null,null,null,null,null,null,{"$f":"IF(AND(R19=0,S19=0),\"\",IF(R19>S19,P16,P21))","v":""}]
[13,{"$f":"IF(#REF!=2,#REF!,IF(#REF!=3,#REF!,IF(#REF!=4,#REF!,IF(#REF!=5,#REF!,IF(#REF!=6,#REF!)))))","v":{"$error":"#REF!"}},null,null,null,null,null,null,null,null,null,null,null,null,null,null,null,{"$f":"CH16","v":0},{"$f":"CI16","v":0},null,null,null,null,null,null,null,null,null,null,{"$f":"IF(AND(Y13=0,Z13=0),\"\",IF(Y13<Z13,W7,W18))","v":""},null,null,null,null,null,null,"2."]
[null,null,null,{"$f":"CH9","v":0},{"$f":"CI9","v":0},null,null,7,{"$f":"IF(AND(D20=0,E20=0),\"\",IF(D20>E20,B19,B21))","v":""}]
[14,{"$f":"IF(#REF!=2,#REF!,IF(#REF!=3,#REF!,IF(#REF!=4,#REF!,IF(#REF!=5,#REF!,IF(#REF!=6,#REF!)))))","v":{"$error":"#REF!"}},null,null,null,null,null,null,null,null,null,null,null,null,12,{"$f":"IF(AND(K22=0,L22=0),\"\",IF(K22>L22,I20,I23))","v":""},null,null,null,null,null,null,null,null,null,null,null,null,null,{"$f":"IF(AND(R7=0,S7=0),\"\",IF(R7<S7,P4,P9))","v":""},null,null,null,null,null,null,"3."]
[15,{"$f":"IF(#REF!=2,#REF!,IF(#REF!=3,#REF!,IF(#REF!=4,#REF!,IF(#REF!=5,#REF!,IF(#REF!=6,#REF!)))))","v":{"$error":"#REF!"}},null,null,null,null,null,null,null,null,{"$f":"CH14","v":0},{"$f":"CI14","v":0}]
[null,null,null,{"$f":"CH10","v":0},{"$f":"CI10","v":0},null,null,8,{"$f":"IF(AND(D23=0,E23=0),\"\",IF(D23>E23,B22,B24))","v":""},null,null,null,null,null,null,null,null,null,null,null,null,null,null,null,null,null,null,null,null,{"$f":"IF(AND(R19=0,S19=0),\"\",IF(R19<S19,P16,P21))","v":""},null,null,null,null,null,null,"3."]
[16,{"$f":"IF(#REF!=2,#REF!,IF(#REF!=3,#REF!,IF(#REF!=4,#REF!,IF(#REF!=5,#REF!,IF(#REF!=6,#REF!)))))","v":{"$error":"#REF!"}}]
[null,null,null,null,null,null,null,null,null,null,null,null,null,null,null,null,null,null,null,null,null,null,null,null,null,null,null,null,null,null,null,null,null,null,null,null,null,null,null,null,null,null,null,null,null,null,null,null,null,null,null,null,null,null,null,null,null,null,null,null,null,null,null,null,null,null,null,null,null,null,null,null,null,null,null,null,null,null,null,null,null,null,null,null,null,null,null,null,null,null,null,null,null,null,null,null,null,null,null,null,null,null,null,null,null,null,null,null,null,null,null,null,null,null,null,null,null,null,null,null,null,null,null,null,null,null,null,null,null,null,null,null,null,null,null,null,null,null,null,null,null,null,null,null,null,null,null,null,null,null,null,null,null,null,null,null,null,null,null,null,null,null,null,null,null,null,null,null,null,null,null,null,null,null,null,null,null,null,null,null,null,null,null,null,null,null,null,null,null,null,null,null,null,null,null,null,null,null,null,null,null,null,null,null,null,null,null,null,null,null,null,null,null,null,null,null,null,null,null,null,null,null,null,null,null,null,null,null,null,null,null,null,null,null,null,null,null,null,null,null,null,null,null,null,null,null,null,null,null,null,null,null,null,null,null,null,null,null,null,null,null,null,null,null,null,null,null,null,null,null,null,null,null,null,null,null,null,null,null,null,null,null,null,null,null,null,null,null,null,null,null,null,null,null,null,null,null,null,null,null,null,null,null,null,null,null,null,null,null,null,null,null,null,null,null,null,null,null,null,null,null,null,null,null,null,null,null,null,null,null,null,null,null,null,null,null,null,null,null,null,null,null,null,null,null,null,null,null,null,null,null,null,null,null,null,null,null,null,null,null,null,null,null,null,null,null,null,null,null,null,null,null,null,null,null,null,null,null,null,null,null,null,null,null,null,null,null,null,null,null,null,null,null,null,null,null,null,null,null,null,null,null,null,null,null,null,null,null,null,null,null,null,null,null,null,null,null,null,null,null,null,null,null,null,null,null,null,null,null,null,null,null,null,null,null,null,null,null,null,null,null,null,null,null,null,null,null,null,null,null,null,null,null,null,null,null,null,null,null,null,null,null,null,null,null,null,null,null,null,null,null,null,null,null,null,null,null,null,null,null,null,null,null,null,null,null,null,null,null,null,null,null,null,null,null,null,null,null,null,null,null,null,null,null,null,null,null,null,null,null,null,null,null,null,null,null,null,null,null,null,null,null,null,null,null,null,null,null,null,null,null,null,null,null,null,null,null,null,null,null,null,null,null,null,null,null,null,null,null,null,null,null,null,null,null,null,null,null,null,null,null,null,null,null,null,null,null,null,null,null,null,null,null,null,null,null,null,null,null,null,null,null,null,null,null,null,null,null,null,null,null,null,null,null,null,null,null,null,null,null,null,null,null,null,null,null,null,null,null,null,null,null,null,null,null,null,null,null,null,null,null,null,null,null,null,null,null,null,null,null,null,null,null,null,null,null,null,null,null,null,null,null,null,null,null,null,null,null,null,null,null,null,null,null,null,null,null,null,null,null,null,null,null,null,null,null,null,null,null,null,null,null,null,null,null,null,null,null,null,null,null,null,null,null,null,null,null,null,null,null,null,null,null,null,null,null,null,null,null,null,null,null,null,null,null,null,null,null,null,null,null,null,null,null,null,null,null,null,null,null,null,null,null,null,null,null,null,null,null,null,null,null,null,null,null,null,null,null,null,null,null,null,null,null,null,null,null,null,null,null,null,null,null,null,null,null,null,null,null,null,null,null,null,null,null,null,null,null,null,null,null,null,null,null,null,null,null,null,null,null,null,null,null,null,null,null,null,null,null,null,null,null,null,null,null,null,null,null,null,null,null,null,null,null,null,null,null,null,null,null,null,null,null,null,null,null,null,null,null,null,null,null,null,null,null,null,null,null,null,null,null,null,null,null,null,null,null,null,null,null,null,null,null,null,null,null,null,null,null,null,null,null,null,null,null,null,null,null,null,null,null,null,null,null,null,null,null,null,null,null,null,null,null,null,null,null,null,null,null,null,null,null,null,null,null,null,null,null,null,null,null,null,null,null,null,null,null,null,null,null,null,null,null,null,null,null,null,null,null,null,null,null,null,null,null,null,null,null,null,null,null,null,null,null,null,null,null,null,null,null,null,null,null,null,null,null,null,null,null,null,null,null,null,null,null,null,null,null,null,null,null,null,null,null,null,null,null,null,null,null,null,null,null,null,null,null,null,null,null,null,null,null,null,null,null,null,null,null,null,null,null,null,null,null,null,null,null,null,null,null,null,null,null,null,null,null,null,null,null,null,null,null,null,null,null,null,null,null,null,null,null,null,null,null,null,null,null,null,null,null,null,null,null,null,null,null,null,null,null,null,null,null,null,null,null,null,null,null,null,null,null,null,null,null,null,null,null,null,null,null,null,null,null,null,null,null,null,null,null,null,null,null,null,null,null,null,null,null,null,null,null,null,null,null,null,null,null,null,null,null,null,null,null,null,null,null,null,null,null,null,null,null,null,null,null,null,null,null,null,null,null,null,null,null,null,null,null,null,null,null,null,null,null,null,null,null,null,null,null,null,null,null,null,null,null,null,null,null,null,null,null,null,null,null,null,null,null,null,null,null,null,null,null,null,null,null,null,null,null,null,null,null,null,null,null,null,null,null,null,null,null,null,null,null,null,null,null,null,null,null,null,null,null,null,null,null,null,null,null,null,null,null,null,null,null,null,null,null,null,null,null,null,null,null,null,null,null,null,null,null,null,null,null,null,null,null,null,null,null,null,null,null,null,null,null,null,0]

{"sheet":"SIRALAMA","index":12,"n_rows":41,"n_cols":17,"rows_kept":41,"cut":false,"hidden":false,"merged":[[0,0,0,5],[1,0,1,4],[2,0,2,4]]}
["TÜRKİYE MASA TENİSİ FEDERASYONU\nYILDIZLAR KUZEYDOĞU BÖLGE YARIŞMALARI",null,null,null,null,null,null,null,null,null,null,null,"32 (DE)",4,"--------",1,1]
["01-02 Mart 2025 SİVAS",null,null,null,null,null,null,null,null,null,null,null,"16 (DE)",null,"Ferdi"]
["KIZ TAKIM SIRALAMA",null,null,null,null,null,null,null,null,null,null,null,"16 (8DE)",null,"Takım"]
[null,null,null,null,null,null,null,null,null,null,null,null,"16 (TE)"]
[null,"Sıra","Takım","Sporcu Adı-Soyadı","İli","İli","Puan",null,null,null,null,null,"8DE"]
[null,1,"ŞAFAKTEPE SPOR KULÜBÜ (ANK)","ŞAFAKTEPE SPOR KULÜBÜ","ANKARA",0,null,null,null,null,null,null,"8TE"]
[null,2,"ÇORUM ARENA SPOR (A) (ÇRM)","ÇORUM ARENA SPOR (A)","ÇORUM","",null,null,null,null,null,null,"-------"]
[null,3,"FINDIKLI 1974 SPOR (A) (RİZ)","FINDIKLI 1974 SPOR (A)","RİZE","",null,null,null,null,null,null,16]
[null,4,"KUTLUBEY OKULLARI (A) (AMS)","KUTLUBEY OKULLARI (A)","AMASYA","",null,null,null,null,null,null,"Cift-Mix"]
[null,5,"YALIKÖY ŞEHİT BARIŞ ÇAKIR (A) (GRS)","YALIKÖY ŞEHİT BARIŞ ÇAKIR (A)","GİRESUN","",null,null,null,null,null,null,"16(Okul)"]
[null,6,"KUTLUBEY OKULLARI (B) (AMS)","KUTLUBEY OKULLARI (B)","AMASYA","",null,null,null,null,null,null,"32DE(16)"]
[null,7,"GİRESUN GSK (A) (GRS)","GİRESUN GSK (A)","GİRESUN",""]
[null,8,"ÇORUM SPOR İHTİSAS (A) (ÇRM)","ÇORUM SPOR İHTİSAS (A)","ÇORUM",""]
[null,9,"KIRIKKALE YURDUM SPOR (A) (KRK)","KIRIKKALE YURDUM SPOR (A)","KIRIKKALE",""]
[null,9,"KUTLUBEY OKULLARI (C) (AMS)","KUTLUBEY OKULLARI (C)","AMASYA",""]
[null,9,"ŞEKER 06 SPOR  KULÜBÜ (A) (ANK)","ŞEKER 06 SPOR  KULÜBÜ (A)","ANKARA",""]
[null,9,"AĞRI GSK (A) (AĞR)","AĞRI GSK (A)","AĞRI",""]
[null,9,"ANKARA B. ŞEH. BLD. SPOR (ANK)","ANKARA B. ŞEH. BLD. SPOR","ANKARA",0]
[null,9,"GENÇLİK SPOR (A) (SVS)","GENÇLİK SPOR (A)","SİVAS",""]
[null,9,"SİVAS OKÇULUK SPOR (A) (SVS)","SİVAS OKÇULUK SPOR (A)","SİVAS",""]
[null,9,"MASA-DER (A) (ANK)","MASA-DER (A)","ANKARA",""]
[null,null,null,0,0,0]
[null,null,null,0,0,0]
[null,null,null,0,0,0]
[null,null,null,0,0,0]
[null,null,null,0,0,0]
[null,null,null,0,0,0]
[null,null,null,0,0,0]
[null,null,null,0,0,0]
[null,null,null,0,0,0]
[null,null,null,0,0,0]
[null,null,null,0,0,0]
[null,null,null,0,0,0]
[null,null,null,0,0,0]
[null,null,null,0,0,0]
[null,null,null,0,0,0]
[null,null,null,0,0,0]
[null,null,null,0,0,0]
[null,null,null,0,0,0]
[null,null,null,0,0,0]
[null,null,null,0,0,0]

{"sheet":"Ferdi","index":13,"n_rows":31,"n_cols":41,"rows_kept":31,"cut":false,"hidden":true,"merged":[[0,27,0,30],[28,19,28,22],[28,23,28,25],[29,1,29,2],[29,5,29,8],[29,9,29,11],[29,15,29,16],[29,19,29,22],[29,23,29,25],[28,1,28,2],[28,3,28,4],[28,5,28,8],[28,9,28,11],[28,15,28,16],[28,17,28,18],[25,22,26,22],[25,23,26,23],[25,24,26,24],[25,25,26,25],[25,10,26,10],[25,11,26,11],[25,14,26,14],[23,24,24,24],[23,25,24,25],[23,22,24,22],[23,23,24,23],[23,8,24,8],[23,9,24,9],[23,10,24,10],[23,11,24,11],[23,14,24,14],[23,17,24,17],[25,0,26,0],[25,3,26,3],[25,4,26,4],[25,5,26,5],[25,6,26,6],[25,7,26,7],[25,8,26,8],[25,9,26,9],[23,18,24,18],[25,20,26,20],[25,21,26,21],[23,0,24,0],[23,3,24,3],[23,4,24,4],[23,5,24,5],[23,6,24,6],[23,7,24,7],[25,17,26,17],[25,18,26,18],[25,19,26,19],[23,19,24,19],[23,20,24,20],[23,21,24,21],[21,0,22,0],[21,1,22,1],[21,2,22,2],[21,3,21,8],[19,1,19,5],[19,6,19,7],[19,8,19,9],[19,10,19,11],[19,15,19,19],[19,20,19,21],[19,22,19,23],[19,24,19,25],[21,15,22,15],[21,16,22,16],[21,17,21,22],[21,23,21,24],[21,9,21,10],[21,14,22,14],[16,0,16,11],[16,14,16,25],[17,0,17,11],[17,14,17,25],[18,1,18,5],[18,6,18,7],[18,8,18,9],[18,10,18,11],[18,15,18,19],[18,20,18,21],[18,22,18,23],[18,24,18,25],[12,19,12,22],[12,23,12,25],[13,1,13,2],[13,5,13,8],[13,9,13,11],[13,15,13,16],[13,19,13,22],[13,23,13,25],[12,1,12,2],[12,3,12,4],[12,5,12,8],[12,9,12,11],[12,15,12,16],[12,17,12,18],[9,22,10,22],[9,23,10,23],[9,24,10,24],[9,25,10,25],[9,10,10,10],[9,11,10,11],[9,14,10,14],[9,17,10,17],[9,18,10,18],[9,19,10,19],[7,24,8,24],[7,25,8,25],[9,0,10,0],[9,3,10,3],[9,4,10,4],[9,5,10,5],[9,6,10,6],[9,7,10,7],[9,8,10,8],[9,9,10,9],[7,18,8,18],[7,19,8,19],[7,20,8,20],[7,21,8,21],[7,22,8,22],[7,23,8,23],[7,8,8,8],[7,9,8,9],[7,10,8,10],[7,11,8,11],[7,14,8,14],[7,17,8,17],[9,20,10,20],[9,21,10,21],[7,0,8,0],[7,3,8,3],[7,4,8,4],[7,5,8,5],[7,6,8,6],[7,7,8,7],[5,0,6,0],[5,1,6,1],[5,2,6,2],[5,3,5,8],[3,1,3,5],[3,6,3,7],[3,8,3,9],[3,10,3,11],[3,15,3,19],[3,20,3,21],[3,22,3,23],[3,24,3,25],[5,15,6,15],[5,16,6,16],[5,17,5,22],[5,23,5,24],[5,9,5,10],[5,14,6,14],[0,0,0,11],[0,14,0,25],[1,0,1,11],[1,14,1,25],[2,1,2,5],[2,6,2,7],[2,8,2,9],[2,10,2,11],[2,15,2,19],[2,20,2,21],[2,22,2,23],[2,24,2,25]]}
[{"$f":"KATILIM!A1","v":"TÜRKİYE MASA TENİSİ FEDERASYONU\nYILDIZLAR KUZEYDOĞU BÖLGE YARIŞMALARI"},null,null,null,null,null,null,null,null,null,null,null,null,null,{"$f":"+A1","v":"TÜRKİYE MASA TENİSİ FEDERASYONU\nYILDIZLAR KUZEYDOĞU BÖLGE YARIŞMALARI"},null,null,null,null,null,null,null,null,null,null,null,null,"Manuel müsabaka çıktısı almak",null,null,null,null,null,null,null,null,null,null,null,"Ön_Eleme",9]
[{"$f":"KATILIM!A2","v":"KIZ TAKIM  [01-02 Mart 2025 SİVAS]"},null,null,null,null,null,null,null,null,null,null,null,null,null,{"$f":"+A2","v":"KIZ TAKIM  [01-02 Mart 2025 SİVAS]"},null,null,null,null,null,null,null,null,null,null,null,null,null,null,null,null,null,null,null,null,null,null,null,null,"Eleme"]
["No","Yarışma",null,null,null,null,"Tarih",null,"Saat",null,"Masa",null,null,null,"No","Yarışma",null,null,null,null,"Tarih",null,"Saat",null,"Masa",null,null,null,null,null,null,null,null,null,null,null,null,null,null,"32DE"]
[null,null,null,null,null,null,null,null,null,null,null,null,null,null,{"$f":"IF(A4=0,0,A4+1)","v":0},null,null,null,null,null,null,null,null,null,null,null,null,null,null,null,null,null,null,null,null,null,null,null,null,"16DE"]
[13,null,null,null,null,null,null,null,null,null,null,null,null,null,{"$f":"O4&\".\"&O4","v":"0.0"},null,null,null,null,null,null,null,null,null,null,null,null,null,null,null,null,null,null,null,null,null,null,null,null,"16(TE)"]
["K","Nr",null,"SETLER",null,null,null,null,null,"Sporcu",null,"Öğ.",null,null,"K","Nr",null,"SETLER",null,null,null,null,null,"Sporcu",null,"Öğ.",null,null,null,null,null,null,null,null,null,null,null,null,null,"16(8DE)"]
[null,null,null,1,2,3,4,5,"N","M","SKK","SK",null,null,null,null,null,1,2,3,4,5,"N","M","SKK","SK",null,null,null,null,null,null,null,null,null,null,null,null,null,"8DE"]
["A","",null,null,null,null,null,null,null,null,null,null,null,null,"A","",null,null,null,null,null,null,null,null,null,null,null,null,null,null,null,null,null,null,null,null,null,null,null,"8TE"]
[null,"FR",null,null,null,null,null,null,null,null,null,null,null,null,null,"FR",null,null,null,null,null,null,null,null,null,null,null,null,null,null,null,null,null,null,null,null,null,null,null,"-----"]
["X","",null,null,null,null,null,null,null,null,null,null,null,null,"X","",null,null,null,null,null,null,null,null,null,null,null,null,null,null,null,null,null,null,null,null,null,null,null,16]
[null,"FR",null,null,null,null,null,null,null,null,null,null,null,null,null,"FR",null,null,null,null,null,null,null,null,null,null,null,null,null,null,null,null,null,null,null,null,null,null,null,"Cift-Mix"]
[null,null,null,null,null,null,null,null,null,null,null,null,null,null,null,null,null,null,null,null,null,null,null,null,null,null,null,null,null,null,null,null,null,null,null,null,null,null,null,"32DE(16)"]
["Nr.","Galip: Adı Soyadı / İmza",null,"SONUÇ",null,"Hakem: Adı Soyadı / İmza",null,null,null,"Başhakem",null,null,null,null,"Nr.","Galip: Adı Soyadı / İmza",null,"SONUÇ",null,"Hakem: Adı Soyadı / İmza",null,null,null,"Başhakem"]
[null,null,null,{"$f":"#REF!","v":{"$error":"#REF!"}},null,null,null,null,null,null,null,null,null,null,null,null,null,{"$f":"#REF!","v":{"$error":"#REF!"}}]
["Başlama Saati:",null,null,"Bitiş Saati:",null,null,null,null,null,null,null,null,null,null,"Başlama Saati:",null,null,"Bitiş Saati:"]
[]
[{"$f":"+A1","v":"TÜRKİYE MASA TENİSİ FEDERASYONU\nYILDIZLAR KUZEYDOĞU BÖLGE YARIŞMALARI"},null,null,null,null,null,null,null,null,null,null,null,null,null,{"$f":"+A1","v":"TÜRKİYE MASA TENİSİ FEDERASYONU\nYILDIZLAR KUZEYDOĞU BÖLGE YARIŞMALARI"}]
[{"$f":"+A2","v":"KIZ TAKIM  [01-02 Mart 2025 SİVAS]"},null,null,null,null,null,null,null,null,null,null,null,null,null,{"$f":"+A2","v":"KIZ TAKIM  [01-02 Mart 2025 SİVAS]"}]
["No","Yarışma",null,null,null,null,"Tarih",null,"Saat",null,"Masa",null,null,null,"No","Yarışma",null,null,null,null,"Tarih",null,"Saat",null,"Masa"]
[{"$f":"IF(O4=0,0,O4+1)","v":0},null,null,null,null,null,null,null,null,null,null,null,null,null,{"$f":"IF(A20=0,0,A20+1)","v":0}]
[{"$f":"A20&\".\"&A20","v":"0.0"},null,null,null,null,null,null,null,null,null,null,null,null,null,{"$f":"O20&\".\"&O20","v":"0.0"}]
["K","Nr",null,"SETLER",null,null,null,null,null,"Sporcu",null,"Öğ.",null,null,"K","Nr",null,"SETLER",null,null,null,null,null,"Sporcu",null,"Öğ."]
[null,null,null,1,2,3,4,5,"N","M","SKK","SK",null,null,null,null,null,1,2,3,4,5,"N","M","SKK","SK"]
["A","",null,null,null,null,null,null,null,null,null,null,null,null,"A",""]
[null,"FR",null,null,null,null,null,null,null,null,null,null,null,null,null,"FR"]
["X","",null,null,null,null,null,null,null,null,null,null,null,null,"X",""]
[null,"FR",null,null,null,null,null,null,null,null,null,null,null,null,null,"FR"]
[]
["Nr.","Galip: Adı Soyadı / İmza",null,"SONUÇ",null,"Hakem: Adı Soyadı / İmza",null,null,null,"Başhakem",null,null,null,null,"Nr.","Galip: Adı Soyadı / İmza",null,"SONUÇ",null,"Hakem: Adı Soyadı / İmza",null,null,null,"Başhakem"]
[null,null,null,{"$f":"#REF!","v":{"$error":"#REF!"}},null,null,null,null,null,null,null,null,null,null,null,null,null,{"$f":"#REF!","v":{"$error":"#REF!"}}]
["Başlama Saati:",null,null,"Bitiş Saati:",null,null,null,null,null,null,null,null,null,null,"Başlama Saati:",null,null,"Bitiş Saati:"]

{"sheet":"Puan","index":14,"n_rows":259,"n_cols":5,"rows_kept":259,"cut":false,"hidden":true,"merged":[[1,2,1,3],[1,4,2,4],[1,1,2,1]]}
[]
[null,"Sıra","Sporcunun",null,"Puan"]
[null,null,"Adı - Soyadı","Kulübü"]
[null,1,{"$f":"'32DE'!BT39","v":""},{"$f":"IFERROR(VLOOKUP(C4,KATILIM!D4:F292,3,0),\"\")","v":""},32]
[null,2,{"$f":"+'32DE'!BT57","v":""},{"$f":"IFERROR(VLOOKUP(C5,KATILIM!D5:F293,3,0),\"\")","v":""},31]
[null,3,{"$f":"+'32DE'!BM63","v":""},{"$f":"IFERROR(VLOOKUP(C6,KATILIM!D6:F294,3,0),\"\")","v":""},30]
[null,4,{"$f":"+'32DE'!BF71","v":""},{"$f":"IFERROR(VLOOKUP(C7,KATILIM!D7:F295,3,0),\"\")","v":""},29]
[null,5,{"$f":"+'32DE'!BF75","v":""},{"$f":"IFERROR(VLOOKUP(C8,KATILIM!D8:F296,3,0),\"\")","v":""},28]
[null,6,{"$f":"+'32DE'!BF77","v":""},{"$f":"IFERROR(VLOOKUP(C9,KATILIM!D9:F297,3,0),\"\")","v":""},27]
[null,7,{"$f":"+'32DE'!AY79","v":""},{"$f":"IFERROR(VLOOKUP(C10,KATILIM!D10:F298,3,0),\"\")","v":""},26]
[null,8,{"$f":"+'32DE'!AY81","v":""},{"$f":"IFERROR(VLOOKUP(C11,KATILIM!D11:F299,3,0),\"\")","v":""},25]
[null,9,{"$f":"+'32DE'!AY84","v":""},{"$f":"IFERROR(VLOOKUP(C12,KATILIM!D12:F300,3,0),\"\")","v":""},24]
[null,10,{"$f":"+'32DE'!AY86","v":""},{"$f":"IFERROR(VLOOKUP(C13,KATILIM!D13:F301,3,0),\"\")","v":""},23]
[null,11,{"$f":"+'32DE'!AY88","v":""},{"$f":"IFERROR(VLOOKUP(C14,KATILIM!D14:F302,3,0),\"\")","v":""},22]
[null,12,{"$f":"+'32DE'!AY90","v":""},{"$f":"IFERROR(VLOOKUP(C15,KATILIM!D15:F303,3,0),\"\")","v":""},21]
[null,13,{"$f":"+'32DE'!AR92","v":""},{"$f":"IFERROR(VLOOKUP(C16,KATILIM!D16:F304,3,0),\"\")","v":""},20]
[null,14,{"$f":"+'32DE'!AR94","v":""},{"$f":"IFERROR(VLOOKUP(C17,KATILIM!D17:F305,3,0),\"\")","v":""},19]
[null,15,{"$f":"+'32DE'!AR96","v":""},{"$f":"IFERROR(VLOOKUP(C18,KATILIM!D18:F306,3,0),\"\")","v":""},18]
[null,16,{"$f":"+'32DE'!AR98","v":""},{"$f":"IFERROR(VLOOKUP(C19,KATILIM!D19:F307,3,0),\"\")","v":""},17]
[null,"17-24",{"$f":"IF('32DE'!$R$51<'32DE'!$S$51,'32DE'!$P$50,'32DE'!$P$52)","v":""},{"$f":"IFERROR(VLOOKUP(C20,KATILIM!D20:F308,3,0),\"\")","v":""},16]
[null,"17-24",{"$f":"IF('32DE'!$R$55<'32DE'!$S$55,'32DE'!$P$54,'32DE'!$P$56)","v":""},{"$f":"IFERROR(VLOOKUP(C21,KATILIM!D21:F309,3,0),\"\")","v":""},16]
[null,"17-24",{"$f":"IF('32DE'!$R$59<'32DE'!$S$59,'32DE'!$P$58,'32DE'!$P$60)","v":""},{"$f":"IFERROR(VLOOKUP(C22,KATILIM!D22:F310,3,0),\"\")","v":""},16]
[null,"17-24",{"$f":"IF('32DE'!$R$63<'32DE'!$S$63,'32DE'!$P$62,'32DE'!$P$64)","v":""},{"$f":"IFERROR(VLOOKUP(C23,KATILIM!D23:F311,3,0),\"\")","v":""},16]
[null,"17-24",{"$f":"IF('32DE'!$R$67<'32DE'!$S$67,'32DE'!$P$66,'32DE'!$P$68)","v":""},{"$f":"IFERROR(VLOOKUP(C24,KATILIM!D24:F312,3,0),\"\")","v":""},16]
[null,"17-24",{"$f":"IF('32DE'!$R$71<'32DE'!$S$71,'32DE'!$P$70,'32DE'!$P$72)","v":""},{"$f":"IFERROR(VLOOKUP(C25,KATILIM!D25:F313,3,0),\"\")","v":""},16]
[null,"17-24",{"$f":"IF('32DE'!$R$75<'32DE'!$S$75,'32DE'!$P$74,'32DE'!$P$76)","v":""},{"$f":"IFERROR(VLOOKUP(C26,KATILIM!D26:F314,3,0),\"\")","v":""},16]
[null,"17-24",{"$f":"IF('32DE'!$R$79<'32DE'!$S$79,'32DE'!$P$78,'32DE'!$P$80)","v":""},{"$f":"IFERROR(VLOOKUP(C27,KATILIM!D27:F315,3,0),\"\")","v":""},16]
[null,"25-32",{"$f":"IF('32DE'!$K$52<'32DE'!$L$52,'32DE'!$I$51,'32DE'!$I$53)","v":""},{"$f":"IFERROR(VLOOKUP(C28,KATILIM!D28:F316,3,0),\"\")","v":""},8]
[null,"25-32",{"$f":"IF('32DE'!$K$56<'32DE'!$L$56,'32DE'!$I$55,'32DE'!$I$57)","v":""},{"$f":"IFERROR(VLOOKUP(C29,KATILIM!D29:F317,3,0),\"\")","v":""},8]
[null,"25-32",{"$f":"IF('32DE'!$K$60<'32DE'!$L$60,'32DE'!$I$59,'32DE'!$I$61)","v":""},{"$f":"IFERROR(VLOOKUP(C30,KATILIM!D30:F318,3,0),\"\")","v":""},8]
[null,"25-32",{"$f":"IF('32DE'!$K$64<'32DE'!$L$64,'32DE'!$I$63,'32DE'!$I$65)","v":""},{"$f":"IFERROR(VLOOKUP(C31,KATILIM!D31:F319,3,0),\"\")","v":""},8]
[null,"25-32",{"$f":"IF('32DE'!$K$68<'32DE'!$L$68,'32DE'!$I$67,'32DE'!$I$69)","v":""},{"$f":"IFERROR(VLOOKUP(C32,KATILIM!D32:F320,3,0),\"\")","v":""},8]
[null,"25-32",{"$f":"IF('32DE'!$K$72<'32DE'!$L$72,'32DE'!$I$71,'32DE'!$I$73)","v":""},{"$f":"IFERROR(VLOOKUP(C33,KATILIM!D33:F321,3,0),\"\")","v":""},8]
[null,"25-32",{"$f":"IF('32DE'!$K$76<'32DE'!$L$76,'32DE'!$I$75,'32DE'!$I$77)","v":""},{"$f":"IFERROR(VLOOKUP(C34,KATILIM!D34:F322,3,0),\"\")","v":""},8]
[null,"25-32",{"$f":"IF('32DE'!$K$80<'32DE'!$L$80,'32DE'!$I$79,'32DE'!$I$81)","v":""},{"$f":"IFERROR(VLOOKUP(C35,KATILIM!D35:F323,3,0),\"\")","v":""},8]
[null,"33-64",{"$f":"IF(OR(#REF!=\"\",#REF!=0,#REF!=1,#REF!=2),#REF!,#REF!)","v":{"$error":"#REF!"}},{"$f":"IFERROR(VLOOKUP(C36,KATILIM!D36:F324,3,0),\"\")","v":""},4]
[null,"33-64",{"$f":"IF(OR(#REF!=\"\",#REF!=0,#REF!=1,#REF!=2),#REF!,#REF!)","v":{"$error":"#REF!"}},{"$f":"IFERROR(VLOOKUP(C37,KATILIM!D37:F325,3,0),\"\")","v":""},4]
[null,"33-64",{"$f":"IF(OR(#REF!=\"\",#REF!=0,#REF!=1,#REF!=2),#REF!,#REF!)","v":{"$error":"#REF!"}},{"$f":"IFERROR(VLOOKUP(C38,KATILIM!D38:F326,3,0),\"\")","v":""},4]
[null,"33-64",{"$f":"IF(OR(#REF!=\"\",#REF!=0,#REF!=1,#REF!=2),#REF!,#REF!)","v":{"$error":"#REF!"}},{"$f":"IFERROR(VLOOKUP(C39,KATILIM!D39:F327,3,0),\"\")","v":""},4]
[null,"33-64",{"$f":"IF(OR(#REF!=\"\",#REF!=0,#REF!=1,#REF!=2),#REF!,#REF!)","v":{"$error":"#REF!"}},{"$f":"IFERROR(VLOOKUP(C40,KATILIM!D40:F328,3,0),\"\")","v":""},4]
[null,"33-64",{"$f":"IF(OR(#REF!=\"\",#REF!=0,#REF!=1,#REF!=2),#REF!,#REF!)","v":{"$error":"#REF!"}},{"$f":"IFERROR(VLOOKUP(C41,KATILIM!D41:F329,3,0),\"\")","v":""},4]
[null,"33-64",{"$f":"IF(OR(#REF!=\"\",#REF!=0,#REF!=1,#REF!=2),#REF!,#REF!)","v":{"$error":"#REF!"}},{"$f":"IFERROR(VLOOKUP(C42,KATILIM!D42:F330,3,0),\"\")","v":""},4]
[null,"33-64",{"$f":"IF(OR(#REF!=\"\",#REF!=0,#REF!=1,#REF!=2),#REF!,#REF!)","v":{"$error":"#REF!"}},{"$f":"IFERROR(VLOOKUP(C43,KATILIM!D43:F331,3,0),\"\")","v":""},4]
[null,"33-64",{"$f":"IF(OR(#REF!=\"\",#REF!=0,#REF!=1,#REF!=2),#REF!,#REF!)","v":{"$error":"#REF!"}},{"$f":"IFERROR(VLOOKUP(C44,KATILIM!D44:F332,3,0),\"\")","v":""},4]
[null,"33-64",{"$f":"IF(OR(#REF!=\"\",#REF!=0,#REF!=1,#REF!=2),#REF!,#REF!)","v":{"$error":"#REF!"}},{"$f":"IFERROR(VLOOKUP(C45,KATILIM!D45:F333,3,0),\"\")","v":""},4]
[null,"33-64",{"$f":"IF(OR(#REF!=\"\",#REF!=0,#REF!=1,#REF!=2),#REF!,#REF!)","v":{"$error":"#REF!"}},{"$f":"IFERROR(VLOOKUP(C46,KATILIM!D46:F334,3,0),\"\")","v":""},4]
[null,"33-64",{"$f":"IF(OR(#REF!=\"\",#REF!=0,#REF!=1,#REF!=2),#REF!,#REF!)","v":{"$error":"#REF!"}},{"$f":"IFERROR(VLOOKUP(C47,KATILIM!D47:F335,3,0),\"\")","v":""},4]
[null,"33-64",{"$f":"IF(OR(#REF!=\"\",#REF!=0,#REF!=1,#REF!=2),#REF!,#REF!)","v":{"$error":"#REF!"}},{"$f":"IFERROR(VLOOKUP(C48,KATILIM!D48:F336,3,0),\"\")","v":""},4]
[null,"33-64",{"$f":"IF(OR(#REF!=\"\",#REF!=0,#REF!=1,#REF!=2),#REF!,#REF!)","v":{"$error":"#REF!"}},{"$f":"IFERROR(VLOOKUP(C49,KATILIM!D49:F337,3,0),\"\")","v":""},4]
[null,"33-64",{"$f":"IF(OR(#REF!=\"\",#REF!=0,#REF!=1,#REF!=2),#REF!,#REF!)","v":{"$error":"#REF!"}},{"$f":"IFERROR(VLOOKUP(C50,KATILIM!D50:F338,3,0),\"\")","v":""},4]
[null,"33-64",{"$f":"IF(OR(#REF!=\"\",#REF!=0,#REF!=1,#REF!=2),#REF!,#REF!)","v":{"$error":"#REF!"}},{"$f":"IFERROR(VLOOKUP(C51,KATILIM!D51:F339,3,0),\"\")","v":""},4]
[null,"33-64",{"$f":"IF(OR(#REF!=\"\",#REF!=0,#REF!=1,#REF!=2),#REF!,#REF!)","v":{"$error":"#REF!"}},{"$f":"IFERROR(VLOOKUP(C52,KATILIM!D52:F340,3,0),\"\")","v":""},4]
[null,"33-64",{"$f":"IF(OR(#REF!=\"\",#REF!=0,#REF!=1,#REF!=2),#REF!,#REF!)","v":{"$error":"#REF!"}},{"$f":"IFERROR(VLOOKUP(C53,KATILIM!D53:F341,3,0),\"\")","v":""},4]
[null,"33-64",{"$f":"IF(OR(#REF!=\"\",#REF!=0,#REF!=1,#REF!=2),#REF!,#REF!)","v":{"$error":"#REF!"}},{"$f":"IFERROR(VLOOKUP(C54,KATILIM!D54:F342,3,0),\"\")","v":""},4]
[null,"33-64",{"$f":"IF(OR(#REF!=\"\",#REF!=0,#REF!=1,#REF!=2),#REF!,#REF!)","v":{"$error":"#REF!"}},{"$f":"IFERROR(VLOOKUP(C55,KATILIM!D55:F343,3,0),\"\")","v":""},4]
[null,"33-64",{"$f":"IF(OR(#REF!=\"\",#REF!=0,#REF!=1,#REF!=2),#REF!,#REF!)","v":{"$error":"#REF!"}},{"$f":"IFERROR(VLOOKUP(C56,KATILIM!D56:F344,3,0),\"\")","v":""},4]
[null,"33-64",{"$f":"IF(OR(#REF!=\"\",#REF!=0,#REF!=1,#REF!=2),#REF!,#REF!)","v":{"$error":"#REF!"}},{"$f":"IFERROR(VLOOKUP(C57,KATILIM!D57:F345,3,0),\"\")","v":""},4]
[null,"33-64",{"$f":"IF(OR(#REF!=\"\",#REF!=0,#REF!=1,#REF!=2),#REF!,#REF!)","v":{"$error":"#REF!"}},{"$f":"IFERROR(VLOOKUP(C58,KATILIM!D58:F346,3,0),\"\")","v":""},4]
[null,"33-64",{"$f":"IF(OR(#REF!=\"\",#REF!=0,#REF!=1,#REF!=2),#REF!,#REF!)","v":{"$error":"#REF!"}},{"$f":"IFERROR(VLOOKUP(C59,KATILIM!D59:F347,3,0),\"\")","v":""},4]
[null,"33-64",{"$f":"IF(OR(#REF!=\"\",#REF!=0,#REF!=1,#REF!=2),#REF!,#REF!)","v":{"$error":"#REF!"}},{"$f":"IFERROR(VLOOKUP(C60,KATILIM!D60:F348,3,0),\"\")","v":""},4]
[null,"33-64",{"$f":"IF(OR(#REF!=\"\",#REF!=0,#REF!=1,#REF!=2),#REF!,#REF!)","v":{"$error":"#REF!"}},{"$f":"IFERROR(VLOOKUP(C61,KATILIM!D61:F349,3,0),\"\")","v":""},4]
[null,"33-64",{"$f":"IF(OR(#REF!=\"\",#REF!=0,#REF!=1,#REF!=2),#REF!,#REF!)","v":{"$error":"#REF!"}},{"$f":"IFERROR(VLOOKUP(C62,KATILIM!D62:F350,3,0),\"\")","v":""},4]
[null,"33-64",{"$f":"IF(OR(#REF!=\"\",#REF!=0,#REF!=1,#REF!=2),#REF!,#REF!)","v":{"$error":"#REF!"}},{"$f":"IFERROR(VLOOKUP(C63,KATILIM!D63:F351,3,0),\"\")","v":""},4]
[null,"33-64",{"$f":"IF(OR(#REF!=\"\",#REF!=0,#REF!=1,#REF!=2),#REF!,#REF!)","v":{"$error":"#REF!"}},{"$f":"IFERROR(VLOOKUP(C64,KATILIM!D64:F352,3,0),\"\")","v":""},4]
[null,"33-64",{"$f":"IF(OR(#REF!=\"\",#REF!=0,#REF!=1,#REF!=2),#REF!,#REF!)","v":{"$error":"#REF!"}},{"$f":"IFERROR(VLOOKUP(C65,KATILIM!D65:F353,3,0),\"\")","v":""},4]
[null,"33-64",{"$f":"IF(OR(#REF!=\"\",#REF!=0,#REF!=1,#REF!=2),#REF!,#REF!)","v":{"$error":"#REF!"}},{"$f":"IFERROR(VLOOKUP(C66,KATILIM!D66:F354,3,0),\"\")","v":""},4]
[null,"33-64",{"$f":"IF(OR(#REF!=\"\",#REF!=0,#REF!=1,#REF!=2),#REF!,#REF!)","v":{"$error":"#REF!"}},{"$f":"IFERROR(VLOOKUP(C67,KATILIM!D67:F355,3,0),\"\")","v":""},4]
[null,"65-128",{"$f":"IF(OR(#REF!=\"\",#REF!=0,#REF!=1,#REF!=2),#REF!,#REF!)","v":{"$error":"#REF!"}},{"$f":"IFERROR(VLOOKUP(C68,KATILIM!D68:F356,3,0),\"\")","v":""},2]
[null,"65-128",{"$f":"IF(OR(#REF!=\"\",#REF!=0,#REF!=1,#REF!=2),#REF!,#REF!)","v":{"$error":"#REF!"}},{"$f":"IFERROR(VLOOKUP(C69,KATILIM!D69:F357,3,0),\"\")","v":""},2]
[null,"65-128",{"$f":"IF(OR(#REF!=\"\",#REF!=0,#REF!=1,#REF!=2),#REF!,#REF!)","v":{"$error":"#REF!"}},{"$f":"IFERROR(VLOOKUP(C70,KATILIM!D70:F358,3,0),\"\")","v":""},2]
[null,"65-128",{"$f":"IF(OR(#REF!=\"\",#REF!=0,#REF!=1,#REF!=2),#REF!,#REF!)","v":{"$error":"#REF!"}},{"$f":"IFERROR(VLOOKUP(C71,KATILIM!D71:F359,3,0),\"\")","v":""},2]
[null,"65-128",{"$f":"IF(OR(#REF!=\"\",#REF!=0,#REF!=1,#REF!=2),#REF!,#REF!)","v":{"$error":"#REF!"}},{"$f":"IFERROR(VLOOKUP(C72,KATILIM!D72:F360,3,0),\"\")","v":""},2]
[null,"65-128",{"$f":"IF(OR(#REF!=\"\",#REF!=0,#REF!=1,#REF!=2),#REF!,#REF!)","v":{"$error":"#REF!"}},{"$f":"IFERROR(VLOOKUP(C73,KATILIM!D73:F361,3,0),\"\")","v":""},2]
[null,"65-128",{"$f":"IF(OR(#REF!=\"\",#REF!=0,#REF!=1,#REF!=2),#REF!,#REF!)","v":{"$error":"#REF!"}},{"$f":"IFERROR(VLOOKUP(C74,KATILIM!D74:F362,3,0),\"\")","v":""},2]
[null,"65-128",{"$f":"IF(OR(#REF!=\"\",#REF!=0,#REF!=1,#REF!=2),#REF!,#REF!)","v":{"$error":"#REF!"}},{"$f":"IFERROR(VLOOKUP(C75,KATILIM!D75:F363,3,0),\"\")","v":""},2]
[null,"65-128",{"$f":"IF(OR(#REF!=\"\",#REF!=0,#REF!=1,#REF!=2),#REF!,#REF!)","v":{"$error":"#REF!"}},{"$f":"IFERROR(VLOOKUP(C76,KATILIM!D76:F364,3,0),\"\")","v":""},2]
[null,"65-128",{"$f":"IF(OR(#REF!=\"\",#REF!=0,#REF!=1,#REF!=2),#REF!,#REF!)","v":{"$error":"#REF!"}},{"$f":"IFERROR(VLOOKUP(C77,KATILIM!D77:F365,3,0),\"\")","v":""},2]
[null,"65-128",{"$f":"IF(OR(#REF!=\"\",#REF!=0,#REF!=1,#REF!=2),#REF!,#REF!)","v":{"$error":"#REF!"}},{"$f":"IFERROR(VLOOKUP(C78,KATILIM!D78:F366,3,0),\"\")","v":""},2]
[null,"65-128",{"$f":"IF(OR(#REF!=\"\",#REF!=0,#REF!=1,#REF!=2),#REF!,#REF!)","v":{"$error":"#REF!"}},{"$f":"IFERROR(VLOOKUP(C79,KATILIM!D79:F367,3,0),\"\")","v":""},2]
[null,"65-128",{"$f":"IF(OR(#REF!=\"\",#REF!=0,#REF!=1,#REF!=2),#REF!,#REF!)","v":{"$error":"#REF!"}},{"$f":"IFERROR(VLOOKUP(C80,KATILIM!D80:F368,3,0),\"\")","v":""},2]
[null,"65-128",{"$f":"IF(OR(#REF!=\"\",#REF!=0,#REF!=1,#REF!=2),#REF!,#REF!)","v":{"$error":"#REF!"}},{"$f":"IFERROR(VLOOKUP(C81,KATILIM!D81:F369,3,0),\"\")","v":""},2]
[null,"65-128",{"$f":"IF(OR(#REF!=\"\",#REF!=0,#REF!=1,#REF!=2),#REF!,#REF!)","v":{"$error":"#REF!"}},{"$f":"IFERROR(VLOOKUP(C82,KATILIM!D82:F370,3,0),\"\")","v":""},2]
[null,"65-128",{"$f":"IF(OR(#REF!=\"\",#REF!=0,#REF!=1,#REF!=2),#REF!,#REF!)","v":{"$error":"#REF!"}},{"$f":"IFERROR(VLOOKUP(C83,KATILIM!D83:F371,3,0),\"\")","v":""},2]
[null,"65-128",{"$f":"IF(OR(#REF!=\"\",#REF!=0,#REF!=1,#REF!=2),#REF!,#REF!)","v":{"$error":"#REF!"}},{"$f":"IFERROR(VLOOKUP(C84,KATILIM!D84:F372,3,0),\"\")","v":""},2]
[null,"65-128",{"$f":"IF(OR(#REF!=\"\",#REF!=0,#REF!=1,#REF!=2),#REF!,#REF!)","v":{"$error":"#REF!"}},{"$f":"IFERROR(VLOOKUP(C85,KATILIM!D85:F373,3,0),\"\")","v":""},2]
[null,"65-128",{"$f":"IF(OR(#REF!=\"\",#REF!=0,#REF!=1,#REF!=2),#REF!,#REF!)","v":{"$error":"#REF!"}},{"$f":"IFERROR(VLOOKUP(C86,KATILIM!D86:F374,3,0),\"\")","v":""},2]
[null,"65-128",{"$f":"IF(OR(#REF!=\"\",#REF!=0,#REF!=1,#REF!=2),#REF!,#REF!)","v":{"$error":"#REF!"}},{"$f":"IFERROR(VLOOKUP(C87,KATILIM!D87:F375,3,0),\"\")","v":""},2]
[null,"65-128",{"$f":"IF(OR(#REF!=\"\",#REF!=0,#REF!=1,#REF!=2),#REF!,#REF!)","v":{"$error":"#REF!"}},{"$f":"IFERROR(VLOOKUP(C88,KATILIM!D88:F376,3,0),\"\")","v":""},2]
[null,"65-128",{"$f":"IF(OR(#REF!=\"\",#REF!=0,#REF!=1,#REF!=2),#REF!,#REF!)","v":{"$error":"#REF!"}},{"$f":"IFERROR(VLOOKUP(C89,KATILIM!D89:F377,3,0),\"\")","v":""},2]
[null,"65-128",{"$f":"IF(OR(#REF!=\"\",#REF!=0,#REF!=1,#REF!=2),#REF!,#REF!)","v":{"$error":"#REF!"}},{"$f":"IFERROR(VLOOKUP(C90,KATILIM!D90:F378,3,0),\"\")","v":""},2]
[null,"65-128",{"$f":"IF(OR(#REF!=\"\",#REF!=0,#REF!=1,#REF!=2),#REF!,#REF!)","v":{"$error":"#REF!"}},{"$f":"IFERROR(VLOOKUP(C91,KATILIM!D91:F379,3,0),\"\")","v":""},2]
[null,"65-128",{"$f":"IF(OR(#REF!=\"\",#REF!=0,#REF!=1,#REF!=2),#REF!,#REF!)","v":{"$error":"#REF!"}},{"$f":"IFERROR(VLOOKUP(C92,KATILIM!D92:F380,3,0),\"\")","v":""},2]
[null,"65-128",{"$f":"IF(OR(#REF!=\"\",#REF!=0,#REF!=1,#REF!=2),#REF!,#REF!)","v":{"$error":"#REF!"}},{"$f":"IFERROR(VLOOKUP(C93,KATILIM!D93:F381,3,0),\"\")","v":""},2]
[null,"65-128",{"$f":"IF(OR(#REF!=\"\",#REF!=0,#REF!=1,#REF!=2),#REF!,#REF!)","v":{"$error":"#REF!"}},{"$f":"IFERROR(VLOOKUP(C94,KATILIM!D94:F382,3,0),\"\")","v":""},2]
[null,"65-128",{"$f":"IF(OR(#REF!=\"\",#REF!=0,#REF!=1,#REF!=2),#REF!,#REF!)","v":{"$error":"#REF!"}},{"$f":"IFERROR(VLOOKUP(C95,KATILIM!D95:F383,3,0),\"\")","v":""},2]
[null,"65-128",{"$f":"IF(OR(#REF!=\"\",#REF!=0,#REF!=1,#REF!=2),#REF!,#REF!)","v":{"$error":"#REF!"}},{"$f":"IFERROR(VLOOKUP(C96,KATILIM!D96:F384,3,0),\"\")","v":""},2]
[null,"65-128",{"$f":"IF(OR(#REF!=\"\",#REF!=0,#REF!=1,#REF!=2),#REF!,#REF!)","v":{"$error":"#REF!"}},{"$f":"IFERROR(VLOOKUP(C97,KATILIM!D97:F385,3,0),\"\")","v":""},2]
[null,"65-128",{"$f":"IF(OR(#REF!=\"\",#REF!=0,#REF!=1,#REF!=2),#REF!,#REF!)","v":{"$error":"#REF!"}},{"$f":"IFERROR(VLOOKUP(C98,KATILIM!D98:F386,3,0),\"\")","v":""},2]
[null,"65-128",{"$f":"IF(OR(#REF!=\"\",#REF!=0,#REF!=1,#REF!=2),#REF!,#REF!)","v":{"$error":"#REF!"}},{"$f":"IFERROR(VLOOKUP(C99,KATILIM!D99:F387,3,0),\"\")","v":""},2]
[null,"65-128",{"$f":"IF(OR(#REF!=\"\",#REF!=0,#REF!=1,#REF!=2),#REF!,#REF!)","v":{"$error":"#REF!"}},{"$f":"IFERROR(VLOOKUP(C100,KATILIM!D100:F388,3,0),\"\")","v":""},2]
[null,"65-128",{"$f":"IF(OR(#REF!=\"\",#REF!=0,#REF!=1,#REF!=2),#REF!,#REF!)","v":{"$error":"#REF!"}},{"$f":"IFERROR(VLOOKUP(C101,KATILIM!D101:F389,3,0),\"\")","v":""},2]
[null,"65-128",{"$f":"IF(OR(#REF!=\"\",#REF!=0,#REF!=1,#REF!=2),#REF!,#REF!)","v":{"$error":"#REF!"}},{"$f":"IFERROR(VLOOKUP(C102,KATILIM!D102:F390,3,0),\"\")","v":""},2]
[null,"65-128",{"$f":"IF(OR(#REF!=\"\",#REF!=0,#REF!=1,#REF!=2),#REF!,#REF!)","v":{"$error":"#REF!"}},{"$f":"IFERROR(VLOOKUP(C103,KATILIM!D103:F391,3,0),\"\")","v":""},2]
[null,"65-128",{"$f":"IF(OR(#REF!=\"\",#REF!=0,#REF!=1,#REF!=2),#REF!,#REF!)","v":{"$error":"#REF!"}},{"$f":"IFERROR(VLOOKUP(C104,KATILIM!D104:F392,3,0),\"\")","v":""},2]
[null,"65-128",{"$f":"IF(OR(#REF!=\"\",#REF!=0,#REF!=1,#REF!=2),#REF!,#REF!)","v":{"$error":"#REF!"}},{"$f":"IFERROR(VLOOKUP(C105,KATILIM!D105:F393,3,0),\"\")","v":""},2]
[null,"65-128",{"$f":"IF(OR(#REF!=\"\",#REF!=0,#REF!=1,#REF!=2),#REF!,#REF!)","v":{"$error":"#REF!"}},{"$f":"IFERROR(VLOOKUP(C106,KATILIM!D106:F394,3,0),\"\")","v":""},2]
[null,"65-128",{"$f":"IF(OR(#REF!=\"\",#REF!=0,#REF!=1,#REF!=2),#REF!,#REF!)","v":{"$error":"#REF!"}},{"$f":"IFERROR(VLOOKUP(C107,KATILIM!D107:F395,3,0),\"\")","v":""},2]
[null,"65-128",{"$f":"IF(OR(#REF!=\"\",#REF!=0,#REF!=1,#REF!=2),#REF!,#REF!)","v":{"$error":"#REF!"}},{"$f":"IFERROR(VLOOKUP(C108,KATILIM!D108:F396,3,0),\"\")","v":""},2]
[null,"65-128",{"$f":"IF(OR(#REF!=\"\",#REF!=0,#REF!=1,#REF!=2),#REF!,#REF!)","v":{"$error":"#REF!"}},{"$f":"IFERROR(VLOOKUP(C109,KATILIM!D109:F397,3,0),\"\")","v":""},2]
[null,"65-128",{"$f":"IF(OR(#REF!=\"\",#REF!=0,#REF!=1,#REF!=2),#REF!,#REF!)","v":{"$error":"#REF!"}},{"$f":"IFERROR(VLOOKUP(C110,KATILIM!D110:F398,3,0),\"\")","v":""},2]
[null,"65-128",{"$f":"IF(OR(#REF!=\"\",#REF!=0,#REF!=1,#REF!=2),#REF!,#REF!)","v":{"$error":"#REF!"}},{"$f":"IFERROR(VLOOKUP(C111,KATILIM!D111:F399,3,0),\"\")","v":""},2]
[null,"65-128",{"$f":"IF(OR(#REF!=\"\",#REF!=0,#REF!=1,#REF!=2),#REF!,#REF!)","v":{"$error":"#REF!"}},{"$f":"IFERROR(VLOOKUP(C112,KATILIM!D112:F400,3,0),\"\")","v":""},2]
[null,"65-128",{"$f":"IF(OR(#REF!=\"\",#REF!=0,#REF!=1,#REF!=2),#REF!,#REF!)","v":{"$error":"#REF!"}},{"$f":"IFERROR(VLOOKUP(C113,KATILIM!D113:F401,3,0),\"\")","v":""},2]
[null,"65-128",{"$f":"IF(OR(#REF!=\"\",#REF!=0,#REF!=1,#REF!=2),#REF!,#REF!)","v":{"$error":"#REF!"}},{"$f":"IFERROR(VLOOKUP(C114,KATILIM!D114:F402,3,0),\"\")","v":""},2]
[null,"65-128",{"$f":"IF(OR(#REF!=\"\",#REF!=0,#REF!=1,#REF!=2),#REF!,#REF!)","v":{"$error":"#REF!"}},{"$f":"IFERROR(VLOOKUP(C115,KATILIM!D115:F403,3,0),\"\")","v":""},2]
[null,"65-128",{"$f":"IF(OR(#REF!=\"\",#REF!=0,#REF!=1,#REF!=2),#REF!,#REF!)","v":{"$error":"#REF!"}},{"$f":"IFERROR(VLOOKUP(C116,KATILIM!D116:F404,3,0),\"\")","v":""},2]
[null,"65-128",{"$f":"IF(OR(#REF!=\"\",#REF!=0,#REF!=1,#REF!=2),#REF!,#REF!)","v":{"$error":"#REF!"}},{"$f":"IFERROR(VLOOKUP(C117,KATILIM!D117:F405,3,0),\"\")","v":""},2]
[null,"65-128",{"$f":"IF(OR(#REF!=\"\",#REF!=0,#REF!=1,#REF!=2),#REF!,#REF!)","v":{"$error":"#REF!"}},{"$f":"IFERROR(VLOOKUP(C118,KATILIM!D118:F406,3,0),\"\")","v":""},2]
[null,"65-128",{"$f":"IF(OR(#REF!=\"\",#REF!=0,#REF!=1,#REF!=2),#REF!,#REF!)","v":{"$error":"#REF!"}},{"$f":"IFERROR(VLOOKUP(C119,KATILIM!D119:F407,3,0),\"\")","v":""},2]
[null,"65-128",{"$f":"IF(OR(#REF!=\"\",#REF!=0,#REF!=1,#REF!=2),#REF!,#REF!)","v":{"$error":"#REF!"}},{"$f":"IFERROR(VLOOKUP(C120,KATILIM!D120:F408,3,0),\"\")","v":""},2]
[null,"65-128",{"$f":"IF(OR(#REF!=\"\",#REF!=0,#REF!=1,#REF!=2),#REF!,#REF!)","v":{"$error":"#REF!"}},{"$f":"IFERROR(VLOOKUP(C121,KATILIM!D121:F409,3,0),\"\")","v":""},2]
[null,"65-128",{"$f":"IF(OR(#REF!=\"\",#REF!=0,#REF!=1,#REF!=2),#REF!,#REF!)","v":{"$error":"#REF!"}},{"$f":"IFERROR(VLOOKUP(C122,KATILIM!D122:F410,3,0),\"\")","v":""},2]
[null,"65-128",{"$f":"IF(OR(#REF!=\"\",#REF!=0,#REF!=1,#REF!=2),#REF!,#REF!)","v":{"$error":"#REF!"}},{"$f":"IFERROR(VLOOKUP(C123,KATILIM!D123:F411,3,0),\"\")","v":""},2]
[null,"65-128",{"$f":"IF(OR(#REF!=\"\",#REF!=0,#REF!=1,#REF!=2),#REF!,#REF!)","v":{"$error":"#REF!"}},{"$f":"IFERROR(VLOOKUP(C124,KATILIM!D124:F412,3,0),\"\")","v":""},2]
[null,"65-128",{"$f":"IF(OR(#REF!=\"\",#REF!=0,#REF!=1,#REF!=2),#REF!,#REF!)","v":{"$error":"#REF!"}},{"$f":"IFERROR(VLOOKUP(C125,KATILIM!D125:F413,3,0),\"\")","v":""},2]
[null,"65-128",{"$f":"IF(OR(#REF!=\"\",#REF!=0,#REF!=1,#REF!=2),#REF!,#REF!)","v":{"$error":"#REF!"}},{"$f":"IFERROR(VLOOKUP(C126,KATILIM!D126:F414,3,0),\"\")","v":""},2]
[null,"65-128",{"$f":"IF(OR(#REF!=\"\",#REF!=0,#REF!=1,#REF!=2),#REF!,#REF!)","v":{"$error":"#REF!"}},{"$f":"IFERROR(VLOOKUP(C127,KATILIM!D127:F415,3,0),\"\")","v":""},2]
[null,"65-128",{"$f":"IF(OR(#REF!=\"\",#REF!=0,#REF!=1,#REF!=2),#REF!,#REF!)","v":{"$error":"#REF!"}},{"$f":"IFERROR(VLOOKUP(C128,KATILIM!D128:F416,3,0),\"\")","v":""},2]
[null,"65-128",{"$f":"IF(OR(#REF!=\"\",#REF!=0,#REF!=1,#REF!=2),#REF!,#REF!)","v":{"$error":"#REF!"}},{"$f":"IFERROR(VLOOKUP(C129,KATILIM!D129:F417,3,0),\"\")","v":""},2]
[null,"65-128",{"$f":"IF(OR(#REF!=\"\",#REF!=0,#REF!=1,#REF!=2),#REF!,#REF!)","v":{"$error":"#REF!"}},{"$f":"IFERROR(VLOOKUP(C130,KATILIM!D130:F418,3,0),\"\")","v":""},2]
[null,"65-128",{"$f":"IF(OR(#REF!=\"\",#REF!=0,#REF!=1,#REF!=2),#REF!,#REF!)","v":{"$error":"#REF!"}},{"$f":"IFERROR(VLOOKUP(C131,KATILIM!D131:F419,3,0),\"\")","v":""},2]
["G1.3","129-256",{"$f":"IFERROR(VLOOKUP(A132,'KIZ GRUP'!$N$5:$AF$1000,3,0),\"\")","v":""},{"$f":"IFERROR(VLOOKUP(C132,KATILIM!D132:F420,3,0),\"\")","v":""},1]
["G1.4","129-256",{"$f":"IFERROR(VLOOKUP(A133,'KIZ GRUP'!$N$5:$AF$1000,3,0),\"\")","v":""},{"$f":"IFERROR(VLOOKUP(C133,KATILIM!D133:F421,3,0),\"\")","v":""},1]
["G2.3","129-256",{"$f":"IFERROR(VLOOKUP(A134,'KIZ GRUP'!$N$5:$AF$1000,3,0),\"\")","v":""},{"$f":"IFERROR(VLOOKUP(C134,KATILIM!D134:F422,3,0),\"\")","v":""},1]
["G2.4","129-256",{"$f":"IFERROR(VLOOKUP(A135,'KIZ GRUP'!$N$5:$AF$1000,3,0),\"\")","v":""},{"$f":"IFERROR(VLOOKUP(C135,KATILIM!D135:F423,3,0),\"\")","v":""},1]
["G3.3","129-256",{"$f":"IFERROR(VLOOKUP(A136,'KIZ GRUP'!$N$5:$AF$1000,3,0),\"\")","v":""},{"$f":"IFERROR(VLOOKUP(C136,KATILIM!D136:F424,3,0),\"\")","v":""},1]
["G3.4","129-256",{"$f":"IFERROR(VLOOKUP(A137,'KIZ GRUP'!$N$5:$AF$1000,3,0),\"\")","v":""},{"$f":"IFERROR(VLOOKUP(C137,KATILIM!D137:F425,3,0),\"\")","v":""},1]
["G4.3","129-256",{"$f":"IFERROR(VLOOKUP(A138,'KIZ GRUP'!$N$5:$AF$1000,3,0),\"\")","v":""},{"$f":"IFERROR(VLOOKUP(C138,KATILIM!D138:F426,3,0),\"\")","v":""},1]
["G4.4","129-256",{"$f":"IFERROR(VLOOKUP(A139,'KIZ GRUP'!$N$5:$AF$1000,3,0),\"\")","v":""},{"$f":"IFERROR(VLOOKUP(C139,KATILIM!D139:F427,3,0),\"\")","v":""},1]
["G5.3","129-256",{"$f":"IFERROR(VLOOKUP(A140,'KIZ GRUP'!$N$5:$AF$1000,3,0),\"\")","v":"BAYBURT GMSK (A) (BYB)"},{"$f":"IFERROR(VLOOKUP(C140,KATILIM!D140:F428,3,0),\"\")","v":""},1]
["G5.4","129-256",{"$f":"IFERROR(VLOOKUP(A141,'KIZ GRUP'!$N$5:$AF$1000,3,0),\"\")","v":""},{"$f":"IFERROR(VLOOKUP(C141,KATILIM!D141:F429,3,0),\"\")","v":""},1]
["G6.3","129-256",{"$f":"IFERROR(VLOOKUP(A142,'KIZ GRUP'!$N$5:$AF$1000,3,0),\"\")","v":"SİVAS DANİŞMENT 1967 SPOR (A) (SVS)"},{"$f":"IFERROR(VLOOKUP(C142,KATILIM!D142:F430,3,0),\"\")","v":""},1]
["G6.4","129-256",{"$f":"IFERROR(VLOOKUP(A143,'KIZ GRUP'!$N$5:$AF$1000,3,0),\"\")","v":""},{"$f":"IFERROR(VLOOKUP(C143,KATILIM!D143:F431,3,0),\"\")","v":""},1]
["G7.3","129-256",{"$f":"IFERROR(VLOOKUP(A144,'KIZ GRUP'!$N$5:$AF$1000,3,0),\"\")","v":"SİVAS OKÇULUK SPOR (B) (SVS)"},{"$f":"IFERROR(VLOOKUP(C144,KATILIM!D144:F432,3,0),\"\")","v":""},1]
["G7.4","129-256",{"$f":"IFERROR(VLOOKUP(A145,'KIZ GRUP'!$N$5:$AF$1000,3,0),\"\")","v":""},{"$f":"IFERROR(VLOOKUP(C145,KATILIM!D145:F433,3,0),\"\")","v":""},1]
["G8.3","129-256",{"$f":"IFERROR(VLOOKUP(A146,'KIZ GRUP'!$N$5:$AF$1000,3,0),\"\")","v":"GENÇLİK SPOR (B) (SVS)"},{"$f":"IFERROR(VLOOKUP(C146,KATILIM!D146:F434,3,0),\"\")","v":""},1]
["G8.4","129-256",{"$f":"IFERROR(VLOOKUP(A147,'KIZ GRUP'!$N$5:$AF$1000,3,0),\"\")","v":""},{"$f":"IFERROR(VLOOKUP(C147,KATILIM!D147:F435,3,0),\"\")","v":""},1]
["G9.3","129-256",{"$f":"IFERROR(VLOOKUP(A148,'KIZ GRUP'!$N$5:$AF$1000,3,0),\"\")","v":""},{"$f":"IFERROR(VLOOKUP(C148,KATILIM!D148:F436,3,0),\"\")","v":""},1]
["G9.4","129-256",{"$f":"IFERROR(VLOOKUP(A149,'KIZ GRUP'!$N$5:$AF$1000,3,0),\"\")","v":""},{"$f":"IFERROR(VLOOKUP(C149,KATILIM!D149:F437,3,0),\"\")","v":""},1]
["G10.3","129-256",{"$f":"IFERROR(VLOOKUP(A150,'KIZ GRUP'!$N$5:$AF$1000,3,0),\"\")","v":""},{"$f":"IFERROR(VLOOKUP(C150,KATILIM!D150:F438,3,0),\"\")","v":""},1]
["G10.4","129-256",{"$f":"IFERROR(VLOOKUP(A151,'KIZ GRUP'!$N$5:$AF$1000,3,0),\"\")","v":""},{"$f":"IFERROR(VLOOKUP(C151,KATILIM!D151:F439,3,0),\"\")","v":""},1]
["G11.3","129-256",{"$f":"IFERROR(VLOOKUP(A152,'KIZ GRUP'!$N$5:$AF$1000,3,0),\"\")","v":""},{"$f":"IFERROR(VLOOKUP(C152,KATILIM!D152:F440,3,0),\"\")","v":""},1]
["G11.4","129-256",{"$f":"IFERROR(VLOOKUP(A153,'KIZ GRUP'!$N$5:$AF$1000,3,0),\"\")","v":""},{"$f":"IFERROR(VLOOKUP(C153,KATILIM!D153:F441,3,0),\"\")","v":""},1]
["G12.3","129-256",{"$f":"IFERROR(VLOOKUP(A154,'KIZ GRUP'!$N$5:$AF$1000,3,0),\"\")","v":""},{"$f":"IFERROR(VLOOKUP(C154,KATILIM!D154:F442,3,0),\"\")","v":""},1]
["G12.4","129-256",{"$f":"IFERROR(VLOOKUP(A155,'KIZ GRUP'!$N$5:$AF$1000,3,0),\"\")","v":""},{"$f":"IFERROR(VLOOKUP(C155,KATILIM!D155:F443,3,0),\"\")","v":""},1]
["G13.3","129-256",{"$f":"IFERROR(VLOOKUP(A156,'KIZ GRUP'!$N$5:$AF$1000,3,0),\"\")","v":""},{"$f":"IFERROR(VLOOKUP(C156,KATILIM!D156:F444,3,0),\"\")","v":""},1]
["G13.4","129-256",{"$f":"IFERROR(VLOOKUP(A157,'KIZ GRUP'!$N$5:$AF$1000,3,0),\"\")","v":""},{"$f":"IFERROR(VLOOKUP(C157,KATILIM!D157:F445,3,0),\"\")","v":""},1]
["G14.3","129-256",{"$f":"IFERROR(VLOOKUP(A158,'KIZ GRUP'!$N$5:$AF$1000,3,0),\"\")","v":""},{"$f":"IFERROR(VLOOKUP(C158,KATILIM!D158:F446,3,0),\"\")","v":""},1]
["G14.4","129-256",{"$f":"IFERROR(VLOOKUP(A159,'KIZ GRUP'!$N$5:$AF$1000,3,0),\"\")","v":""},{"$f":"IFERROR(VLOOKUP(C159,KATILIM!D159:F447,3,0),\"\")","v":""},1]
["G15.3","129-256",{"$f":"IFERROR(VLOOKUP(A160,'KIZ GRUP'!$N$5:$AF$1000,3,0),\"\")","v":""},{"$f":"IFERROR(VLOOKUP(C160,KATILIM!D160:F448,3,0),\"\")","v":""},1]
["G15.4","129-256",{"$f":"IFERROR(VLOOKUP(A161,'KIZ GRUP'!$N$5:$AF$1000,3,0),\"\")","v":""},{"$f":"IFERROR(VLOOKUP(C161,KATILIM!D161:F449,3,0),\"\")","v":""},1]
["G16.3","129-256",{"$f":"IFERROR(VLOOKUP(A162,'KIZ GRUP'!$N$5:$AF$1000,3,0),\"\")","v":""},{"$f":"IFERROR(VLOOKUP(C162,KATILIM!D162:F450,3,0),\"\")","v":""},1]
["G16.4","129-256",{"$f":"IFERROR(VLOOKUP(A163,'KIZ GRUP'!$N$5:$AF$1000,3,0),\"\")","v":""},{"$f":"IFERROR(VLOOKUP(C163,KATILIM!D163:F451,3,0),\"\")","v":""},1]
["G17.3","129-256",{"$f":"IFERROR(VLOOKUP(A164,'KIZ GRUP'!$N$5:$AF$1000,3,0),\"\")","v":""},{"$f":"IFERROR(VLOOKUP(C164,KATILIM!D164:F452,3,0),\"\")","v":""},1]
["G17.4","129-256",{"$f":"IFERROR(VLOOKUP(A165,'KIZ GRUP'!$N$5:$AF$1000,3,0),\"\")","v":""},{"$f":"IFERROR(VLOOKUP(C165,KATILIM!D165:F453,3,0),\"\")","v":""},1]
["G18.3","129-256",{"$f":"IFERROR(VLOOKUP(A166,'KIZ GRUP'!$N$5:$AF$1000,3,0),\"\")","v":""},{"$f":"IFERROR(VLOOKUP(C166,KATILIM!D166:F454,3,0),\"\")","v":""},1]
["G18.4","129-256",{"$f":"IFERROR(VLOOKUP(A167,'KIZ GRUP'!$N$5:$AF$1000,3,0),\"\")","v":""},{"$f":"IFERROR(VLOOKUP(C167,KATILIM!D167:F455,3,0),\"\")","v":""},1]
["G19.3","129-256",{"$f":"IFERROR(VLOOKUP(A168,'KIZ GRUP'!$N$5:$AF$1000,3,0),\"\")","v":""},{"$f":"IFERROR(VLOOKUP(C168,KATILIM!D168:F456,3,0),\"\")","v":""},1]
["G19.4","129-256",{"$f":"IFERROR(VLOOKUP(A169,'KIZ GRUP'!$N$5:$AF$1000,3,0),\"\")","v":""},{"$f":"IFERROR(VLOOKUP(C169,KATILIM!D169:F457,3,0),\"\")","v":""},1]
["G20.3","129-256",{"$f":"IFERROR(VLOOKUP(A170,'KIZ GRUP'!$N$5:$AF$1000,3,0),\"\")","v":""},{"$f":"IFERROR(VLOOKUP(C170,KATILIM!D170:F458,3,0),\"\")","v":""},1]
["G20.4","129-256",{"$f":"IFERROR(VLOOKUP(A171,'KIZ GRUP'!$N$5:$AF$1000,3,0),\"\")","v":""},{"$f":"IFERROR(VLOOKUP(C171,KATILIM!D171:F459,3,0),\"\")","v":""},1]
["G21.3","129-256",{"$f":"IFERROR(VLOOKUP(A172,'KIZ GRUP'!$N$5:$AF$1000,3,0),\"\")","v":""},{"$f":"IFERROR(VLOOKUP(C172,KATILIM!D172:F460,3,0),\"\")","v":""},1]
["G21.4","129-256",{"$f":"IFERROR(VLOOKUP(A173,'KIZ GRUP'!$N$5:$AF$1000,3,0),\"\")","v":""},{"$f":"IFERROR(VLOOKUP(C173,KATILIM!D173:F461,3,0),\"\")","v":""},1]
["G22.3","129-256",{"$f":"IFERROR(VLOOKUP(A174,'KIZ GRUP'!$N$5:$AF$1000,3,0),\"\")","v":""},{"$f":"IFERROR(VLOOKUP(C174,KATILIM!D174:F462,3,0),\"\")","v":""},1]
["G22.4","129-256",{"$f":"IFERROR(VLOOKUP(A175,'KIZ GRUP'!$N$5:$AF$1000,3,0),\"\")","v":""},{"$f":"IFERROR(VLOOKUP(C175,KATILIM!D175:F463,3,0),\"\")","v":""},1]
["G23.3","129-256",{"$f":"IFERROR(VLOOKUP(A176,'KIZ GRUP'!$N$5:$AF$1000,3,0),\"\")","v":""},{"$f":"IFERROR(VLOOKUP(C176,KATILIM!D176:F464,3,0),\"\")","v":""},1]
["G23.4","129-256",{"$f":"IFERROR(VLOOKUP(A177,'KIZ GRUP'!$N$5:$AF$1000,3,0),\"\")","v":""},{"$f":"IFERROR(VLOOKUP(C177,KATILIM!D177:F465,3,0),\"\")","v":""},1]
["G24.3","129-256",{"$f":"IFERROR(VLOOKUP(A178,'KIZ GRUP'!$N$5:$AF$1000,3,0),\"\")","v":""},{"$f":"IFERROR(VLOOKUP(C178,KATILIM!D178:F466,3,0),\"\")","v":""},1]
["G24.4","129-256",{"$f":"IFERROR(VLOOKUP(A179,'KIZ GRUP'!$N$5:$AF$1000,3,0),\"\")","v":""},{"$f":"IFERROR(VLOOKUP(C179,KATILIM!D179:F467,3,0),\"\")","v":""},1]
["G25.3","129-256",{"$f":"IFERROR(VLOOKUP(A180,'KIZ GRUP'!$N$5:$AF$1000,3,0),\"\")","v":""},{"$f":"IFERROR(VLOOKUP(C180,KATILIM!D180:F468,3,0),\"\")","v":""},1]
["G25.4","129-256",{"$f":"IFERROR(VLOOKUP(A181,'KIZ GRUP'!$N$5:$AF$1000,3,0),\"\")","v":""},{"$f":"IFERROR(VLOOKUP(C181,KATILIM!D181:F469,3,0),\"\")","v":""},1]
["G26.3","129-256",{"$f":"IFERROR(VLOOKUP(A182,'KIZ GRUP'!$N$5:$AF$1000,3,0),\"\")","v":""},{"$f":"IFERROR(VLOOKUP(C182,KATILIM!D182:F470,3,0),\"\")","v":""},1]
["G26.4","129-256",{"$f":"IFERROR(VLOOKUP(A183,'KIZ GRUP'!$N$5:$AF$1000,3,0),\"\")","v":""},{"$f":"IFERROR(VLOOKUP(C183,KATILIM!D183:F471,3,0),\"\")","v":""},1]
["G27.3","129-256",{"$f":"IFERROR(VLOOKUP(A184,'KIZ GRUP'!$N$5:$AF$1000,3,0),\"\")","v":""},{"$f":"IFERROR(VLOOKUP(C184,KATILIM!D184:F472,3,0),\"\")","v":""},1]
["G27.4","129-256",{"$f":"IFERROR(VLOOKUP(A185,'KIZ GRUP'!$N$5:$AF$1000,3,0),\"\")","v":""},{"$f":"IFERROR(VLOOKUP(C185,KATILIM!D185:F473,3,0),\"\")","v":""},1]
["G28.3","129-256",{"$f":"IFERROR(VLOOKUP(A186,'KIZ GRUP'!$N$5:$AF$1000,3,0),\"\")","v":""},{"$f":"IFERROR(VLOOKUP(C186,KATILIM!D186:F474,3,0),\"\")","v":""},1]
["G28.4","129-256",{"$f":"IFERROR(VLOOKUP(A187,'KIZ GRUP'!$N$5:$AF$1000,3,0),\"\")","v":""},{"$f":"IFERROR(VLOOKUP(C187,KATILIM!D187:F475,3,0),\"\")","v":""},1]
["G29.3","129-256",{"$f":"IFERROR(VLOOKUP(A188,'KIZ GRUP'!$N$5:$AF$1000,3,0),\"\")","v":""},{"$f":"IFERROR(VLOOKUP(C188,KATILIM!D188:F476,3,0),\"\")","v":""},1]
["G29.4","129-256",{"$f":"IFERROR(VLOOKUP(A189,'KIZ GRUP'!$N$5:$AF$1000,3,0),\"\")","v":""},{"$f":"IFERROR(VLOOKUP(C189,KATILIM!D189:F477,3,0),\"\")","v":""},1]
["G30.3","129-256",{"$f":"IFERROR(VLOOKUP(A190,'KIZ GRUP'!$N$5:$AF$1000,3,0),\"\")","v":""},{"$f":"IFERROR(VLOOKUP(C190,KATILIM!D190:F478,3,0),\"\")","v":""},1]
["G30.4","129-256",{"$f":"IFERROR(VLOOKUP(A191,'KIZ GRUP'!$N$5:$AF$1000,3,0),\"\")","v":""},{"$f":"IFERROR(VLOOKUP(C191,KATILIM!D191:F479,3,0),\"\")","v":""},1]
["G31.3","129-256",{"$f":"IFERROR(VLOOKUP(A192,'KIZ GRUP'!$N$5:$AF$1000,3,0),\"\")","v":""},{"$f":"IFERROR(VLOOKUP(C192,KATILIM!D192:F480,3,0),\"\")","v":""},1]
["G31.4","129-256",{"$f":"IFERROR(VLOOKUP(A193,'KIZ GRUP'!$N$5:$AF$1000,3,0),\"\")","v":""},{"$f":"IFERROR(VLOOKUP(C193,KATILIM!D193:F481,3,0),\"\")","v":""},1]
["G32.3","129-256",{"$f":"IFERROR(VLOOKUP(A194,'KIZ GRUP'!$N$5:$AF$1000,3,0),\"\")","v":""},{"$f":"IFERROR(VLOOKUP(C194,KATILIM!D194:F482,3,0),\"\")","v":""},1]
["G32.4","129-256",{"$f":"IFERROR(VLOOKUP(A195,'KIZ GRUP'!$N$5:$AF$1000,3,0),\"\")","v":""},{"$f":"IFERROR(VLOOKUP(C195,KATILIM!D195:F483,3,0),\"\")","v":""},1]
["G33.3","129-256",{"$f":"IFERROR(VLOOKUP(A196,'KIZ GRUP'!$N$5:$AF$1000,3,0),\"\")","v":""},{"$f":"IFERROR(VLOOKUP(C196,KATILIM!D196:F484,3,0),\"\")","v":""},1]
["G33.4","129-256",{"$f":"IFERROR(VLOOKUP(A197,'KIZ GRUP'!$N$5:$AF$1000,3,0),\"\")","v":""},{"$f":"IFERROR(VLOOKUP(C197,KATILIM!D197:F485,3,0),\"\")","v":""},1]
["G34.3","129-256",{"$f":"IFERROR(VLOOKUP(A198,'KIZ GRUP'!$N$5:$AF$1000,3,0),\"\")","v":""},{"$f":"IFERROR(VLOOKUP(C198,KATILIM!D198:F486,3,0),\"\")","v":""},1]
["G34.4","129-256",{"$f":"IFERROR(VLOOKUP(A199,'KIZ GRUP'!$N$5:$AF$1000,3,0),\"\")","v":""},{"$f":"IFERROR(VLOOKUP(C199,KATILIM!D199:F487,3,0),\"\")","v":""},1]
["G35.3","129-256",{"$f":"IFERROR(VLOOKUP(A200,'KIZ GRUP'!$N$5:$AF$1000,3,0),\"\")","v":""},{"$f":"IFERROR(VLOOKUP(C200,KATILIM!D200:F488,3,0),\"\")","v":""},1]
["G35.4","129-256",{"$f":"IFERROR(VLOOKUP(A201,'KIZ GRUP'!$N$5:$AF$1000,3,0),\"\")","v":""},{"$f":"IFERROR(VLOOKUP(C201,KATILIM!D201:F489,3,0),\"\")","v":""},1]
["G36.3","129-256",{"$f":"IFERROR(VLOOKUP(A202,'KIZ GRUP'!$N$5:$AF$1000,3,0),\"\")","v":""},{"$f":"IFERROR(VLOOKUP(C202,KATILIM!D202:F490,3,0),\"\")","v":""},1]
["G36.4","129-256",{"$f":"IFERROR(VLOOKUP(A203,'KIZ GRUP'!$N$5:$AF$1000,3,0),\"\")","v":""},{"$f":"IFERROR(VLOOKUP(C203,KATILIM!D203:F491,3,0),\"\")","v":""},1]
["G37.3","129-256",{"$f":"IFERROR(VLOOKUP(A204,'KIZ GRUP'!$N$5:$AF$1000,3,0),\"\")","v":""},{"$f":"IFERROR(VLOOKUP(C204,KATILIM!D204:F492,3,0),\"\")","v":""},1]
["G37.4","129-256",{"$f":"IFERROR(VLOOKUP(A205,'KIZ GRUP'!$N$5:$AF$1000,3,0),\"\")","v":""},{"$f":"IFERROR(VLOOKUP(C205,KATILIM!D205:F493,3,0),\"\")","v":""},1]
["G38.3","129-256",{"$f":"IFERROR(VLOOKUP(A206,'KIZ GRUP'!$N$5:$AF$1000,3,0),\"\")","v":""},{"$f":"IFERROR(VLOOKUP(C206,KATILIM!D206:F494,3,0),\"\")","v":""},1]
["G38.4","129-256",{"$f":"IFERROR(VLOOKUP(A207,'KIZ GRUP'!$N$5:$AF$1000,3,0),\"\")","v":""},{"$f":"IFERROR(VLOOKUP(C207,KATILIM!D207:F495,3,0),\"\")","v":""},1]
["G39.3","129-256",{"$f":"IFERROR(VLOOKUP(A208,'KIZ GRUP'!$N$5:$AF$1000,3,0),\"\")","v":""},{"$f":"IFERROR(VLOOKUP(C208,KATILIM!D208:F496,3,0),\"\")","v":""},1]
["G39.4","129-256",{"$f":"IFERROR(VLOOKUP(A209,'KIZ GRUP'!$N$5:$AF$1000,3,0),\"\")","v":""},{"$f":"IFERROR(VLOOKUP(C209,KATILIM!D209:F497,3,0),\"\")","v":""},1]
["G40.3","129-256",{"$f":"IFERROR(VLOOKUP(A210,'KIZ GRUP'!$N$5:$AF$1000,3,0),\"\")","v":""},{"$f":"IFERROR(VLOOKUP(C210,KATILIM!D210:F498,3,0),\"\")","v":""},1]
["G40.4","129-256",{"$f":"IFERROR(VLOOKUP(A211,'KIZ GRUP'!$N$5:$AF$1000,3,0),\"\")","v":""},{"$f":"IFERROR(VLOOKUP(C211,KATILIM!D211:F499,3,0),\"\")","v":""},1]
["G41.3","129-256",{"$f":"IFERROR(VLOOKUP(A212,'KIZ GRUP'!$N$5:$AF$1000,3,0),\"\")","v":""},{"$f":"IFERROR(VLOOKUP(C212,KATILIM!D212:F500,3,0),\"\")","v":""},1]
["G41.4","129-256",{"$f":"IFERROR(VLOOKUP(A213,'KIZ GRUP'!$N$5:$AF$1000,3,0),\"\")","v":""},{"$f":"IFERROR(VLOOKUP(C213,KATILIM!D213:F501,3,0),\"\")","v":""},1]
["G42.3","129-256",{"$f":"IFERROR(VLOOKUP(A214,'KIZ GRUP'!$N$5:$AF$1000,3,0),\"\")","v":""},{"$f":"IFERROR(VLOOKUP(C214,KATILIM!D214:F502,3,0),\"\")","v":""},1]
["G42.4","129-256",{"$f":"IFERROR(VLOOKUP(A215,'KIZ GRUP'!$N$5:$AF$1000,3,0),\"\")","v":""},{"$f":"IFERROR(VLOOKUP(C215,KATILIM!D215:F503,3,0),\"\")","v":""},1]
["G43.3","129-256",{"$f":"IFERROR(VLOOKUP(A216,'KIZ GRUP'!$N$5:$AF$1000,3,0),\"\")","v":""},{"$f":"IFERROR(VLOOKUP(C216,KATILIM!D216:F504,3,0),\"\")","v":""},1]
["G43.4","129-256",{"$f":"IFERROR(VLOOKUP(A217,'KIZ GRUP'!$N$5:$AF$1000,3,0),\"\")","v":""},{"$f":"IFERROR(VLOOKUP(C217,KATILIM!D217:F505,3,0),\"\")","v":""},1]
["G44.3","129-256",{"$f":"IFERROR(VLOOKUP(A218,'KIZ GRUP'!$N$5:$AF$1000,3,0),\"\")","v":""},{"$f":"IFERROR(VLOOKUP(C218,KATILIM!D218:F506,3,0),\"\")","v":""},1]
["G44.4","129-256",{"$f":"IFERROR(VLOOKUP(A219,'KIZ GRUP'!$N$5:$AF$1000,3,0),\"\")","v":""},{"$f":"IFERROR(VLOOKUP(C219,KATILIM!D219:F507,3,0),\"\")","v":""},1]
["G45.3","129-256",{"$f":"IFERROR(VLOOKUP(A220,'KIZ GRUP'!$N$5:$AF$1000,3,0),\"\")","v":""},{"$f":"IFERROR(VLOOKUP(C220,KATILIM!D220:F508,3,0),\"\")","v":""},1]
["G45.4","129-256",{"$f":"IFERROR(VLOOKUP(A221,'KIZ GRUP'!$N$5:$AF$1000,3,0),\"\")","v":""},{"$f":"IFERROR(VLOOKUP(C221,KATILIM!D221:F509,3,0),\"\")","v":""},1]
["G46.3","129-256",{"$f":"IFERROR(VLOOKUP(A222,'KIZ GRUP'!$N$5:$AF$1000,3,0),\"\")","v":""},{"$f":"IFERROR(VLOOKUP(C222,KATILIM!D222:F510,3,0),\"\")","v":""},1]
["G46.4","129-256",{"$f":"IFERROR(VLOOKUP(A223,'KIZ GRUP'!$N$5:$AF$1000,3,0),\"\")","v":""},{"$f":"IFERROR(VLOOKUP(C223,KATILIM!D223:F511,3,0),\"\")","v":""},1]
["G47.3","129-256",{"$f":"IFERROR(VLOOKUP(A224,'KIZ GRUP'!$N$5:$AF$1000,3,0),\"\")","v":""},{"$f":"IFERROR(VLOOKUP(C224,KATILIM!D224:F512,3,0),\"\")","v":""},1]
["G47.4","129-256",{"$f":"IFERROR(VLOOKUP(A225,'KIZ GRUP'!$N$5:$AF$1000,3,0),\"\")","v":""},{"$f":"IFERROR(VLOOKUP(C225,KATILIM!D225:F513,3,0),\"\")","v":""},1]
["G48.3","129-256",{"$f":"IFERROR(VLOOKUP(A226,'KIZ GRUP'!$N$5:$AF$1000,3,0),\"\")","v":""},{"$f":"IFERROR(VLOOKUP(C226,KATILIM!D226:F514,3,0),\"\")","v":""},1]
["G48.4","129-256",{"$f":"IFERROR(VLOOKUP(A227,'KIZ GRUP'!$N$5:$AF$1000,3,0),\"\")","v":""},{"$f":"IFERROR(VLOOKUP(C227,KATILIM!D227:F515,3,0),\"\")","v":""},1]
["G49.3","129-256",{"$f":"IFERROR(VLOOKUP(A228,'KIZ GRUP'!$N$5:$AF$1000,3,0),\"\")","v":""},{"$f":"IFERROR(VLOOKUP(C228,KATILIM!D228:F516,3,0),\"\")","v":""},1]
["G49.4","129-256",{"$f":"IFERROR(VLOOKUP(A229,'KIZ GRUP'!$N$5:$AF$1000,3,0),\"\")","v":""},{"$f":"IFERROR(VLOOKUP(C229,KATILIM!D229:F517,3,0),\"\")","v":""},1]
["G50.3","129-256",{"$f":"IFERROR(VLOOKUP(A230,'KIZ GRUP'!$N$5:$AF$1000,3,0),\"\")","v":""},{"$f":"IFERROR(VLOOKUP(C230,KATILIM!D230:F518,3,0),\"\")","v":""},1]
["G50.4","129-256",{"$f":"IFERROR(VLOOKUP(A231,'KIZ GRUP'!$N$5:$AF$1000,3,0),\"\")","v":""},{"$f":"IFERROR(VLOOKUP(C231,KATILIM!D231:F519,3,0),\"\")","v":""},1]
["G51.3","129-256",{"$f":"IFERROR(VLOOKUP(A232,'KIZ GRUP'!$N$5:$AF$1000,3,0),\"\")","v":""},{"$f":"IFERROR(VLOOKUP(C232,KATILIM!D232:F520,3,0),\"\")","v":""},1]
["G51.4","129-256",{"$f":"IFERROR(VLOOKUP(A233,'KIZ GRUP'!$N$5:$AF$1000,3,0),\"\")","v":""},{"$f":"IFERROR(VLOOKUP(C233,KATILIM!D233:F521,3,0),\"\")","v":""},1]
["G52.3","129-256",{"$f":"IFERROR(VLOOKUP(A234,'KIZ GRUP'!$N$5:$AF$1000,3,0),\"\")","v":""},{"$f":"IFERROR(VLOOKUP(C234,KATILIM!D234:F522,3,0),\"\")","v":""},1]
["G52.4","129-256",{"$f":"IFERROR(VLOOKUP(A235,'KIZ GRUP'!$N$5:$AF$1000,3,0),\"\")","v":""},{"$f":"IFERROR(VLOOKUP(C235,KATILIM!D235:F523,3,0),\"\")","v":""},1]
["G53.3","129-256",{"$f":"IFERROR(VLOOKUP(A236,'KIZ GRUP'!$N$5:$AF$1000,3,0),\"\")","v":""},{"$f":"IFERROR(VLOOKUP(C236,KATILIM!D236:F524,3,0),\"\")","v":""},1]
["G53.4","129-256",{"$f":"IFERROR(VLOOKUP(A237,'KIZ GRUP'!$N$5:$AF$1000,3,0),\"\")","v":""},{"$f":"IFERROR(VLOOKUP(C237,KATILIM!D237:F525,3,0),\"\")","v":""},1]
["G54.3","129-256",{"$f":"IFERROR(VLOOKUP(A238,'KIZ GRUP'!$N$5:$AF$1000,3,0),\"\")","v":""},{"$f":"IFERROR(VLOOKUP(C238,KATILIM!D238:F526,3,0),\"\")","v":""},1]
["G54.4","129-256",{"$f":"IFERROR(VLOOKUP(A239,'KIZ GRUP'!$N$5:$AF$1000,3,0),\"\")","v":""},{"$f":"IFERROR(VLOOKUP(C239,KATILIM!D239:F527,3,0),\"\")","v":""},1]
["G55.3","129-256",{"$f":"IFERROR(VLOOKUP(A240,'KIZ GRUP'!$N$5:$AF$1000,3,0),\"\")","v":""},{"$f":"IFERROR(VLOOKUP(C240,KATILIM!D240:F528,3,0),\"\")","v":""},1]
["G55.4","129-256",{"$f":"IFERROR(VLOOKUP(A241,'KIZ GRUP'!$N$5:$AF$1000,3,0),\"\")","v":""},{"$f":"IFERROR(VLOOKUP(C241,KATILIM!D241:F529,3,0),\"\")","v":""},1]
["G56.3","129-256",{"$f":"IFERROR(VLOOKUP(A242,'KIZ GRUP'!$N$5:$AF$1000,3,0),\"\")","v":""},{"$f":"IFERROR(VLOOKUP(C242,KATILIM!D242:F530,3,0),\"\")","v":""},1]
["G56.4","129-256",{"$f":"IFERROR(VLOOKUP(A243,'KIZ GRUP'!$N$5:$AF$1000,3,0),\"\")","v":""},{"$f":"IFERROR(VLOOKUP(C243,KATILIM!D243:F531,3,0),\"\")","v":""},1]
["G57.3","129-256",{"$f":"IFERROR(VLOOKUP(A244,'KIZ GRUP'!$N$5:$AF$1000,3,0),\"\")","v":""},{"$f":"IFERROR(VLOOKUP(C244,KATILIM!D244:F532,3,0),\"\")","v":""},1]
["G57.4","129-256",{"$f":"IFERROR(VLOOKUP(A245,'KIZ GRUP'!$N$5:$AF$1000,3,0),\"\")","v":""},{"$f":"IFERROR(VLOOKUP(C245,KATILIM!D245:F533,3,0),\"\")","v":""},1]
["G58.3","129-256",{"$f":"IFERROR(VLOOKUP(A246,'KIZ GRUP'!$N$5:$AF$1000,3,0),\"\")","v":""},{"$f":"IFERROR(VLOOKUP(C246,KATILIM!D246:F534,3,0),\"\")","v":""},1]
["G58.4","129-256",{"$f":"IFERROR(VLOOKUP(A247,'KIZ GRUP'!$N$5:$AF$1000,3,0),\"\")","v":""},{"$f":"IFERROR(VLOOKUP(C247,KATILIM!D247:F535,3,0),\"\")","v":""},1]
["G59.3","129-256",{"$f":"IFERROR(VLOOKUP(A248,'KIZ GRUP'!$N$5:$AF$1000,3,0),\"\")","v":""},{"$f":"IFERROR(VLOOKUP(C248,KATILIM!D248:F536,3,0),\"\")","v":""},1]
["G59.4","129-256",{"$f":"IFERROR(VLOOKUP(A249,'KIZ GRUP'!$N$5:$AF$1000,3,0),\"\")","v":""},{"$f":"IFERROR(VLOOKUP(C249,KATILIM!D249:F537,3,0),\"\")","v":""},1]
["G60.3","129-256",{"$f":"IFERROR(VLOOKUP(A250,'KIZ GRUP'!$N$5:$AF$1000,3,0),\"\")","v":""},{"$f":"IFERROR(VLOOKUP(C250,KATILIM!D250:F538,3,0),\"\")","v":""},1]
["G60.4","129-256",{"$f":"IFERROR(VLOOKUP(A251,'KIZ GRUP'!$N$5:$AF$1000,3,0),\"\")","v":""},{"$f":"IFERROR(VLOOKUP(C251,KATILIM!D251:F539,3,0),\"\")","v":""},1]
["G61.3","129-256",{"$f":"IFERROR(VLOOKUP(A252,'KIZ GRUP'!$N$5:$AF$1000,3,0),\"\")","v":""},{"$f":"IFERROR(VLOOKUP(C252,KATILIM!D252:F540,3,0),\"\")","v":""},1]
["G61.4","129-256",{"$f":"IFERROR(VLOOKUP(A253,'KIZ GRUP'!$N$5:$AF$1000,3,0),\"\")","v":""},{"$f":"IFERROR(VLOOKUP(C253,KATILIM!D253:F541,3,0),\"\")","v":""},1]
["G62.3","129-256",{"$f":"IFERROR(VLOOKUP(A254,'KIZ GRUP'!$N$5:$AF$1000,3,0),\"\")","v":""},{"$f":"IFERROR(VLOOKUP(C254,KATILIM!D254:F542,3,0),\"\")","v":""},1]
["G62.4","129-256",{"$f":"IFERROR(VLOOKUP(A255,'KIZ GRUP'!$N$5:$AF$1000,3,0),\"\")","v":""},{"$f":"IFERROR(VLOOKUP(C255,KATILIM!D255:F543,3,0),\"\")","v":""},1]
["G63.3","129-256",{"$f":"IFERROR(VLOOKUP(A256,'KIZ GRUP'!$N$5:$AF$1000,3,0),\"\")","v":""},{"$f":"IFERROR(VLOOKUP(C256,KATILIM!D256:F544,3,0),\"\")","v":""},1]
["G63.4","129-256",{"$f":"IFERROR(VLOOKUP(A257,'KIZ GRUP'!$N$5:$AF$1000,3,0),\"\")","v":""},{"$f":"IFERROR(VLOOKUP(C257,KATILIM!D257:F545,3,0),\"\")","v":""},1]
["G64.3","129-256",{"$f":"IFERROR(VLOOKUP(A258,'KIZ GRUP'!$N$5:$AF$1000,3,0),\"\")","v":""},{"$f":"IFERROR(VLOOKUP(C258,KATILIM!D258:F546,3,0),\"\")","v":""},1]
["G64.4","129-256",{"$f":"IFERROR(VLOOKUP(A259,'KIZ GRUP'!$N$5:$AF$1000,3,0),\"\")","v":""},{"$f":"IFERROR(VLOOKUP(C259,KATILIM!D259:F547,3,0),\"\")","v":""},1]

{"sheet":"5_Mac","index":15,"n_rows":76,"n_cols":44,"rows_kept":76,"cut":false,"hidden":true,"merged":[[0,40,0,41],[0,42,0,43],[1,21,2,28],[1,29,2,31],[1,32,2,34],[1,35,2,37],[1,38,2,39],[1,40,2,41],[1,42,2,43],[0,21,0,28],[0,29,0,31],[0,32,0,34],[0,35,0,37],[0,38,0,39],[4,27,5,41],[4,42,5,42],[4,43,5,43],[6,25,7,26],[6,27,7,41],[6,42,7,42],[3,21,3,22],[3,23,3,24],[3,25,3,26],[3,27,3,41],[6,43,7,43],[0,0,7,20],[8,30,9,39],[8,40,9,41],[8,42,9,43],[10,3,10,13],[10,17,10,28],[10,30,10,31],[10,32,10,33],[10,34,10,35],[10,36,10,37],[10,38,10,39],[8,0,10,0],[8,1,10,1],[8,2,10,2],[8,3,9,13],[8,14,10,14],[8,15,10,15],[8,16,10,16],[8,17,9,28],[8,29,10,29],[3,42,3,43],[4,21,7,22],[4,23,7,24],[4,25,5,26],[10,40,10,41],[10,42,10,43],[11,0,13,0],[11,1,13,1],[11,3,13,13],[11,14,13,14],[11,15,13,15],[11,17,13,28],[11,29,13,29],[17,0,19,0],[17,1,19,1],[17,3,19,13],[17,14,19,14],[17,15,19,15],[17,17,19,28],[17,29,19,29],[14,29,16,29],[14,0,16,0],[14,1,16,1],[14,3,16,13],[14,14,16,14],[14,15,16,15],[14,17,16,28],[23,29,25,29],[20,29,22,29],[20,0,22,0],[20,1,22,1],[26,0,26,4],[26,15,26,19],[26,30,27,39],[27,0,27,4],[27,5,27,6],[27,7,27,8],[27,9,27,10],[27,11,27,12],[20,3,22,13],[20,14,22,14],[20,15,22,15],[20,17,22,28],[23,0,25,0],[23,1,25,1],[23,3,25,13],[23,14,25,14],[23,15,25,15],[23,17,25,28],[29,11,29,12],[29,13,29,14],[27,28,27,29],[28,0,28,4],[28,5,28,6],[28,7,28,8],[28,9,28,10],[28,11,28,12],[28,13,28,14],[28,15,28,19],[28,20,28,21],[28,22,28,23],[27,13,27,14],[27,15,27,19],[27,20,27,21],[27,22,27,23],[27,24,27,25],[27,26,27,27],[29,15,29,19],[29,20,29,21],[29,22,29,23],[29,24,29,25],[29,26,29,27],[29,28,29,29],[28,24,28,25],[28,26,28,27],[28,28,28,29],[30,33,31,43],[31,0,31,4],[31,5,31,7],[31,10,31,12],[31,15,31,19],[31,20,31,22],[31,25,31,27],[30,15,30,19],[30,20,30,21],[30,22,30,23],[30,24,30,25],[30,26,30,27],[30,28,30,29],[30,0,30,4],[30,5,30,6],[30,7,30,8],[30,9,30,10],[30,11,30,12],[30,13,30,14],[28,30,31,32],[29,0,29,4],[29,5,29,6],[29,7,29,8],[29,9,29,10],[32,30,32,36],[32,37,32,43],[33,30,36,36],[33,37,36,43],[39,0,46,20],[39,21,39,28],[39,29,39,31],[39,32,39,34],[39,35,39,37],[39,38,39,39],[39,40,39,41],[39,42,39,43],[40,21,41,28],[40,29,41,31],[40,32,41,34],[40,35,41,37],[40,38,41,39],[40,40,41,41],[40,42,41,43],[42,21,42,22],[42,23,42,24],[42,25,42,26],[42,27,42,41],[42,42,42,43],[43,21,46,22],[43,23,46,24],[43,25,44,26],[43,27,44,41],[43,42,44,42],[43,43,44,43],[45,25,46,26],[45,27,46,41],[45,42,46,42],[45,43,46,43],[47,42,48,43],[49,3,49,13],[49,17,49,28],[49,30,49,31],[49,32,49,33],[49,34,49,35],[49,36,49,37],[49,38,49,39],[49,40,49,41],[49,42,49,43],[47,15,49,15],[47,16,49,16],[47,17,48,28],[47,29,49,29],[47,30,48,39],[47,40,48,41],[53,29,55,29],[50,29,52,29],[50,0,52,0],[50,1,52,1],[50,3,52,13],[50,14,52,14],[50,15,52,15],[50,17,52,28],[47,0,49,0],[47,1,49,1],[47,2,49,2],[47,3,48,13],[47,14,49,14],[59,14,61,14],[59,15,61,15],[59,17,61,28],[53,0,55,0],[53,1,55,1],[53,3,55,13],[53,14,55,14],[53,15,55,15],[53,17,55,28],[59,29,61,29],[56,29,58,29],[56,0,58,0],[56,1,58,1],[65,0,65,4],[65,15,65,19],[65,30,66,39],[66,0,66,4],[66,5,66,6],[66,7,66,8],[62,29,64,29],[62,0,64,0],[62,1,64,1],[62,3,64,13],[62,14,64,14],[62,15,64,15],[62,17,64,28],[56,3,58,13],[56,14,58,14],[56,15,58,15],[56,17,58,28],[59,0,61,0],[59,1,61,1],[59,3,61,13],[67,0,67,4],[67,5,67,6],[67,7,67,8],[67,9,67,10],[67,11,67,12],[67,13,67,14],[67,15,67,19],[66,9,66,10],[66,11,66,12],[66,13,66,14],[66,15,66,19],[67,20,67,21],[67,22,67,23],[67,24,67,25],[67,26,67,27],[67,28,67,29],[67,30,70,32],[66,24,66,25],[66,26,66,27],[66,28,66,29],[66,20,66,21],[66,22,66,23],[68,15,68,19],[68,20,68,21],[68,22,68,23],[68,24,68,25],[68,26,68,27],[68,28,68,29],[68,0,68,4],[68,5,68,6],[68,7,68,8],[68,9,68,10],[68,11,68,12],[68,13,68,14],[71,30,71,36],[71,37,71,43],[72,30,75,36],[72,37,75,43],[69,33,70,43],[70,0,70,4],[70,5,70,7],[70,10,70,12],[70,15,70,19],[70,20,70,22],[70,25,70,27],[69,15,69,19],[69,20,69,21],[69,22,69,23],[69,24,69,25],[69,26,69,27],[69,28,69,29],[69,0,69,4],[69,5,69,6],[69,7,69,8],[69,9,69,10],[69,11,69,12],[69,13,69,14]]}
["TÜRKİYE\nMASA TENİSİ FEDERASYONU\nYARIŞMA CETVELİ 5 Maçlık Sistem\n(Yeni swaythling kupa sistemi, 5 Tek)",null,null,null,null,null,null,null,null,null,null,null,null,null,null,null,null,null,null,null,null,"Yarışma Adı",null,null,null,null,null,null,null,"Yeri",null,null,"Tarih",null,null,"Saat",null,null,"Grup",null,"Maç No",null,"Masa"]
[]
[]
[null,null,null,null,null,null,null,null,null,null,null,null,null,null,null,null,null,null,null,null,null,"Erkek",null,"Kadın",null,"Galip",null,"Takımlar",null,null,null,null,null,null,null,null,null,null,null,null,null,null,"Kura"]
[null,null,null,null,null,null,null,null,null,null,null,null,null,null,null,null,null,null,null,null,null,null,null,null,null,null,null,null,null,null,null,null,null,null,null,null,null,null,null,null,null,null,"A","X"]
[]
[null,null,null,null,null,null,null,null,null,null,null,null,null,null,null,null,null,null,null,null,null,null,null,null,null,null,null,null,null,null,null,null,null,null,null,null,null,null,null,null,null,null,"A","X"]
[]
["Maç No","Kura","Lisans No","A-",null,null,null,null,null,null,null,null,null,null,"Mola","Kura","Lisans No","X-",null,null,null,null,null,null,null,null,null,null,null,"Mola","Sayılar",null,null,null,null,null,null,null,null,null,"Setler",null,"Puan"]
[]
[null,null,null,"Sporcular",null,null,null,null,null,null,null,null,null,null,null,null,null,"Sporcular",null,null,null,null,null,null,null,null,null,null,null,null,"1.Set",null,"2.Set",null,"3.Set",null,"4.Set",null,"5.Set",null,"A / X",null,"A / X"]
[1,"A",null,null,null,null,null,null,null,null,null,null,null,null,null,"X"]
[]
[]
[2,"B",null,null,null,null,null,null,null,null,null,null,null,null,null,"Y"]
[]
[]
[3,"C",null,null,null,null,null,null,null,null,null,null,null,null,null,"Z"]
[]
[]
[4,"A",null,null,null,null,null,null,null,null,null,null,null,null,null,"Y"]
[]
[]
[5,"B",null,null,null,null,null,null,null,null,null,null,null,null,null,"X"]
[]
[]
["Forma Rengi",null,null,null,null,null,null,null,null,null,null,null,null,null,null,"Forma Rengi",null,null,null,null,null,null,null,null,null,null,null,null,null,null,"Toplam"]
["Kart\\Oyuncuya",null,null,null,null,1,null,2,null,3,null,4,null,5,null,"Kart\\Oyuncuya",null,null,null,null,1,null,2,null,3,null,4,null,5]
["Sarı",null,null,null,null,null,null,null,null,null,null,null,null,null,null,"Sarı",null,null,null,null,null,null,null,null,null,null,null,null,null,null,"Galip"]
["1. Sarı + Kırmızı",null,null,null,null,null,null,null,null,null,null,null,null,null,null,"1. Sarı + Kırmızı"]
["2. Sarı + Kırmızı",null,null,null,null,null,null,null,null,null,null,null,null,null,null,"2. Sarı + Kırmızı",null,null,null,null,null,null,null,null,null,null,null,null,null,null,null,null,null,{"$f":"\"(  \"&#REF!&\"  -     )\"","v":{"$error":"#REF!"}}]
["Kart\\Öğütücüye",null,null,null,null,"Sarı",null,null,null,null,"Kırmızı",null,null,null,null,"Kart\\Öğütücüye",null,null,null,null,"Sarı",null,null,null,null,"Kırmızı"]
["Kaptan",null,null,null,null,null,null,null,null,null,null,null,null,null,null,"Kaptan",null,null,null,null,null,null,null,null,null,null,null,null,null,null,"Hakemler",null,null,null,null,null,null,"Baş Hakem"]
["Adı Soyadı",null,null,null,":",null,null,null,null,null,null,null,null,null,null,"Adı Soyadı",null,null,null,":"]
["İmza",null,null,null,":",null,null,null,null,null,null,null,null,null,null,"İmza",null,null,null,":"]
[]
["Başlama Saati",null,null,null,null,":",null,null,null,null,null,null,null,null,null,"Bitiş Saati",null,null,null,null,":"]
[]
[]
["TÜRKİYE\nMASA TENİSİ FEDERASYONU\nYARIŞMA CETVELİ 5 Maçlık Sistem\n(Yeni swaythling kupa sistemi, 5 Tek)",null,null,null,null,null,null,null,null,null,null,null,null,null,null,null,null,null,null,null,null,"Yarışma Adı",null,null,null,null,null,null,null,"Yeri",null,null,"Tarih",null,null,"Saat",null,null,"Grup",null,"Maç No",null,"Masa"]
[]
[]
[null,null,null,null,null,null,null,null,null,null,null,null,null,null,null,null,null,null,null,null,null,"Erkek",null,"Kadın",null,"Galip",null,"Takımlar",null,null,null,null,null,null,null,null,null,null,null,null,null,null,"Kura"]
[null,null,null,null,null,null,null,null,null,null,null,null,null,null,null,null,null,null,null,null,null,null,null,null,null,null,null,null,null,null,null,null,null,null,null,null,null,null,null,null,null,null,"A","X"]
[]
[null,null,null,null,null,null,null,null,null,null,null,null,null,null,null,null,null,null,null,null,null,null,null,null,null,null,null,null,null,null,null,null,null,null,null,null,null,null,null,null,null,null,"A","X"]
[]
["Maç No","Kura","Lisans No","A-",null,null,null,null,null,null,null,null,null,null,"Mola","Kura","Lisans No","X-",null,null,null,null,null,null,null,null,null,null,null,"Mola","Sayılar",null,null,null,null,null,null,null,null,null,"Setler",null,"Puan"]
[]
[null,null,null,"Sporcular",null,null,null,null,null,null,null,null,null,null,null,null,null,"Sporcular",null,null,null,null,null,null,null,null,null,null,null,null,"1.Set",null,"2.Set",null,"3.Set",null,"4.Set",null,"5.Set",null,"A / X",null,"A / X"]
[1,"A",null,null,null,null,null,null,null,null,null,null,null,null,null,"X"]
[]
[]
[2,"B",null,null,null,null,null,null,null,null,null,null,null,null,null,"Y"]
[]
[]
[3,"C",null,null,null,null,null,null,null,null,null,null,null,null,null,"Z"]
[]
[]
[4,"A",null,null,null,null,null,null,null,null,null,null,null,null,null,"Y"]
[]
[]
[5,"B",null,null,null,null,null,null,null,null,null,null,null,null,null,"X"]
[]
[]
["Forma Rengi",null,null,null,null,null,null,null,null,null,null,null,null,null,null,"Forma Rengi",null,null,null,null,null,null,null,null,null,null,null,null,null,null,"Toplam"]
["Kart\\Oyuncuya",null,null,null,null,1,null,2,null,3,null,4,null,5,null,"Kart\\Oyuncuya",null,null,null,null,1,null,2,null,3,null,4,null,5]
["Sarı",null,null,null,null,null,null,null,null,null,null,null,null,null,null,"Sarı",null,null,null,null,null,null,null,null,null,null,null,null,null,null,"Galip"]
["1. Sarı + Kırmızı",null,null,null,null,null,null,null,null,null,null,null,null,null,null,"1. Sarı + Kırmızı"]
["2. Sarı + Kırmızı",null,null,null,null,null,null,null,null,null,null,null,null,null,null,"2. Sarı + Kırmızı",null,null,null,null,null,null,null,null,null,null,null,null,null,null,null,null,null,{"$f":"\"(  \"&#REF!&\"  -     )\"","v":{"$error":"#REF!"}}]
["Kart\\Öğütücüye",null,null,null,null,"Sarı",null,null,null,null,"Kırmızı",null,null,null,null,"Kart\\Öğütücüye",null,null,null,null,"Sarı",null,null,null,null,"Kırmızı"]
["Kaptan",null,null,null,null,null,null,null,null,null,null,null,null,null,null,"Kaptan",null,null,null,null,null,null,null,null,null,null,null,null,null,null,"Hakemler",null,null,null,null,null,null,"Baş Hakem"]
["Adı Soyadı",null,null,null,":",null,null,null,null,null,null,null,null,null,null,"Adı Soyadı",null,null,null,":"]
["İmza",null,null,null,":",null,null,null,null,null,null,null,null,null,null,"İmza",null,null,null,":"]
[]
["Başlama Saati",null,null,null,null,":",null,null,null,null,null,null,null,null,null,"Bitiş Saati",null,null,null,null,":"]

{"sheet":"Olimpik","index":16,"n_rows":75,"n_cols":44,"rows_kept":75,"cut":false,"hidden":true,"merged":[[0,40,0,41],[0,42,0,43],[3,21,3,22],[3,23,3,24],[3,25,3,26],[3,27,3,41],[3,42,3,43],[0,0,7,20],[0,21,0,28],[0,29,0,31],[0,32,0,34],[0,35,0,37],[0,38,0,39],[1,21,2,28],[1,29,2,31],[1,32,2,34],[1,35,2,37],[1,38,2,39],[1,40,2,41],[1,42,2,43],[4,23,7,24],[4,25,5,26],[6,25,7,26],[8,40,9,41],[8,42,9,43],[10,38,10,39],[4,42,5,42],[4,43,5,43],[6,42,7,42],[6,43,7,43],[8,0,10,0],[8,1,10,1],[8,2,10,2],[8,3,9,13],[8,14,10,14],[8,15,10,15],[10,3,10,13],[10,17,10,28],[10,30,10,31],[10,32,10,33],[10,34,10,35],[10,36,10,37],[8,16,10,16],[8,17,9,28],[8,29,10,29],[8,30,9,39],[4,21,7,22],[14,0,16,0],[14,1,16,1],[14,3,16,13],[14,14,16,14],[14,15,16,15],[14,17,16,28],[14,29,16,29],[11,29,13,29],[11,0,13,0],[11,1,13,1],[11,3,13,13],[11,14,13,14],[11,15,13,15],[11,17,13,28],[28,15,28,19],[28,20,28,21],[28,22,28,23],[28,24,28,25],[28,26,28,27],[28,28,28,29],[25,0,25,4],[25,15,25,19],[25,30,26,39],[26,0,26,4],[26,5,26,6],[26,7,26,8],[26,9,26,10],[26,11,26,12],[27,24,27,25],[27,26,27,27],[27,28,27,29],[26,28,26,29],[17,0,18,0],[17,29,18,29],[27,5,27,6],[27,7,27,8],[27,9,27,10],[27,11,27,12],[27,13,27,14],[27,15,27,19],[27,20,27,21],[27,22,27,23],[26,13,26,14],[26,15,26,19],[26,20,26,21],[26,22,26,23],[19,0,21,0],[26,24,26,25],[26,26,26,27],[22,0,24,0],[22,1,24,1],[22,3,24,13],[22,14,24,14],[22,15,24,15],[22,17,24,28],[22,29,24,29],[29,33,30,43],[30,0,30,4],[30,5,30,7],[30,10,30,12],[30,15,30,19],[30,20,30,22],[30,25,30,27],[29,15,29,19],[29,20,29,21],[29,22,29,23],[29,24,29,25],[29,26,29,27],[29,28,29,29],[29,0,29,4],[29,5,29,6],[29,7,29,8],[29,9,29,10],[29,11,29,12],[29,13,29,14],[27,30,30,32],[28,0,28,4],[28,11,28,12],[28,13,28,14],[27,0,27,4],[39,40,39,41],[39,42,39,43],[42,21,42,22],[42,23,42,24],[42,25,42,26],[42,27,42,41],[42,42,42,43],[31,30,31,36],[31,37,31,43],[32,30,35,36],[32,37,35,43],[39,21,39,28],[39,29,39,31],[39,32,39,34],[39,35,39,37],[39,38,39,39],[40,21,41,28],[40,29,41,31],[40,32,41,34],[40,35,41,37],[40,38,41,39],[40,40,41,41],[40,42,41,43],[47,40,48,41],[47,42,48,43],[49,38,49,39],[43,42,44,42],[43,43,44,43],[45,42,46,42],[45,43,46,43],[47,0,49,0],[47,1,49,1],[47,2,49,2],[47,3,48,13],[47,14,49,14],[47,15,49,15],[39,0,46,20],[49,3,49,13],[49,17,49,28],[49,30,49,31],[49,32,49,33],[49,34,49,35],[49,36,49,37],[47,16,49,16],[47,17,48,28],[47,29,49,29],[47,30,48,39],[50,0,52,0],[50,1,52,1],[50,3,52,13],[50,14,52,14],[50,15,52,15],[50,17,52,28],[64,0,64,4],[64,15,64,19],[64,30,65,39],[65,0,65,4],[65,5,65,6],[65,7,65,8],[65,9,65,10],[65,11,65,12],[65,28,65,29],[65,13,65,14],[65,15,65,19],[65,20,65,21],[65,22,65,23],[65,24,65,25],[65,26,65,27],[53,0,55,0],[53,1,55,1],[53,3,55,13],[67,24,67,25],[67,26,67,27],[67,28,67,29],[66,24,66,25],[66,26,66,27],[66,28,66,29],[66,0,66,4],[66,5,66,6],[66,7,66,8],[66,9,66,10],[66,11,66,12],[66,13,66,14],[66,15,66,19],[66,20,66,21],[66,22,66,23],[67,0,67,4],[67,5,67,6],[67,7,67,8],[67,9,67,10],[67,11,67,12],[67,13,67,14],[67,15,67,19],[67,20,67,21],[67,22,67,23],[68,13,68,14],[71,30,74,36],[71,37,74,43],[68,33,69,43],[69,0,69,4],[69,5,69,7],[69,10,69,12],[69,15,69,19],[69,20,69,22],[69,25,69,27],[68,15,68,19],[68,20,68,21],[68,22,68,23],[68,24,68,25],[68,26,68,27],[68,28,68,29],[68,0,68,4],[68,5,68,6],[68,7,68,8],[68,9,68,10],[68,11,68,12],[70,30,70,36],[70,37,70,43],[66,30,69,32],[61,0,63,0],[61,1,63,1],[61,3,63,13],[61,14,63,14],[61,15,63,15],[61,17,63,28],[61,29,63,29],[58,0,60,0],[58,1,60,1],[58,3,60,13],[58,14,60,14],[58,15,60,15],[58,17,60,28],[58,29,60,29],[56,0,57,0],[56,29,57,29],[43,21,46,22],[43,23,46,24],[43,25,44,26],[45,25,46,26],[4,27,5,41],[6,27,7,41],[43,27,44,41],[45,27,46,41],[53,14,55,14],[53,15,55,15],[53,17,55,28],[53,29,55,29],[19,1,21,1],[19,3,21,13],[19,14,21,14],[19,15,21,15],[19,17,21,28],[19,29,21,29],[50,29,52,29],[28,5,28,6],[28,7,28,8],[28,9,28,10]]}
["          TÜRKİYE\n          MASA TENİSİ FEDERASYONU\n          YARIŞMA CETVELİ\n          Olimpik Sistem (4 Tek, 1 Çift)",null,null,null,null,null,null,null,null,null,null,null,null,null,null,null,null,null,null,null,null,"Yarışma Adı",null,null,null,null,null,null,null,"Yeri",null,null,"Tarih",null,null,"Saat",null,null,"Etap",null,"Maç No",null,"Masa"]
[]
[]
[null,null,null,null,null,null,null,null,null,null,null,null,null,null,null,null,null,null,null,null,null,"Erkek",null,"Bayan",null,"Galip",null,"Takımlar",null,null,null,null,null,null,null,null,null,null,null,null,null,null,"Kura"]
[null,null,null,null,null,null,null,null,null,null,null,null,null,null,null,null,null,null,null,null,null,null,null,null,null,null,null,null,null,null,null,null,null,null,null,null,null,null,null,null,null,null,"A","X"]
[]
[null,null,null,null,null,null,null,null,null,null,null,null,null,null,null,null,null,null,null,null,null,null,null,null,null,null,null,null,null,null,null,null,null,null,null,null,null,null,null,null,null,null,"A","X"]
[]
["Maç No","Kura","Lisans No","A-",null,null,null,null,null,null,null,null,null,null,"Mola","Kura","Lisans No","X-",null,null,null,null,null,null,null,null,null,null,null,"Mola","Sayılar",null,null,null,null,null,null,null,null,null,"Setler",null,"Puan"]
[]
[null,null,null,"Sporcular",null,null,null,null,null,null,null,null,null,null,null,null,null,"Sporcular",null,null,null,null,null,null,null,null,null,null,null,null,"1.Set",null,"2.Set",null,"3.Set",null,"4.Set",null,"5.Set",null,"A","X","A","X"]
[1,"A",null,null,null,null,null,null,null,null,null,null,null,null,null,"X"]
[]
[]
[2,"B",null,null,null,null,null,null,null,null,null,null,null,null,null,"Y"]
[]
[]
[3,"C",null,null,null,null,null,null,null,null,null,null,null,null,null,"Z"]
[null,"A\nB",null,null,null,null,null,null,null,null,null,null,null,null,null,"X\nY"]
[4,"B\nA",null,null,null,null,null,null,null,null,null,null,null,null,null,"Z"]
[]
[]
[5,"C",null,null,null,null,null,null,null,null,null,null,null,null,null,"Y\nX"]
[]
[]
["Forma Rengi",null,null,null,null,null,null,null,null,null,null,null,null,null,null,"Forma Rengi",null,null,null,null,null,null,null,null,null,null,null,null,null,null,"Toplam"]
["Kart\\Oyuncuya",null,null,null,null,1,null,2,null,3,null,4,null,5,null,"Kart\\Oyuncuya",null,null,null,null,1,null,2,null,3,null,4,null,5]
["Sarı",null,null,null,null,null,null,null,null,null,null,null,null,null,null,"Sarı",null,null,null,null,null,null,null,null,null,null,null,null,null,null,"Galip"]
["1. Sarı + Kırmızı",null,null,null,null,null,null,null,null,null,null,null,null,null,null,"1. Sarı + Kırmızı"]
["2. Sarı + Kırmızı",null,null,null,null,null,null,null,null,null,null,null,null,null,null,"2. Sarı + Kırmızı",null,null,null,null,null,null,null,null,null,null,null,null,null,null,null,null,null,{"$f":"\"(  \"&#REF!&\"  -     )\"","v":{"$error":"#REF!"}}]
["Kart\\Öğütücüye",null,null,null,null,"Sarı",null,null,null,null,"Kırmızı",null,null,null,null,"Kart\\Öğütücüye",null,null,null,null,"Sarı",null,null,null,null,"Kırmızı"]
["Kaptan",null,null,null,null,null,null,null,null,null,null,null,null,null,null,"Kaptan",null,null,null,null,null,null,null,null,null,null,null,null,null,null,"Hakemler",null,null,null,null,null,null,"Baş Hakem"]
["Adı Soyadı",null,null,null,":",null,null,null,null,null,null,null,null,null,null,"Adı Soyadı",null,null,null,":"]
["İmza",null,null,null,":",null,null,null,null,null,null,null,null,null,null,"İmza",null,null,null,":"]
[]
["Başlama Saati",null,null,null,null,":",null,null,null,null,null,null,null,null,null,"Bitiş Saati",null,null,null,null,":"]
[]
[]
[]
["          TÜRKİYE\n          MASA TENİSİ FEDERASYONU\n          YARIŞMA CETVELİ\n          Olimpik Sistem (4 Tek, 1 Çift)",null,null,null,null,null,null,null,null,null,null,null,null,null,null,null,null,null,null,null,null,"Yarışma Adı",null,null,null,null,null,null,null,"Yeri",null,null,"Tarih",null,null,"Saat",null,null,"Etap",null,"Maç No",null,"Masa"]
[]
[]
[null,null,null,null,null,null,null,null,null,null,null,null,null,null,null,null,null,null,null,null,null,"Erkek",null,"Bayan",null,"Galip",null,"Takımlar",null,null,null,null,null,null,null,null,null,null,null,null,null,null,"Kura"]
[null,null,null,null,null,null,null,null,null,null,null,null,null,null,null,null,null,null,null,null,null,null,null,null,null,null,null,null,null,null,null,null,null,null,null,null,null,null,null,null,null,null,"A","X"]
[]
[null,null,null,null,null,null,null,null,null,null,null,null,null,null,null,null,null,null,null,null,null,null,null,null,null,null,null,null,null,null,null,null,null,null,null,null,null,null,null,null,null,null,"A","X"]
[]
["Maç No","Kura","Lisans No","A-",null,null,null,null,null,null,null,null,null,null,"Mola","Kura","Lisans No","X-",null,null,null,null,null,null,null,null,null,null,null,"Mola","Sayılar",null,null,null,null,null,null,null,null,null,"Setler",null,"Puan"]
[]
[null,null,null,"Sporcular",null,null,null,null,null,null,null,null,null,null,null,null,null,"Sporcular",null,null,null,null,null,null,null,null,null,null,null,null,"1.Set",null,"2.Set",null,"3.Set",null,"4.Set",null,"5.Set",null,"A","X","A","X"]
[1,"A",null,null,null,null,null,null,null,null,null,null,null,null,null,"X"]
[]
[]
[2,"B",null,null,null,null,null,null,null,null,null,null,null,null,null,"Y"]
[]
[]
[3,"C",null,null,null,null,null,null,null,null,null,null,null,null,null,"Z"]
[null,"A\nB",null,null,null,null,null,null,null,null,null,null,null,null,null,"X\nY"]
[4,"B\nA",null,null,null,null,null,null,null,null,null,null,null,null,null,"Z"]
[]
[]
[5,"C",null,null,null,null,null,null,null,null,null,null,null,null,null,"Y\nX"]
[]
[]
["Forma Rengi",null,null,null,null,null,null,null,null,null,null,null,null,null,null,"Forma Rengi",null,null,null,null,null,null,null,null,null,null,null,null,null,null,"Toplam"]
["Kart\\Oyuncuya",null,null,null,null,1,null,2,null,3,null,4,null,5,null,"Kart\\Oyuncuya",null,null,null,null,1,null,2,null,3,null,4,null,5]
["Sarı",null,null,null,null,null,null,null,null,null,null,null,null,null,null,"Sarı",null,null,null,null,null,null,null,null,null,null,null,null,null,null,"Galip"]
["1. Sarı + Kırmızı",null,null,null,null,null,null,null,null,null,null,null,null,null,null,"1. Sarı + Kırmızı"]
["2. Sarı + Kırmızı",null,null,null,null,null,null,null,null,null,null,null,null,null,null,"2. Sarı + Kırmızı",null,null,null,null,null,null,null,null,null,null,null,null,null,null,null,null,null,{"$f":"\"(  \"&#REF!&\"  -     )\"","v":{"$error":"#REF!"}}]
["Kart\\Öğütücüye",null,null,null,null,"Sarı",null,null,null,null,"Kırmızı",null,null,null,null,"Kart\\Öğütücüye",null,null,null,null,"Sarı",null,null,null,null,"Kırmızı"]
["Kaptan",null,null,null,null,null,null,null,null,null,null,null,null,null,null,"Kaptan",null,null,null,null,null,null,null,null,null,null,null,null,null,null,"Hakemler",null,null,null,null,null,null,"Baş Hakem"]
["Adı Soyadı",null,null,null,":",null,null,null,null,null,null,null,null,null,null,"Adı Soyadı",null,null,null,":"]
["İmza",null,null,null,":",null,null,null,null,null,null,null,null,null,null,"İmza",null,null,null,":"]
[]
["Başlama Saati",null,null,null,null,":",null,null,null,null,null,null,null,null,null,"Bitiş Saati",null,null,null,null,":"]

{"sheet":"Yeni_Olimpik","index":17,"n_rows":75,"n_cols":44,"rows_kept":75,"cut":false,"hidden":true,"merged":[[0,40,0,41],[0,42,0,43],[3,21,3,22],[3,23,3,24],[3,25,3,26],[3,27,3,41],[3,42,3,43],[0,0,7,20],[0,21,0,28],[0,29,0,31],[0,32,0,34],[0,35,0,37],[0,38,0,39],[1,32,2,34],[1,35,2,37],[1,38,2,39],[1,40,2,41],[1,42,2,43],[1,29,2,31],[1,21,2,28],[4,21,7,22],[4,23,7,24],[4,25,5,26],[6,25,7,26],[8,0,10,0],[8,1,10,1],[8,2,10,2],[8,3,9,13],[8,14,10,14],[8,15,10,15],[8,40,9,41],[8,42,9,43],[10,38,10,39],[4,42,5,42],[4,43,5,43],[6,42,7,42],[6,43,7,43],[6,27,7,41],[4,27,5,41],[10,36,10,37],[10,3,10,13],[10,17,10,28],[10,30,10,31],[10,32,10,33],[10,34,10,35],[8,16,10,16],[8,17,9,28],[8,29,10,29],[8,30,9,39],[14,0,16,0],[14,1,16,1],[14,3,16,13],[14,14,16,14],[14,15,16,15],[14,17,16,28],[14,29,16,29],[11,29,13,29],[11,0,13,0],[11,1,13,1],[11,3,13,13],[11,14,13,14],[11,15,13,15],[11,17,13,28],[23,0,24,0],[23,1,24,1],[23,14,24,14],[23,15,24,15],[23,29,24,29],[17,0,19,0],[17,1,19,1],[17,3,19,13],[17,14,19,14],[17,15,19,15],[17,17,19,28],[20,0,22,0],[20,1,22,1],[20,3,22,13],[20,14,22,14],[20,15,22,15],[20,17,22,28],[17,29,19,29],[20,29,22,29],[25,0,25,4],[25,15,25,19],[25,30,26,39],[26,0,26,4],[26,5,26,6],[26,7,26,8],[26,9,26,10],[26,11,26,12],[27,30,30,32],[28,0,28,4],[28,5,28,6],[28,7,28,8],[28,9,28,10],[28,11,28,12],[28,13,28,14],[26,28,26,29],[27,0,27,4],[27,5,27,6],[27,7,27,8],[27,9,27,10],[27,11,27,12],[27,13,27,14],[27,15,27,19],[27,20,27,21],[26,13,26,14],[26,15,26,19],[26,20,26,21],[26,22,26,23],[26,24,26,25],[26,26,26,27],[29,13,29,14],[28,15,28,19],[28,20,28,21],[28,22,28,23],[28,24,28,25],[28,26,28,27],[29,24,29,25],[29,26,29,27],[28,28,28,29],[27,24,27,25],[27,26,27,27],[27,28,27,29],[39,0,46,20],[39,21,39,28],[39,29,39,31],[39,32,39,34],[39,35,39,37],[42,21,42,22],[42,23,42,24],[42,25,42,26],[42,27,42,41],[27,22,27,23],[29,33,30,43],[30,0,30,4],[30,5,30,7],[30,10,30,12],[30,15,30,19],[30,20,30,22],[30,25,30,27],[29,15,29,19],[29,20,29,21],[29,22,29,23],[29,28,29,29],[29,0,29,4],[29,5,29,6],[29,7,29,8],[29,9,29,10],[29,11,29,12],[47,0,49,0],[47,1,49,1],[47,2,49,2],[47,3,48,13],[47,14,49,14],[47,15,49,15],[49,3,49,13],[42,42,42,43],[31,30,31,36],[31,37,31,43],[32,30,35,36],[32,37,35,43],[40,21,41,28],[40,29,41,31],[40,32,41,34],[40,35,41,37],[40,38,41,39],[40,40,41,41],[40,42,41,43],[39,38,39,39],[39,40,39,41],[39,42,39,43],[50,29,52,29],[47,16,49,16],[47,17,48,28],[47,29,49,29],[47,30,48,39],[49,32,49,33],[49,34,49,35],[49,17,49,28],[49,30,49,31],[49,36,49,37],[49,38,49,39],[64,30,65,39],[65,0,65,4],[65,5,65,6],[65,7,65,8],[65,9,65,10],[65,11,65,12],[59,14,61,14],[59,15,61,15],[62,0,63,0],[62,1,63,1],[62,14,63,14],[62,15,63,15],[59,0,61,0],[59,1,61,1],[59,3,61,13],[65,28,65,29],[65,13,65,14],[65,15,65,19],[65,20,65,21],[65,22,65,23],[65,24,65,25],[65,26,65,27],[67,0,67,4],[67,5,67,6],[67,7,67,8],[67,9,67,10],[67,11,67,12],[67,13,67,14],[66,0,66,4],[66,5,66,6],[66,7,66,8],[66,9,66,10],[66,11,66,12],[66,13,66,14],[69,0,69,4],[69,5,69,7],[69,10,69,12],[69,15,69,19],[69,20,69,22],[69,25,69,27],[68,15,68,19],[68,20,68,21],[68,22,68,23],[68,24,68,25],[68,26,68,27],[68,0,68,4],[68,5,68,6],[68,7,68,8],[68,9,68,10],[68,11,68,12],[66,20,66,21],[50,0,52,0],[50,1,52,1],[50,3,52,13],[64,0,64,4],[64,15,64,19],[50,14,52,14],[50,15,52,15],[50,17,52,28],[47,40,48,41],[68,13,68,14],[71,30,74,36],[71,37,74,43],[66,30,69,32],[68,33,69,43],[53,29,55,29],[70,30,70,36],[70,37,70,43],[68,28,68,29],[53,17,55,28],[67,22,67,23],[67,24,67,25],[67,26,67,27],[67,28,67,29],[66,24,66,25],[66,26,66,27],[66,28,66,29],[59,17,61,28],[62,29,63,29],[59,29,61,29],[67,15,67,19],[67,20,67,21],[66,15,66,19],[47,42,48,43],[66,22,66,23],[43,42,44,42],[43,43,44,43],[45,42,46,42],[45,43,46,43],[56,0,58,0],[56,1,58,1],[56,3,58,13],[56,14,58,14],[56,15,58,15],[56,17,58,28],[53,0,55,0],[53,1,55,1],[53,3,55,13],[53,14,55,14],[53,15,55,15],[56,29,58,29],[43,27,44,41],[45,27,46,41],[43,21,46,22],[43,23,46,24],[43,25,44,26],[45,25,46,26]]}
["          TÜRKİYE\n          MASA TENİSİ FEDERASYONU\n          YARIŞMA CETVELİ\n          Yeni Olimpik Sistem (4 Tek, 1 Çift)",null,null,null,null,null,null,null,null,null,null,null,null,null,null,null,null,null,null,null,null,"Yarışma Adı",null,null,null,null,null,null,null,"Yeri",null,null,"Tarih",null,null,"Saat",null,null,"Etap",null,"Maç No",null,"Masa"]
[]
[]
[null,null,null,null,null,null,null,null,null,null,null,null,null,null,null,null,null,null,null,null,null,"Erkek",null,"Bayan",null,"Galip",null,"Takımlar",null,null,null,null,null,null,null,null,null,null,null,null,null,null,"Kura"]
[null,null,null,null,null,null,null,null,null,null,null,null,null,null,null,null,null,null,null,null,null,null,null,null,null,null,null,null,null,null,null,null,null,null,null,null,null,null,null,null,null,null,"A","X"]
[]
[null,null,null,null,null,null,null,null,null,null,null,null,null,null,null,null,null,null,null,null,null,null,null,null,null,null,null,null,null,null,null,null,null,null,null,null,null,null,null,null,null,null,"A","X"]
[]
["Maç No","Kura","Lisans No","A-",null,null,null,null,null,null,null,null,null,null,"Mola","Kura","Lisans No","X-",null,null,null,null,null,null,null,null,null,null,null,"Mola","Sayılar",null,null,null,null,null,null,null,null,null,"Setler",null,"Puan"]
[]
[null,null,null,"Sporcular",null,null,null,null,null,null,null,null,null,null,null,null,null,"Sporcular",null,null,null,null,null,null,null,null,null,null,null,null,"1.Set",null,"2.Set",null,"3.Set",null,"4.Set",null,"5.Set",null,"A","X","A","X"]
[1,"A",null,null,null,null,null,null,null,null,null,null,null,null,null,"X"]
[]
[]
[2,"B",null,null,null,null,null,null,null,null,null,null,null,null,null,"Y"]
[]
[]
[3,"C",null,null,null,null,null,null,null,null,null,null,null,null,null,"Z"]
[]
[]
[4,"A",null,null,null,null,null,null,null,null,null,null,null,null,null,"Y"]
[]
[]
[5,"Çift",null,null,null,null,null,null,null,null,null,null,null,null,null,"Çift"]
[]
["Forma Rengi",null,null,null,null,null,null,null,null,null,null,null,null,null,null,"Forma Rengi",null,null,null,null,null,null,null,null,null,null,null,null,null,null,"Toplam"]
["Kart\\Oyuncuya",null,null,null,null,1,null,2,null,3,null,4,null,5,null,"Kart\\Oyuncuya",null,null,null,null,1,null,2,null,3,null,4,null,5]
["Sarı",null,null,null,null,null,null,null,null,null,null,null,null,null,null,"Sarı",null,null,null,null,null,null,null,null,null,null,null,null,null,null,"Galip"]
["1. Sarı + Kırmızı",null,null,null,null,null,null,null,null,null,null,null,null,null,null,"1. Sarı + Kırmızı"]
["2. Sarı + Kırmızı",null,null,null,null,null,null,null,null,null,null,null,null,null,null,"2. Sarı + Kırmızı",null,null,null,null,null,null,null,null,null,null,null,null,null,null,null,null,null,{"$f":"\"(  \"&#REF!&\"  -     )\"","v":{"$error":"#REF!"}}]
["Kart\\Öğütücüye",null,null,null,null,"Sarı",null,null,null,null,"Kırmızı",null,null,null,null,"Kart\\Öğütücüye",null,null,null,null,"Sarı",null,null,null,null,"Kırmızı"]
["Kaptan",null,null,null,null,null,null,null,null,null,null,null,null,null,null,"Kaptan",null,null,null,null,null,null,null,null,null,null,null,null,null,null,"Hakemler",null,null,null,null,null,null,"Baş Hakem"]
["Adı Soyadı",null,null,null,":",null,null,null,null,null,null,null,null,null,null,"Adı Soyadı",null,null,null,":"]
["İmza",null,null,null,":",null,null,null,null,null,null,null,null,null,null,"İmza",null,null,null,":"]
[]
["Başlama Saati",null,null,null,null,":",null,null,null,null,null,null,null,null,null,"Bitiş Saati",null,null,null,null,":"]
[]
[]
[]
["          TÜRKİYE\n          MASA TENİSİ FEDERASYONU\n          YARIŞMA CETVELİ\n          Yeni Olimpik Sistem (4 Tek, 1 Çift)",null,null,null,null,null,null,null,null,null,null,null,null,null,null,null,null,null,null,null,null,"Yarışma Adı",null,null,null,null,null,null,null,"Yeri",null,null,"Tarih",null,null,"Saat",null,null,"Etap",null,"Maç No",null,"Masa"]
[]
[]
[null,null,null,null,null,null,null,null,null,null,null,null,null,null,null,null,null,null,null,null,null,"Erkek",null,"Bayan",null,"Galip",null,"Takımlar",null,null,null,null,null,null,null,null,null,null,null,null,null,null,"Kura"]
[null,null,null,null,null,null,null,null,null,null,null,null,null,null,null,null,null,null,null,null,null,null,null,null,null,null,null,null,null,null,null,null,null,null,null,null,null,null,null,null,null,null,"A","X"]
[]
[null,null,null,null,null,null,null,null,null,null,null,null,null,null,null,null,null,null,null,null,null,null,null,null,null,null,null,null,null,null,null,null,null,null,null,null,null,null,null,null,null,null,"A","X"]
[]
["Maç No","Kura","Lisans No","A-",null,null,null,null,null,null,null,null,null,null,"Mola","Kura","Lisans No","X-",null,null,null,null,null,null,null,null,null,null,null,"Mola","Sayılar",null,null,null,null,null,null,null,null,null,"Setler",null,"Puan"]
[]
[null,null,null,"Sporcular",null,null,null,null,null,null,null,null,null,null,null,null,null,"Sporcular",null,null,null,null,null,null,null,null,null,null,null,null,"1.Set",null,"2.Set",null,"3.Set",null,"4.Set",null,"5.Set",null,"A","X","A","X"]
[1,"A",null,null,null,null,null,null,null,null,null,null,null,null,null,"X"]
[]
[]
[2,"B",null,null,null,null,null,null,null,null,null,null,null,null,null,"Y"]
[]
[]
[3,"C",null,null,null,null,null,null,null,null,null,null,null,null,null,"Z"]
[]
[]
[4,"A",null,null,null,null,null,null,null,null,null,null,null,null,null,"Y"]
[]
[]
[5,"Çift",null,null,null,null,null,null,null,null,null,null,null,null,null,"Çift"]
[]
["Forma Rengi",null,null,null,null,null,null,null,null,null,null,null,null,null,null,"Forma Rengi",null,null,null,null,null,null,null,null,null,null,null,null,null,null,"Toplam"]
["Kart\\Oyuncuya",null,null,null,null,1,null,2,null,3,null,4,null,5,null,"Kart\\Oyuncuya",null,null,null,null,1,null,2,null,3,null,4,null,5]
["Sarı",null,null,null,null,null,null,null,null,null,null,null,null,null,null,"Sarı",null,null,null,null,null,null,null,null,null,null,null,null,null,null,"Galip"]
["1. Sarı + Kırmızı",null,null,null,null,null,null,null,null,null,null,null,null,null,null,"1. Sarı + Kırmızı"]
["2. Sarı + Kırmızı",null,null,null,null,null,null,null,null,null,null,null,null,null,null,"2. Sarı + Kırmızı",null,null,null,null,null,null,null,null,null,null,null,null,null,null,null,null,null,{"$f":"\"(  \"&#REF!&\"  -     )\"","v":{"$error":"#REF!"}}]
["Kart\\Öğütücüye",null,null,null,null,"Sarı",null,null,null,null,"Kırmızı",null,null,null,null,"Kart\\Öğütücüye",null,null,null,null,"Sarı",null,null,null,null,"Kırmızı"]
["Kaptan",null,null,null,null,null,null,null,null,null,null,null,null,null,null,"Kaptan",null,null,null,null,null,null,null,null,null,null,null,null,null,null,"Hakemler",null,null,null,null,null,null,"Baş Hakem"]
["Adı Soyadı",null,null,null,":",null,null,null,null,null,null,null,null,null,null,"Adı Soyadı",null,null,null,":"]
["İmza",null,null,null,":",null,null,null,null,null,null,null,null,null,null,"İmza",null,null,null,":"]
[]
["Başlama Saati",null,null,null,null,":",null,null,null,null,null,null,null,null,null,"Bitiş Saati",null,null,null,null,":"]

{"sheet":"5_Mac_KC","index":18,"n_rows":47,"n_cols":10,"rows_kept":47,"cut":false,"hidden":true,"merged":[[13,0,13,3],[13,6,13,9],[0,0,0,3],[0,6,0,9],[1,0,1,3],[1,6,1,9],[5,2,5,3],[5,8,5,9],[6,2,6,3],[6,8,6,9],[7,8,7,9],[12,0,12,3],[12,6,12,9],[17,2,17,3],[17,8,17,9],[18,2,18,3],[18,8,18,9],[19,8,19,9],[24,0,24,3],[24,6,24,9],[25,0,25,3],[25,6,25,9],[29,2,29,3],[29,8,29,9],[30,2,30,3],[30,8,30,9],[31,8,31,9],[36,0,36,3],[36,6,36,9],[43,8,43,9],[37,0,37,3],[37,6,37,9],[41,2,41,3],[41,8,41,9],[42,2,42,3],[42,8,42,9]]}
["TÜRKİYE",null,null,null,null,null,"TÜRKİYE"]
["MASA TENİSİ FEDERASYONU",null,null,null,null,null,"MASA TENİSİ FEDERASYONU"]
["TAKIM LİSTESİ",null,null,null,null,null,"TAKIM LİSTESİ"]
["Takım Adı",null,null,":",null,null,"Takım Adı",null,null,":"]
["Karşılaşacağı Takım",null,null,":",null,null,"Karşılaşacağı Takım",null,null,":"]
["A",null,": ………………………………..…………………..……….……….",null,null,null,"X",null,": ………………………………..…………………..……….………."]
["B",null,": ………………………………..…………………..……….……….",null,null,null,"Y",null,": ………………………………..…………………..……….………."]
["C",null,": ………………………………..…………………..……….……….",null,null,null,"Z",null,": ………………………………..…………………..……….………."]
["Karşılaşma Tarihi",null,null,":……………………………………...",null,null,"Karşılaşma Tarihi",null,null,":……………………………………..."]
["Takım Kaptanı",null,null,":……………………………………...",null,null,"Takım Kaptanı",null,null,":……………………………………..."]
["İmza",null,null,":……………………………………...",null,null,"İmza",null,null,":……………………………………..."]
[]
["TÜRKİYE",null,null,null,null,null,"TÜRKİYE"]
["MASA TENİSİ FEDERASYONU",null,null,null,null,null,"MASA TENİSİ FEDERASYONU"]
["TAKIM LİSTESİ",null,null,null,null,null,"TAKIM LİSTESİ"]
["Takım Adı",null,null,":",null,null,"Takım Adı",null,null,":"]
["Karşılaşacağı Takım",null,null,":",null,null,"Karşılaşacağı Takım",null,null,":"]
["A",null,": ………………………………..…………………..……….……….",null,null,null,"X",null,": ………………………………..…………………..……….………."]
["B",null,": ………………………………..…………………..……….……….",null,null,null,"Y",null,": ………………………………..…………………..……….………."]
["C",null,": ………………………………..…………………..……….……….",null,null,null,"Z",null,": ………………………………..…………………..……….………."]
["Karşılaşma Tarihi",null,null,":……………………………………...",null,null,"Karşılaşma Tarihi",null,null,":……………………………………..."]
["Takım Kaptanı",null,null,":……………………………………...",null,null,"Takım Kaptanı",null,null,":……………………………………..."]
["İmza",null,null,":……………………………………...",null,null,"İmza",null,null,":……………………………………..."]
[]
["TÜRKİYE",null,null,null,null,null,"TÜRKİYE"]
["MASA TENİSİ FEDERASYONU",null,null,null,null,null,"MASA TENİSİ FEDERASYONU"]
["TAKIM LİSTESİ",null,null,null,null,null,"TAKIM LİSTESİ"]
["Takım Adı",null,null,":",null,null,"Takım Adı",null,null,":"]
["Karşılaşacağı Takım",null,null,":",null,null,"Karşılaşacağı Takım",null,null,":"]
["A",null,": ………………………………..…………………..……….……….",null,null,null,"X",null,": ………………………………..…………………..……….………."]
["B",null,": ………………………………..…………………..……….……….",null,null,null,"Y",null,": ………………………………..…………………..……….………."]
["C",null,": ………………………………..…………………..……….……….",null,null,null,"Z",null,": ………………………………..…………………..……….………."]
["Karşılaşma Tarihi",null,null,":……………………………………...",null,null,"Karşılaşma Tarihi",null,null,":……………………………………..."]
["Takım Kaptanı",null,null,":……………………………………...",null,null,"Takım Kaptanı",null,null,":……………………………………..."]
["İmza",null,null,":……………………………………...",null,null,"İmza",null,null,":……………………………………..."]
[]
["TÜRKİYE",null,null,null,null,null,"TÜRKİYE"]
["MASA TENİSİ FEDERASYONU",null,null,null,null,null,"MASA TENİSİ FEDERASYONU"]
["TAKIM LİSTESİ",null,null,null,null,null,"TAKIM LİSTESİ"]
["Takım Adı",null,null,":",null,null,"Takım Adı",null,null,":"]
["Karşılaşacağı Takım",null,null,":",null,null,"Karşılaşacağı Takım",null,null,":"]
["A",null,": ………………………………..…………………..……….……….",null,null,null,"X",null,": ………………………………..…………………..……….………."]
["B",null,": ………………………………..…………………..……….……….",null,null,null,"Y",null,": ………………………………..…………………..……….………."]
["C",null,": ………………………………..…………………..……….……….",null,null,null,"Z",null,": ………………………………..…………………..……….………."]
["Karşılaşma Tarihi",null,null,":……………………………………...",null,null,"Karşılaşma Tarihi",null,null,":……………………………………..."]
["Takım Kaptanı",null,null,":……………………………………...",null,null,"Takım Kaptanı",null,null,":……………………………………..."]
["İmza",null,null,":……………………………………...",null,null,"İmza",null,null,":……………………………………..."]

{"sheet":"Olimpik_KC","index":19,"n_rows":51,"n_cols":10,"rows_kept":51,"cut":false,"hidden":true,"merged":[[0,0,0,3],[0,6,0,9],[1,0,1,3],[1,6,1,9],[5,2,5,3],[5,8,5,9],[6,2,6,3],[6,8,6,9],[13,0,13,3],[13,6,13,9],[14,0,14,3],[14,6,14,9],[7,0,8,0],[7,6,8,6],[31,2,31,3],[31,8,31,9],[18,2,18,3],[18,8,18,9],[19,2,19,3],[19,8,19,9],[32,2,32,3],[32,8,32,9],[33,0,34,0],[33,6,34,6],[39,0,39,3],[20,0,21,0],[20,6,21,6],[27,0,27,3],[27,6,27,9],[26,0,26,3],[26,6,26,9],[46,0,47,0],[46,6,47,6],[39,6,39,9],[40,0,40,3],[40,6,40,9],[44,2,44,3],[45,2,45,3],[45,8,45,9],[44,8,44,9]]}
["TÜRKİYE",null,null,null,null,null,"TÜRKİYE"]
["MASA TENİSİ FEDERASYONU",null,null,null,null,null,"MASA TENİSİ FEDERASYONU"]
["TAKIM LİSTESİ",null,null,null,null,null,"TAKIM LİSTESİ"]
["Takım Adı",null,null,":",null,null,"Takım Adı",null,null,":"]
["Karşılaşacağı Takım",null,null,":",null,null,"Karşılaşacağı Takım",null,null,":"]
["A",null,": ………………………………..…………………..……….……….",null,null,null,"X",null,": ………………………………..…………………..……….………."]
["B",null,": ………………………………..…………………..……….……….",null,null,null,"Y",null,": ………………………………..…………………..……….………."]
["Çift","C",": ………………………………..…………………..……….……….",null,null,null,"Çift","Z",": ………………………………..…………………..……….………."]
[null,null,": ………………………………..…………………..……….……….",null,null,null,null,null,": ………………………………..…………………..……….………."]
["Karşılaşma Tarihi",null,null,":……………………………………...",null,null,"Karşılaşma Tarihi",null,null,":……………………………………..."]
["Takım Kaptanı",null,null,":……………………………………...",null,null,"Takım Kaptanı",null,null,":……………………………………..."]
["İmza",null,null,":……………………………………...",null,null,"İmza",null,null,":……………………………………..."]
[]
["TÜRKİYE",null,null,null,null,null,"TÜRKİYE"]
["MASA TENİSİ FEDERASYONU",null,null,null,null,null,"MASA TENİSİ FEDERASYONU"]
["TAKIM LİSTESİ",null,null,null,null,null,"TAKIM LİSTESİ"]
["Takım Adı",null,null,":",null,null,"Takım Adı",null,null,":"]
["Karşılaşacağı Takım",null,null,":",null,null,"Karşılaşacağı Takım",null,null,":"]
["A",null,": ………………………………..…………………..……….……….",null,null,null,"X",null,": ………………………………..…………………..……….………."]
["B",null,": ………………………………..…………………..……….……….",null,null,null,"Y",null,": ………………………………..…………………..……….………."]
["Çift","C",": ………………………………..…………………..……….……….",null,null,null,"Çift","Z",": ………………………………..…………………..……….………."]
[null,null,": ………………………………..…………………..……….……….",null,null,null,null,null,": ………………………………..…………………..……….………."]
["Karşılaşma Tarihi",null,null,":……………………………………...",null,null,"Karşılaşma Tarihi",null,null,":……………………………………..."]
["Takım Kaptanı",null,null,":……………………………………...",null,null,"Takım Kaptanı",null,null,":……………………………………..."]
["İmza",null,null,":……………………………………...",null,null,"İmza",null,null,":……………………………………..."]
[]
["TÜRKİYE",null,null,null,null,null,"TÜRKİYE"]
["MASA TENİSİ FEDERASYONU",null,null,null,null,null,"MASA TENİSİ FEDERASYONU"]
["TAKIM LİSTESİ",null,null,null,null,null,"TAKIM LİSTESİ"]
["Takım Adı",null,null,":",null,null,"Takım Adı",null,null,":"]
["Karşılaşacağı Takım",null,null,":",null,null,"Karşılaşacağı Takım",null,null,":"]
["A",null,": ………………………………..…………………..……….……….",null,null,null,"X",null,": ………………………………..…………………..……….………."]
["B",null,": ………………………………..…………………..……….……….",null,null,null,"Y",null,": ………………………………..…………………..……….………."]
["Çift","C",": ………………………………..…………………..……….……….",null,null,null,"Çift","Z",": ………………………………..…………………..……….………."]
[null,null,": ………………………………..…………………..……….……….",null,null,null,null,null,": ………………………………..…………………..……….………."]
["Karşılaşma Tarihi",null,null,":……………………………………...",null,null,"Karşılaşma Tarihi",null,null,":……………………………………..."]
["Takım Kaptanı",null,null,":……………………………………...",null,null,"Takım Kaptanı",null,null,":……………………………………..."]
["İmza",null,null,":……………………………………...",null,null,"İmza",null,null,":……………………………………..."]
[]
["TÜRKİYE",null,null,null,null,null,"TÜRKİYE"]
["MASA TENİSİ FEDERASYONU",null,null,null,null,null,"MASA TENİSİ FEDERASYONU"]
["TAKIM LİSTESİ",null,null,null,null,null,"TAKIM LİSTESİ"]
["Takım Adı",null,null,":",null,null,"Takım Adı",null,null,":"]
["Karşılaşacağı Takım",null,null,":",null,null,"Karşılaşacağı Takım",null,null,":"]
["A",null,": ………………………………..…………………..……….……….",null,null,null,"X",null,": ………………………………..…………………..……….………."]
["B",null,": ………………………………..…………………..……….……….",null,null,null,"Y",null,": ………………………………..…………………..……….………."]
["Çift","C",": ………………………………..…………………..……….……….",null,null,null,"Çift","Z",": ………………………………..…………………..……….………."]
[null,null,": ………………………………..…………………..……….……….",null,null,null,null,null,": ………………………………..…………………..……….………."]
["Karşılaşma Tarihi",null,null,":……………………………………...",null,null,"Karşılaşma Tarihi",null,null,":……………………………………..."]
["Takım Kaptanı",null,null,":……………………………………...",null,null,"Takım Kaptanı",null,null,":……………………………………..."]
["İmza",null,null,":……………………………………...",null,null,"İmza",null,null,":……………………………………..."]

{"sheet":"Yeni_Olimpik_KC","index":20,"n_rows":55,"n_cols":10,"rows_kept":55,"cut":false,"hidden":true,"merged":[[0,0,0,3],[0,6,0,9],[1,0,1,3],[1,6,1,9],[5,2,5,3],[5,8,5,9],[6,2,6,3],[6,8,6,9],[8,0,9,0],[8,6,9,6],[14,0,14,3],[14,6,14,9],[7,2,7,3],[7,8,7,9],[8,2,8,3],[9,2,9,3],[9,8,9,9],[8,8,8,9],[21,2,21,3],[21,8,21,9],[22,0,23,0],[22,2,22,3],[15,0,15,3],[15,6,15,9],[19,2,19,3],[19,8,19,9],[20,2,20,3],[20,8,20,9],[22,6,23,6],[22,8,22,9],[23,2,23,3],[23,8,23,9],[42,0,42,3],[42,6,42,9],[43,0,43,3],[43,6,43,9],[33,2,33,3],[33,8,33,9],[34,2,34,3],[34,8,34,9],[35,2,35,3],[35,8,35,9],[29,0,29,3],[29,6,29,9],[28,0,28,3],[28,6,28,9],[36,0,37,0],[36,2,36,3],[36,6,37,6],[36,8,36,9],[37,2,37,3],[37,8,37,9],[47,2,47,3],[47,8,47,9],[48,2,48,3],[48,8,48,9],[49,2,49,3],[49,8,49,9],[50,0,51,0],[50,2,50,3],[50,6,51,6],[50,8,50,9],[51,2,51,3],[51,8,51,9]]}
["TÜRKİYE",null,null,null,null,null,"TÜRKİYE"]
["MASA TENİSİ FEDERASYONU",null,null,null,null,null,"MASA TENİSİ FEDERASYONU"]
["TAKIM LİSTESİ",null,null,null,null,null,"TAKIM LİSTESİ"]
["Takım Adı",null,null,":",null,null,"Takım Adı",null,null,":"]
["Karşılaşacağı Takım",null,null,":",null,null,"Karşılaşacağı Takım",null,null,":"]
["A",null,": ………………………………..…………………..……….……….",null,null,null,"X",null,": ………………………………..…………………..……….………."]
["B",null,": ………………………………..…………………..……….……….",null,null,null,"Y",null,": ………………………………..…………………..……….………."]
["C",null,": ………………………………..…………………..……….……….",null,null,null,"Z",null,": ………………………………..…………………..……….………."]
["Çift",null,": ………………………………..…………………..……….……….",null,null,null,"Çift",null,": ………………………………..…………………..……….………."]
[null,null,": ………………………………..…………………..……….……….",null,null,null,null,null,": ………………………………..…………………..……….………."]
["Karşılaşma Tarihi",null,null,":……………………………………...",null,null,"Karşılaşma Tarihi",null,null,":……………………………………..."]
["Takım Kaptanı",null,null,":……………………………………...",null,null,"Takım Kaptanı",null,null,":……………………………………..."]
["İmza",null,null,":……………………………………...",null,null,"İmza",null,null,":……………………………………..."]
[]
["TÜRKİYE",null,null,null,null,null,"TÜRKİYE"]
["MASA TENİSİ FEDERASYONU",null,null,null,null,null,"MASA TENİSİ FEDERASYONU"]
["TAKIM LİSTESİ",null,null,null,null,null,"TAKIM LİSTESİ"]
["Takım Adı",null,null,":",null,null,"Takım Adı",null,null,":"]
["Karşılaşacağı Takım",null,null,":",null,null,"Karşılaşacağı Takım",null,null,":"]
["A",null,": ………………………………..…………………..……….……….",null,null,null,"X",null,": ………………………………..…………………..……….………."]
["B",null,": ………………………………..…………………..……….……….",null,null,null,"Y",null,": ………………………………..…………………..……….………."]
["C",null,": ………………………………..…………………..……….……….",null,null,null,"Z",null,": ………………………………..…………………..……….………."]
["Çift",null,": ………………………………..…………………..……….……….",null,null,null,"Çift",null,": ………………………………..…………………..……….………."]
[null,null,": ………………………………..…………………..……….……….",null,null,null,null,null,": ………………………………..…………………..……….………."]
["Karşılaşma Tarihi",null,null,":……………………………………...",null,null,"Karşılaşma Tarihi",null,null,":……………………………………..."]
["Takım Kaptanı",null,null,":……………………………………...",null,null,"Takım Kaptanı",null,null,":……………………………………..."]
["İmza",null,null,":……………………………………...",null,null,"İmza",null,null,":……………………………………..."]
[]
["TÜRKİYE",null,null,null,null,null,"TÜRKİYE"]
["MASA TENİSİ FEDERASYONU",null,null,null,null,null,"MASA TENİSİ FEDERASYONU"]
["TAKIM LİSTESİ",null,null,null,null,null,"TAKIM LİSTESİ"]
["Takım Adı",null,null,":",null,null,"Takım Adı",null,null,":"]
["Karşılaşacağı Takım",null,null,":",null,null,"Karşılaşacağı Takım",null,null,":"]
["A",null,": ………………………………..…………………..……….……….",null,null,null,"X",null,": ………………………………..…………………..……….………."]
["B",null,": ………………………………..…………………..……….……….",null,null,null,"Y",null,": ………………………………..…………………..……….………."]
["C",null,": ………………………………..…………………..……….……….",null,null,null,"Z",null,": ………………………………..…………………..……….………."]
["Çift",null,": ………………………………..…………………..……….……….",null,null,null,"Çift",null,": ………………………………..…………………..……….………."]
[null,null,": ………………………………..…………………..……….……….",null,null,null,null,null,": ………………………………..…………………..……….………."]
["Karşılaşma Tarihi",null,null,":……………………………………...",null,null,"Karşılaşma Tarihi",null,null,":……………………………………..."]
["Takım Kaptanı",null,null,":……………………………………...",null,null,"Takım Kaptanı",null,null,":……………………………………..."]
["İmza",null,null,":……………………………………...",null,null,"İmza",null,null,":……………………………………..."]
[]
["TÜRKİYE",null,null,null,null,null,"TÜRKİYE"]
["MASA TENİSİ FEDERASYONU",null,null,null,null,null,"MASA TENİSİ FEDERASYONU"]
["TAKIM LİSTESİ",null,null,null,null,null,"TAKIM LİSTESİ"]
["Takım Adı",null,null,":",null,null,"Takım Adı",null,null,":"]
["Karşılaşacağı Takım",null,null,":",null,null,"Karşılaşacağı Takım",null,null,":"]
["A",null,": ………………………………..…………………..……….……….",null,null,null,"X",null,": ………………………………..…………………..……….………."]
["B",null,": ………………………………..…………………..……….……….",null,null,null,"Y",null,": ………………………………..…………………..……….………."]
["C",null,": ………………………………..…………………..……….……….",null,null,null,"Z",null,": ………………………………..…………………..……….………."]
["Çift",null,": ………………………………..…………………..……….……….",null,null,null,"Çift",null,": ………………………………..…………………..……….………."]
[null,null,": ………………………………..…………………..……….……….",null,null,null,null,null,": ………………………………..…………………..……….………."]
["Karşılaşma Tarihi",null,null,":……………………………………...",null,null,"Karşılaşma Tarihi",null,null,":……………………………………..."]
["Takım Kaptanı",null,null,":……………………………………...",null,null,"Takım Kaptanı",null,null,":……………………………………..."]
["İmza",null,null,":……………………………………...",null,null,"İmza",null,null,":……………………………………..."]