{"text_format":"1","workbook":"xlsx","n_sheets":22,"sheets":["KATILIM","ERKEK GRUP","On_Eleme","ERKEK ELEME","32DE","32DE(16)","16","16DE","16(8DE)","ERKEK ANA TABLO","8DE","8TE","Cift_Mix","SIRALAMA","Ferdi","Puan","5_Mac","Olimpik","Yeni_Olimpik","5_Mac_KC","Olimpik_KC","Yeni_Olimpik_KC"],"not_rendered":{"charts":0,"images":8,"macros":1,"external_links":0,"defined_names":15,"comments":0,"pivot_tables":0},"unopened":[],"bounds":{"document_bytes":16777216,"sheet_cells":100000,"rows_first":2000,"rows_last":500,"rows_between":2000,"halvings":0,"cell_chars":16384,"cell_head_chars":4096},"cells_cut":0,"cells_raw":0,"read":"whole","date_system":"1900"}

{"sheet":"KATILIM","index":0,"n_rows":313,"n_cols":32,"rows_kept":313,"cut":false,"hidden":false,"merged":[[1,34,2,35],[0,0,0,8],[1,0,1,8]]}
["TÜRKİYE MASA TENİSİ FEDERASYONU\nYILDIZLAR KUZEYBATI BÖLGE YARIŞMALARI",null,null,null,null,null,null,null,null,null,null,null,null,null,null,null,null,null,null,null,null,null,null,null,null,null,null,"Ferdi","TÜRKİYE MASA TENİSİ FEDERASYONU\nYILDIZLAR KUZEYBATI BÖLGE YARIŞMALARI"]
["ERKEK TAKIM  [01-02 Mart 2025 BALIKESİR]",null,null,null,null,null,null,null,null,null,null,null,null,null,null,null,null,null,null,null,null,null,null,null,null,null,null,"Grup","ERKEK TAKIM  [01-02 Mart 2025 BALIKESİR]"]
["No",null,"Puan","Sporcu","İl","İl",null,"TŞ","Grup",null,null,null,null,null,null,null,null,null,null,null,null,null,null,null,null,null,null,1,"[ Ön Eleme ]","[ Eleme ]","[ Ana Tablo ]","[ Grup ]"]
[1,null,null,"YALOVA BLD. SPOR (A)","YLV","YALOVA",6,3,"Erkek","KBB",null,null,null,null,null,null,null,null,null,null,null,null,null,null,null,"YALOVA BLD. SPOR (A) (YLV)","YALOVA BLD. SPOR (A)"]
[2,null,null,"FENERBAHÇE (A)","İST","İSTANBUL",7,4,"Erkek","KBB",null,null,null,null,null,null,null,null,null,null,null,null,null,null,null,"FENERBAHÇE (A) (İST)","FENERBAHÇE (A)"]
[3,null,null,"YILDIZ RAKETLER SPOR (A)","İST","İSTANBUL",8,2,"Erkek","KBB",null,null,null,null,null,null,null,null,null,null,null,null,null,null,null,"YILDIZ RAKETLER SPOR (A) (İST)","YILDIZ RAKETLER SPOR (A)"]
[4,null,null,"İSTANBUL BBSK (A)","İST","İSTANBUL",11,6,"Erkek","KBB",null,null,null,null,null,null,null,null,null,null,null,null,null,null,null,"İSTANBUL BBSK (A) (İST)","İSTANBUL BBSK (A)"]
[5,null,null,"İSTANBUL DSİ SPOR (A)","İST","İSTANBUL","",7,"Erkek","KBB",null,null,null,null,null,null,null,null,null,null,null,null,null,null,null,"İSTANBUL DSİ SPOR (A) (İST)","İSTANBUL DSİ SPOR (A)"]
[8,0.58916300535202026,null,"UMUDUMUZ ÖZEL SPORCULAR GSK (A)","BRT","BARTIN","",9,"Erkek","KBB",null,null,null,null,null,null,null,null,null,null,null,null,null,null,null,"UMUDUMUZ ÖZEL SPORCULAR GSK (A) (BRT)","UMUDUMUZ ÖZEL SPORCULAR GSK (A)"]
[6,0.82460212707519531,null,"BURSA B. ŞEHİR BLD. SPOR (A)","BRS","BURSA","",9,"Erkek","KBB",null,null,null,null,null,null,null,null,null,null,null,null,null,null,null,"BURSA B. ŞEHİR BLD. SPOR (A) (BRS)","BURSA B. ŞEHİR BLD. SPOR (A)"]
[7,0.82980161905288696,null,"PENDİK BLD. SPOR (A)","İST","İSTANBUL","",9,"Erkek","KBB",null,null,null,null,null,null,null,null,null,null,null,null,null,null,null,"PENDİK BLD. SPOR (A) (İST)","PENDİK BLD. SPOR (A)"]
[20,7.7684700489044189E-2,null,"YILDIZ RAKETLER SPOR (B)","İST","İSTANBUL",null,null,"Erkek","KBB",null,null,null,null,null,null,null,null,null,null,null,null,null,null,null,"YILDIZ RAKETLER SPOR (B) (İST)","YILDIZ RAKETLER SPOR (B)"]
[25,0.10443228483200073,null,"BALIKESİR B. ŞEHİR BLD. SPOR (A)","BLK","BALIKESİR","","","Erkek","KBB",null,null,null,null,null,null,null,null,null,null,null,null,null,null,null,"BALIKESİR B. ŞEHİR BLD. SPOR (A) (BLK)","BALIKESİR B. ŞEHİR BLD. SPOR (A)"]
[23,0.12154996395111084,null,"BALIKESİR B. ŞEHİR BLD. SPOR (B)","BLK","BALIKESİR","","","Erkek","KBB",null,null,null,null,null,null,null,null,null,null,null,null,null,null,null,"BALIKESİR B. ŞEHİR BLD. SPOR (B) (BLK)","BALIKESİR B. ŞEHİR BLD. SPOR (B)"]
[9,0.13873231410980225,null,"BALIKESİR B. ŞEHİR BLD. SPOR (C)","BLK","BALIKESİR","","","Erkek","KBB",null,null,null,null,null,null,null,null,null,null,null,null,null,null,null,"BALIKESİR B. ŞEHİR BLD. SPOR (C) (BLK)","BALIKESİR B. ŞEHİR BLD. SPOR (C)"]
[30,0.185402512550354,null,"GÖNEN TAYFUNSPOR (A)","BLK","BALIKESİR","","","Erkek","KBB",null,null,null,null,null,null,null,null,null,null,null,null,null,null,null,"GÖNEN TAYFUNSPOR (A) (BLK)","GÖNEN TAYFUNSPOR (A)"]
[33,0.2177998423576355,null,"GÖNEN TAYFUNSPOR (B)","BLK","BALIKESİR","","","ERKEK","KBB",null,null,null,null,null,null,null,null,null,null,null,null,null,null,null,"GÖNEN TAYFUNSPOR (B) (BLK)","GÖNEN TAYFUNSPOR (B)"]
[18,0.28150343894958496,null,"EDİRNE YURDUM SPOR (A)","EDR","EDİRNE","","","ERKEK","KBB",null,null,null,null,null,null,null,null,null,null,null,null,null,null,null,"EDİRNE YURDUM SPOR (A) (EDR)","EDİRNE YURDUM SPOR (A)"]
[29,0.34783267974853516,null,"EDİRNE YURDUM SPOR (B)","EDR","EDİRNE","","","Erkek","KBB",null,null,null,null,null,null,null,null,null,null,null,null,null,null,null,"EDİRNE YURDUM SPOR (B) (EDR)","EDİRNE YURDUM SPOR (B)"]
[11,0.37899124622344971,null,"GENÇ TRAKYA SPOR (A)","EDR","EDİRNE","","","Erkek","KBB",null,null,null,null,null,null,null,null,null,null,null,null,null,null,null,"GENÇ TRAKYA SPOR (A) (EDR)","GENÇ TRAKYA SPOR (A)"]
[34,0.39584428071975708,null,"YALOVA GENÇLİK SPOR (A)","YLV","YALOVA","","","Erkek","KBB",null,null,null,null,null,null,null,null,null,null,null,null,null,null,null,"YALOVA GENÇLİK SPOR (A) (YLV)","YALOVA GENÇLİK SPOR (A)"]
[26,0.43275952339172363,null,"GENÇ TRAKYA SPOR (C)","EDR","EDİRNE","","","Erkek","KBB",null,null,null,null,null,null,null,null,null,null,null,null,null,null,null,"GENÇ TRAKYA SPOR (C) (EDR)","GENÇ TRAKYA SPOR (C)"]
[12,0.4334571361541748,null,"BEYOĞLUSPOR (A)","İST","İSTANBUL","","","Erkek","KBB",null,null,null,null,null,null,null,null,null,null,null,null,null,null,null,"BEYOĞLUSPOR (A) (İST)","BEYOĞLUSPOR (A)"]
[15,0.44111466407775879,null,"İSTANBUL BBSK (B)","İST","İSTANBUL","","","Erkek","KBB",null,null,null,null,null,null,null,null,null,null,null,null,null,null,null,"İSTANBUL BBSK (B) (İST)","İSTANBUL BBSK (B)"]
[17,0.49437671899795532,null,"İSTANBUL BBSK (C)","İST","İSTANBUL","","","Erkek","KBB",null,null,null,null,null,null,null,null,null,null,null,null,null,null,null,"İSTANBUL BBSK (C) (İST)","İSTANBUL BBSK (C)"]
[27,0.50337117910385132,null,"İSTANBUL DSİ SPOR (B)","İST","İSTANBUL","","","Erkek","KBB",null,null,null,null,null,null,null,null,null,null,null,null,null,null,null,"İSTANBUL DSİ SPOR (B) (İST)","İSTANBUL DSİ SPOR (B)"]
[14,0.51725584268569946,null,"GENÇLİKSPOR KIRKLARELİ (A)","KRL","KIRKLARELİ","","","Erkek","KBB",null,null,null,null,null,null,null,null,null,null,null,null,null,null,null,"GENÇLİKSPOR KIRKLARELİ (A) (KRL)","GENÇLİKSPOR KIRKLARELİ (A)"]
[10,0.54202926158905029,null,"GENÇLİKSPOR KIRKLARELİ (B)","KRL","KIRKLARELİ","","","Erkek","KBB",null,null,null,null,null,null,null,null,null,null,null,null,null,null,null,"GENÇLİKSPOR KIRKLARELİ (B) (KRL)","GENÇLİKSPOR KIRKLARELİ (B)"]
[13,0.55750101804733276,null,"BALIKESİR G.SPOR(A)","BLK","BALIKESİR","","","Erkek","KBB",null,null,null,null,null,null,null,null,null,null,null,null,null,null,null,"BALIKESİR G.SPOR(A) (BLK)","BALIKESİR G.SPOR(A)"]
[24,0.64595133066177368,null,"LÜLEBURGAZ GENÇLİK SPOR  (A)","KRL","KIRKLARELİ","","","Erkek","KBB",null,null,null,null,null,null,null,null,null,null,null,null,null,null,null,"LÜLEBURGAZ GENÇLİK SPOR  (A) (KRL)","LÜLEBURGAZ GENÇLİK SPOR  (A)"]
[19,0.65725642442703247,null,"LÜLEBURGAZ ZİRVE SPOR  (A)","KRL","KIRKLARELİ","","","Erkek","KBB",null,null,null,null,null,null,null,null,null,null,null,null,null,null,null,"LÜLEBURGAZ ZİRVE SPOR  (A) (KRL)","LÜLEBURGAZ ZİRVE SPOR  (A)"]
[31,0.69299453496932983,null,"YALOVA BLD. SPOR (B)","YLV","YALOVA","","","Erkek","KBB",null,null,null,null,null,null,null,null,null,null,null,null,null,null,null,"YALOVA BLD. SPOR (B) (YLV)","YALOVA BLD. SPOR (B)"]
[28,0.90920412540435791,null,"YALOVA BLD. SPOR (C)","YLV","YALOVA","","","Erkek","KBB",null,null,null,null,null,null,null,null,null,null,null,null,null,null,null,"YALOVA BLD. SPOR (C) (YLV)","YALOVA BLD. SPOR (C)"]
[16,0.94497102499008179,null,"TRAKER SPOR (A)","KRL","KIRKLARELİ","","","Erkek","KBB",null,null,null,null,null,null,null,null,null,null,null,null,null,null,null,"TRAKER SPOR (A) (KRL)","TRAKER SPOR (A)"]
[21,0.9592708945274353,null,"TRAKER SPOR (B)","KRL","KIRKLARELİ","","","Erkek","KBB",null,null,null,null,null,null,null,null,null,null,null,null,null,null,null,"TRAKER SPOR (B) (KRL)","TRAKER SPOR (B)"]
[32,0.96536445617675781,null,"BOYBEYİ SPOR (A)","SKR","SAKARYA",null,null,"Erkek","KBB",null,null,null,null,null,null,null,null,null,null,null,null,null,null,null,"BOYBEYİ SPOR (A) (SKR)","BOYBEYİ SPOR (A)"]
[22,0.97296667098999023,null,"ÇERKEZKÖY BLD. GSK (A)","TKD","TEKİRDAĞ","","","Erkek","KBB",null,null,null,null,null,null,null,null,null,null,null,null,null,null,null,"ÇERKEZKÖY BLD. GSK (A) (TKD)","ÇERKEZKÖY BLD. GSK (A)"]
[35,null,null,null,null,null,"","",null,null,null,null,null,null,null,null,null,null,null,null,null,null,null,null,null,0,0]
[36,null,null,null,null,null,"","",null,null,null,null,null,null,null,null,null,null,null,null,null,null,null,null,null,0,0]
[37,null,null,null,null,null,"","",null,null,null,null,null,null,null,null,null,null,null,null,null,null,null,null,null,0,0]
[38,null,null,null,null,null,null,null,null,null,null,null,null,null,null,null,null,null,null,null,null,null,null,null,null,0,0]
[39,null,null,null,null,null,"","",null,null,null,null,null,null,null,null,null,null,null,null,null,null,null,null,null,0,0]
[40,null,null,null,null,null,null,null,null,null,null,null,null,null,null,null,null,null,null,null,null,null,null,null,null,0,0]
[41,null,null,null,null,null,null,null,null,null,null,null,null,null,null,null,null,null,null,null,null,null,null,null,null,0,0]
[42,null,null,null,null,null,null,null,null,null,null,null,null,null,null,null,null,null,null,null,null,null,null,null,null,0,0]
[43,null,null,null,null,null,null,null,null,null,null,null,null,null,null,null,null,null,null,null,null,null,null,null,null,0,0]
[44,null,null,null,null,null,null,null,null,null,null,null,null,null,null,null,null,null,null,null,null,null,null,null,null,0,0]
[45,null,null,null,null,null,null,null,null,null,null,null,null,null,null,null,null,null,null,null,null,null,null,null,null,0,0]
[46,null,null,null,null,null,null,null,null,null,null,null,null,null,null,null,null,null,null,null,null,null,null,null,null,0,0]
[47,null,null,null,null,null,null,null,null,null,null,null,null,null,null,null,null,null,null,null,null,null,null,null,null,0,0]
[48,null,null,null,null,null,null,null,null,null,null,null,null,null,null,null,null,null,null,null,null,null,null,null,null,0,0]
[49,null,null,null,null,null,null,null,null,null,null,null,null,null,null,null,null,null,null,null,null,null,null,null,null,0,0]
[50,null,null,null,null,null,null,null,null,null,null,null,null,null,null,null,null,null,null,null,null,null,null,null,null,0,0]
[51,null,null,null,null,null,null,null,null,null,null,null,null,null,null,null,null,null,null,null,null,null,null,null,null,0,0]
[52,null,null,null,null,null,null,null,null,null,null,null,null,null,null,null,null,null,null,null,null,null,null,null,null,0,0]
[53,null,null,null,null,null,null,null,null,null,null,null,null,null,null,null,null,null,null,null,null,null,null,null,null,0,0]
[54,null,null,null,null,null,null,null,null,null,null,null,null,null,null,null,null,null,null,null,null,null,null,null,null,0,0]
[55,null,null,null,null,null,null,null,null,null,null,null,null,null,null,null,null,null,null,null,null,null,null,null,null,0,0]
[56,null,null,null,null,null,null,null,null,null,null,null,null,null,null,null,null,null,null,null,null,null,null,null,null,0,0]
[57,null,null,null,null,null,null,null,null,null,null,null,null,null,null,null,null,null,null,null,null,null,null,null,null,0,0]
[58,null,null,null,null,null,null,null,null,null,null,null,null,null,null,null,null,null,null,null,null,null,null,null,null,0,0]
[59,null,null,null,null,null,null,null,null,null,null,null,null,null,null,null,null,null,null,null,null,null,null,null,null,0,0]
[60,null,null,null,null,null,null,null,null,null,null,null,null,null,null,null,null,null,null,null,null,null,null,null,null,0,0]
[61,null,null,null,null,null,null,null,null,null,null,null,null,null,null,null,null,null,null,null,null,null,null,null,null,0,0]
[62,null,null,null,null,null,null,null,null,null,null,null,null,null,null,null,null,null,null,null,null,null,null,null,null,0,0]
[63,null,null,null,null,null,null,null,null,null,null,null,null,null,null,null,null,null,null,null,null,null,null,null,null,0,0]
[64,null,null,null,null,null,null,null,null,null,null,null,null,null,null,null,null,null,null,null,null,null,null,null,null,0,0]
[65,null,null,null,null,null,null,null,null,null,null,null,null,null,null,null,null,null,null,null,null,null,null,null,null,0,0]
[66,null,null,null,null,null,null,null,null,null,null,null,null,null,null,null,null,null,null,null,null,null,null,null,null,0,0]
[67,null,null,null,null,null,null,null,null,null,null,null,null,null,null,null,null,null,null,null,null,null,null,null,null,0,0]
[68,null,null,null,null,null,null,null,null,null,null,null,null,null,null,null,null,null,null,null,null,null,null,null,null,0,0]
[69,null,null,null,null,null,null,null,null,null,null,null,null,null,null,null,null,null,null,null,null,null,null,null,null,0,0]
[70,null,null,null,null,null,null,null,null,null,null,null,null,null,null,null,null,null,null,null,null,null,null,null,null,0,0]
[71,null,null,null,null,null,null,null,null,null,null,null,null,null,null,null,null,null,null,null,null,null,null,null,null,0,0]
[72,null,null,null,null,null,null,null,null,null,null,null,null,null,null,null,null,null,null,null,null,null,null,null,null,0,0]
[73,null,null,null,null,null,null,null,null,null,null,null,null,null,null,null,null,null,null,null,null,null,null,null,null,0,0]
[74,null,null,null,null,null,null,null,null,null,null,null,null,null,null,null,null,null,null,null,null,null,null,null,null,0,0]
[75,null,null,null,null,null,null,null,null,null,null,null,null,null,null,null,null,null,null,null,null,null,null,null,null,0,0]
[76,null,null,null,null,null,null,null,null,null,null,null,null,null,null,null,null,null,null,null,null,null,null,null,null,0,0]
[77,null,null,null,null,null,null,null,null,null,null,null,null,null,null,null,null,null,null,null,null,null,null,null,null,0,0]
[78,null,null,null,null,null,null,null,null,null,null,null,null,null,null,null,null,null,null,null,null,null,null,null,null,0,0]
[79,null,null,null,null,null,null,null,null,null,null,null,null,null,null,null,null,null,null,null,null,null,null,null,null,0,0]
[80,null,null,null,null,null,null,null,null,null,null,null,null,null,null,null,null,null,null,null,null,null,null,null,null,0,0]
[81,null,null,null,null,null,null,null,null,null,null,null,null,null,null,null,null,null,null,null,null,null,null,null,null,0,0]
[82,null,null,null,null,null,null,null,null,null,null,null,null,null,null,null,null,null,null,null,null,null,null,null,null,0,0]
[83,null,null,null,null,null,null,null,null,null,null,null,null,null,null,null,null,null,null,null,null,null,null,null,null,0,0]
[84,null,null,null,null,null,null,null,null,null,null,null,null,null,null,null,null,null,null,null,null,null,null,null,null,0,0]
[85,null,null,null,null,null,null,null,null,null,null,null,null,null,null,null,null,null,null,null,null,null,null,null,null,0,0]
[86,null,null,null,null,null,null,null,null,null,null,null,null,null,null,null,null,null,null,null,null,null,null,null,null,0,0]
[87,null,null,null,null,null,null,null,null,null,null,null,null,null,null,null,null,null,null,null,null,null,null,null,null,0,0]
[88,null,null,null,null,null,null,null,null,null,null,null,null,null,null,null,null,null,null,null,null,null,null,null,null,0,0]
[89,null,null,null,null,null,null,null,null,null,null,null,null,null,null,null,null,null,null,null,null,null,null,null,null,0,0]
[90,null,null,null,null,null,null,null,null,null,null,null,null,null,null,null,null,null,null,null,null,null,null,null,null,0,0]
[91,null,null,null,null,null,null,null,null,null,null,null,null,null,null,null,null,null,null,null,null,null,null,null,null,0,0]
[92,null,null,null,null,null,null,null,null,null,null,null,null,null,null,null,null,null,null,null,null,null,null,null,null,0,0]
[93,null,null,null,null,null,null,null,null,null,null,null,null,null,null,null,null,null,null,null,null,null,null,null,null,0,0]
[94,null,null,null,null,null,null,null,null,null,null,null,null,null,null,null,null,null,null,null,null,null,null,null,null,0,0]
[95,null,null,null,null,null,null,null,null,null,null,null,null,null,null,null,null,null,null,null,null,null,null,null,null,0,0]
[96,null,null,null,null,null,null,null,null,null,null,null,null,null,null,null,null,null,null,null,null,null,null,null,null,0,0]
[97,null,null,null,null,null,null,null,null,null,null,null,null,null,null,null,null,null,null,null,null,null,null,null,null,0,0]
[98,null,null,null,null,null,null,null,null,null,null,null,null,null,null,null,null,null,null,null,null,null,null,null,null,0,0]
[99,null,null,null,null,null,null,null,null,null,null,null,null,null,null,null,null,null,null,null,null,null,null,null,null,0,0]
[100,null,null,null,null,null,null,null,null,null,null,null,null,null,null,null,null,null,null,null,null,null,null,null,null,0,0]
[101,null,null,null,null,null,null,null,null,null,null,null,null,null,null,null,null,null,null,null,null,null,null,null,null,0,0]
[102,null,null,null,null,null,null,null,null,null,null,null,null,null,null,null,null,null,null,null,null,null,null,null,null,0,0]
[103,null,null,null,null,null,null,null,null,null,null,null,null,null,null,null,null,null,null,null,null,null,null,null,null,0,0]
[104,null,null,null,null,null,null,null,null,null,null,null,null,null,null,null,null,null,null,null,null,null,null,null,null,0,0]
[105,null,null,null,null,null,null,null,null,null,null,null,null,null,null,null,null,null,null,null,null,null,null,null,null,0,0]
[106,null,null,null,null,null,null,null,null,null,null,null,null,null,null,null,null,null,null,null,null,null,null,null,null,0,0]
[107,null,null,null,null,null,null,null,null,null,null,null,null,null,null,null,null,null,null,null,null,null,null,null,null,0,0]
[108,null,null,null,null,null,null,null,null,null,null,null,null,null,null,null,null,null,null,null,null,null,null,null,null,0,0]
[109,null,null,null,null,null,null,null,null,null,null,null,null,null,null,null,null,null,null,null,null,null,null,null,null,0,0]
[110,null,null,null,null,null,null,null,null,null,null,null,null,null,null,null,null,null,null,null,null,null,null,null,null,0,0]
[111,null,null,null,null,null,null,null,null,null,null,null,null,null,null,null,null,null,null,null,null,null,null,null,null,0,0]
[112,null,null,null,null,null,null,null,null,null,null,null,null,null,null,null,null,null,null,null,null,null,null,null,null,0,0]
[113,null,null,null,null,null,null,null,null,null,null,null,null,null,null,null,null,null,null,null,null,null,null,null,null,0,0]
[114,null,null,null,null,null,null,null,null,null,null,null,null,null,null,null,null,null,null,null,null,null,null,null,null,0,0]
[115,null,null,null,null,null,null,null,null,null,null,null,null,null,null,null,null,null,null,null,null,null,null,null,null,0,0]
[116,null,null,null,null,null,null,null,null,null,null,null,null,null,null,null,null,null,null,null,null,null,null,null,null,0,0]
[117,null,null,null,null,null,null,null,null,null,null,null,null,null,null,null,null,null,null,null,null,null,null,null,null,0,0]
[118,null,null,null,null,null,null,null,null,null,null,null,null,null,null,null,null,null,null,null,null,null,null,null,null,0,0]
[119,null,null,null,null,null,null,null,null,null,null,null,null,null,null,null,null,null,null,null,null,null,null,null,null,0,0]
[120,null,null,null,null,null,null,null,null,null,null,null,null,null,null,null,null,null,null,null,null,null,null,null,null,0,0]
[121,null,null,null,null,null,null,null,null,null,null,null,null,null,null,null,null,null,null,null,null,null,null,null,null,0,0]
[122,null,null,null,null,null,null,null,null,null,null,null,null,null,null,null,null,null,null,null,null,null,null,null,null,0,0]
[123,null,null,null,null,null,null,null,null,null,null,null,null,null,null,null,null,null,null,null,null,null,null,null,null,0,0]
[124,null,null,null,null,null,null,null,null,null,null,null,null,null,null,null,null,null,null,null,null,null,null,null,null,0,0]
[125,null,null,null,null,null,null,null,null,null,null,null,null,null,null,null,null,null,null,null,null,null,null,null,null,0,0]
[126,null,null,null,null,null,null,null,null,null,null,null,null,null,null,null,null,null,null,null,null,null,null,null,null,0,0]
[127,null,null,null,null,null,null,null,null,null,null,null,null,null,null,null,null,null,null,null,null,null,null,null,null,0,0]
[128,null,null,null,null,null,null,null,null,null,null,null,null,null,null,null,null,null,null,null,null,null,null,null,null,0,0]
[129,null,null,null,null,null,null,null,null,null,null,null,null,null,null,null,null,null,null,null,null,null,null,null,null,0,0]
[130,null,null,null,null,null,null,null,null,null,null,null,null,null,null,null,null,null,null,null,null,null,null,null,null,0,0]
[131,null,null,null,null,null,null,null,null,null,null,null,null,null,null,null,null,null,null,null,null,null,null,null,null,0,0]
[132,null,null,null,null,null,null,null,null,null,null,null,null,null,null,null,null,null,null,null,null,null,null,null,null,0,0]
[133,null,null,null,null,null,null,null,null,null,null,null,null,null,null,null,null,null,null,null,null,null,null,null,null,0,0]
[134,null,null,null,null,null,null,null,null,null,null,null,null,null,null,null,null,null,null,null,null,null,null,null,null,0,0]
[135,null,null,null,null,null,null,null,null,null,null,null,null,null,null,null,null,null,null,null,null,null,null,null,null,0,0]
[136,null,null,null,null,null,null,null,null,null,null,null,null,null,null,null,null,null,null,null,null,null,null,null,null,0,0]
[137,null,null,null,null,null,null,null,null,null,null,null,null,null,null,null,null,null,null,null,null,null,null,null,null,0,0]
[138,null,null,null,null,null,null,null,null,null,null,null,null,null,null,null,null,null,null,null,null,null,null,null,null,0,0]
[139,null,null,null,null,null,null,null,null,null,null,null,null,null,null,null,null,null,null,null,null,null,null,null,null,0,0]
[140,null,null,null,null,null,null,null,null,null,null,null,null,null,null,null,null,null,null,null,null,null,null,null,null,0,0]
[141,null,null,null,null,null,null,null,null,null,null,null,null,null,null,null,null,null,null,null,null,null,null,null,null,0,0]
[142,null,null,null,null,null,null,null,null,null,null,null,null,null,null,null,null,null,null,null,null,null,null,null,null,0,0]
[143,null,null,null,null,null,null,null,null,null,null,null,null,null,null,null,null,null,null,null,null,null,null,null,null,0,0]
[144,null,null,null,null,null,null,null,null,null,null,null,null,null,null,null,null,null,null,null,null,null,null,null,null,0,0]
[145,null,null,null,null,null,null,null,null,null,null,null,null,null,null,null,null,null,null,null,null,null,null,null,null,0,0]
[146,null,null,null,null,null,null,null,null,null,null,null,null,null,null,null,null,null,null,null,null,null,null,null,null,0,0]
[147,null,null,null,null,null,null,null,null,null,null,null,null,null,null,null,null,null,null,null,null,null,null,null,null,0,0]
[148,null,null,null,null,null,null,null,null,null,null,null,null,null,null,null,null,null,null,null,null,null,null,null,null,0,0]
[149,null,null,null,null,null,null,null,null,null,null,null,null,null,null,null,null,null,null,null,null,null,null,null,null,0,0]
[150,null,null,null,null,null,null,null,null,null,null,null,null,null,null,null,null,null,null,null,null,null,null,null,null,0,0]
[151,null,null,null,null,null,null,null,null,null,null,null,null,null,null,null,null,null,null,null,null,null,null,null,null,0,0]
[152,null,null,null,null,null,null,null,null,null,null,null,null,null,null,null,null,null,null,null,null,null,null,null,null,0,0]
[153,null,null,null,null,null,null,null,null,null,null,null,null,null,null,null,null,null,null,null,null,null,null,null,null,0,0]
[154,null,null,null,null,null,null,null,null,null,null,null,null,null,null,null,null,null,null,null,null,null,null,null,null,0,0]
[155,null,null,null,null,null,null,null,null,null,null,null,null,null,null,null,null,null,null,null,null,null,null,null,null,0,0]
[156,null,null,null,null,null,null,null,null,null,null,null,null,null,null,null,null,null,null,null,null,null,null,null,null,0,0]
[157,null,null,null,null,null,null,null,null,null,null,null,null,null,null,null,null,null,null,null,null,null,null,null,null,0,0]
[158,null,null,null,null,null,null,null,null,null,null,null,null,null,null,null,null,null,null,null,null,null,null,null,null,0,0]
[159,null,null,null,null,null,null,null,null,null,null,null,null,null,null,null,null,null,null,null,null,null,null,null,null,0,0]
[160,null,null,null,null,null,null,null,null,null,null,null,null,null,null,null,null,null,null,null,null,null,null,null,null,0,0]
[161,null,null,null,null,null,null,null,null,null,null,null,null,null,null,null,null,null,null,null,null,null,null,null,null,0,0]
[162,null,null,null,null,null,null,null,null,null,null,null,null,null,null,null,null,null,null,null,null,null,null,null,null,0,0]
[163,null,null,null,null,null,null,null,null,null,null,null,null,null,null,null,null,null,null,null,null,null,null,null,null,0,0]
[164,null,null,null,null,null,null,null,null,null,null,null,null,null,null,null,null,null,null,null,null,null,null,null,null,0,0]
[165,null,null,null,null,null,null,null,null,null,null,null,null,null,null,null,null,null,null,null,null,null,null,null,null,0,0]
[166,null,null,null,null,null,null,null,null,null,null,null,null,null,null,null,null,null,null,null,null,null,null,null,null,0,0]
[167,null,null,null,null,null,null,null,null,null,null,null,null,null,null,null,null,null,null,null,null,null,null,null,null,0,0]
[168,null,null,null,null,null,null,null,null,null,null,null,null,null,null,null,null,null,null,null,null,null,null,null,null,0,0]
[169,null,null,null,null,null,null,null,null,null,null,null,null,null,null,null,null,null,null,null,null,null,null,null,null,0,0]
[170,null,null,null,null,null,null,null,null,null,null,null,null,null,null,null,null,null,null,null,null,null,null,null,null,0,0]
[171,null,null,null,null,null,null,null,null,null,null,null,null,null,null,null,null,null,null,null,null,null,null,null,null,0,0]
[172,null,null,null,null,null,null,null,null,null,null,null,null,null,null,null,null,null,null,null,null,null,null,null,null,0,0]
[173,null,null,null,null,null,null,null,null,null,null,null,null,null,null,null,null,null,null,null,null,null,null,null,null,0,0]
[174,null,null,null,null,null,null,null,null,null,null,null,null,null,null,null,null,null,null,null,null,null,null,null,null,0,0]
[175,null,null,null,null,null,null,null,null,null,null,null,null,null,null,null,null,null,null,null,null,null,null,null,null,0,0]
[176,null,null,null,null,null,null,null,null,null,null,null,null,null,null,null,null,null,null,null,null,null,null,null,null,0,0]
[177,null,null,null,null,null,null,null,null,null,null,null,null,null,null,null,null,null,null,null,null,null,null,null,null,0,0]
[178,null,null,null,null,null,null,null,null,null,null,null,null,null,null,null,null,null,null,null,null,null,null,null,null,0,0]
[179,null,null,null,null,null,null,null,null,null,null,null,null,null,null,null,null,null,null,null,null,null,null,null,null,0,0]
[180,null,null,null,null,null,null,null,null,null,null,null,null,null,null,null,null,null,null,null,null,null,null,null,null,0,0]
[181,null,null,null,null,null,null,null,null,null,null,null,null,null,null,null,null,null,null,null,null,null,null,null,null,0,0]
[182,null,null,null,null,null,null,null,null,null,null,null,null,null,null,null,null,null,null,null,null,null,null,null,null,0,0]
[183,null,null,null,null,null,null,null,null,null,null,null,null,null,null,null,null,null,null,null,null,null,null,null,null,0,0]
[184,null,null,null,null,null,null,null,null,null,null,null,null,null,null,null,null,null,null,null,null,null,null,null,null,0,0]
[185,null,null,null,null,null,null,null,null,null,null,null,null,null,null,null,null,null,null,null,null,null,null,null,null,0,0]
[186,null,null,null,null,null,null,null,null,null,null,null,null,null,null,null,null,null,null,null,null,null,null,null,null,0,0]
[187,null,null,null,null,null,null,null,null,null,null,null,null,null,null,null,null,null,null,null,null,null,null,null,null,0,0]
[188,null,null,null,null,null,null,null,null,null,null,null,null,null,null,null,null,null,null,null,null,null,null,null,null,0,0]
[189,null,null,null,null,null,null,null,null,null,null,null,null,null,null,null,null,null,null,null,null,null,null,null,null,0,0]
[190,null,null,null,null,null,null,null,null,null,null,null,null,null,null,null,null,null,null,null,null,null,null,null,null,0,0]
[191,null,null,null,null,null,null,null,null,null,null,null,null,null,null,null,null,null,null,null,null,null,null,null,null,0,0]
[192,null,null,null,null,null,null,null,null,null,null,null,null,null,null,null,null,null,null,null,null,null,null,null,null,0,0]
[193,null,null,null,null,null,null,null,null,null,null,null,null,null,null,null,null,null,null,null,null,null,null,null,null,0,0]
[194,null,null,null,null,null,null,null,null,null,null,null,null,null,null,null,null,null,null,null,null,null,null,null,null,0,0]
[195,null,null,null,null,null,null,null,null,null,null,null,null,null,null,null,null,null,null,null,null,null,null,null,null,0,0]
[196,null,null,null,null,null,null,null,null,null,null,null,null,null,null,null,null,null,null,null,null,null,null,null,null,0,0]
[197,null,null,null,null,null,null,null,null,null,null,null,null,null,null,null,null,null,null,null,null,null,null,null,null,0,0]
[198,null,null,null,null,null,null,null,null,null,null,null,null,null,null,null,null,null,null,null,null,null,null,null,null,0,0]
[199,null,null,null,null,null,null,null,null,null,null,null,null,null,null,null,null,null,null,null,null,null,null,null,null,0,0]
[200,null,null,null,null,null,null,null,null,null,null,null,null,null,null,null,null,null,null,null,null,null,null,null,null,0,0]
[201,null,null,null,null,null,null,null,null,null,null,null,null,null,null,null,null,null,null,null,null,null,null,null,null,0,0]
[202,null,null,null,null,null,null,null,null,null,null,null,null,null,null,null,null,null,null,null,null,null,null,null,null,0,0]
[203,null,null,null,null,null,null,null,null,null,null,null,null,null,null,null,null,null,null,null,null,null,null,null,null,0,0]
[204,null,null,null,null,null,null,null,null,null,null,null,null,null,null,null,null,null,null,null,null,null,null,null,null,0,0]
[205,null,null,null,null,null,null,null,null,null,null,null,null,null,null,null,null,null,null,null,null,null,null,null,null,0,0]
[206,null,null,null,null,null,null,null,null,null,null,null,null,null,null,null,null,null,null,null,null,null,null,null,null,0,0]
[207,null,null,null,null,null,null,null,null,null,null,null,null,null,null,null,null,null,null,null,null,null,null,null,null,0,0]
[208,null,null,null,null,null,null,null,null,null,null,null,null,null,null,null,null,null,null,null,null,null,null,null,null,0,0]
[209,null,null,null,null,null,null,null,null,null,null,null,null,null,null,null,null,null,null,null,null,null,null,null,null,0,0]
[210,null,null,null,null,null,null,null,null,null,null,null,null,null,null,null,null,null,null,null,null,null,null,null,null,0,0]
[211,null,null,null,null,null,null,null,null,null,null,null,null,null,null,null,null,null,null,null,null,null,null,null,null,0,0]
[212,null,null,null,null,null,null,null,null,null,null,null,null,null,null,null,null,null,null,null,null,null,null,null,null,0,0]
[213,null,null,null,null,null,null,null,null,null,null,null,null,null,null,null,null,null,null,null,null,null,null,null,null,0,0]
[214,null,null,null,null,null,null,null,null,null,null,null,null,null,null,null,null,null,null,null,null,null,null,null,null,0,0]
[215,null,null,null,null,null,null,null,null,null,null,null,null,null,null,null,null,null,null,null,null,null,null,null,null,0,0]
[216,null,null,null,null,null,null,null,null,null,null,null,null,null,null,null,null,null,null,null,null,null,null,null,null,0,0]
[217,null,null,null,null,null,null,null,null,null,null,null,null,null,null,null,null,null,null,null,null,null,null,null,null,0,0]
[218,null,null,null,null,null,null,null,null,null,null,null,null,null,null,null,null,null,null,null,null,null,null,null,null,0,0]
[219,null,null,null,null,null,null,null,null,null,null,null,null,null,null,null,null,null,null,null,null,null,null,null,null,0,0]
[220,null,null,null,null,null,null,null,null,null,null,null,null,null,null,null,null,null,null,null,null,null,null,null,null,0,0]
[221,null,null,null,null,null,null,null,null,null,null,null,null,null,null,null,null,null,null,null,null,null,null,null,null,0,0]
[222,null,null,null,null,null,null,null,null,null,null,null,null,null,null,null,null,null,null,null,null,null,null,null,null,0,0]
[223,null,null,null,null,null,null,null,null,null,null,null,null,null,null,null,null,null,null,null,null,null,null,null,null,0,0]
[224,null,null,null,null,null,null,null,null,null,null,null,null,null,null,null,null,null,null,null,null,null,null,null,null,0,0]
[225,null,null,null,null,null,null,null,null,null,null,null,null,null,null,null,null,null,null,null,null,null,null,null,null,0,0]
[226,null,null,null,null,null,null,null,null,null,null,null,null,null,null,null,null,null,null,null,null,null,null,null,null,0,0]
[227,null,null,null,null,null,null,null,null,null,null,null,null,null,null,null,null,null,null,null,null,null,null,null,null,0,0]
[228,null,null,null,null,null,null,null,null,null,null,null,null,null,null,null,null,null,null,null,null,null,null,null,null,0,0]
[229,null,null,null,null,null,null,null,null,null,null,null,null,null,null,null,null,null,null,null,null,null,null,null,null,0,0]
[230,null,null,null,null,null,null,null,null,null,null,null,null,null,null,null,null,null,null,null,null,null,null,null,null,0,0]
[231,null,null,null,null,null,null,null,null,null,null,null,null,null,null,null,null,null,null,null,null,null,null,null,null,0,0]
[232,null,null,null,null,null,null,null,null,null,null,null,null,null,null,null,null,null,null,null,null,null,null,null,null,0,0]
[233,null,null,null,null,null,null,null,null,null,null,null,null,null,null,null,null,null,null,null,null,null,null,null,null,0,0]
[234,null,null,null,null,null,null,null,null,null,null,null,null,null,null,null,null,null,null,null,null,null,null,null,null,0,0]
[235,null,null,null,null,null,null,null,null,null,null,null,null,null,null,null,null,null,null,null,null,null,null,null,null,0,0]
[236,null,null,null,null,null,null,null,null,null,null,null,null,null,null,null,null,null,null,null,null,null,null,null,null,0,0]
[237,null,null,null,null,null,null,null,null,null,null,null,null,null,null,null,null,null,null,null,null,null,null,null,null,0,0]
[238,null,null,null,null,null,null,null,null,null,null,null,null,null,null,null,null,null,null,null,null,null,null,null,null,0,0]
[239,null,null,null,null,null,null,null,null,null,null,null,null,null,null,null,null,null,null,null,null,null,null,null,null,0,0]
[240,null,null,null,null,null,null,null,null,null,null,null,null,null,null,null,null,null,null,null,null,null,null,null,null,0,0]
[241,null,null,null,null,null,null,null,null,null,null,null,null,null,null,null,null,null,null,null,null,null,null,null,null,0,0]
[242,null,null,null,null,null,null,null,null,null,null,null,null,null,null,null,null,null,null,null,null,null,null,null,null,0,0]
[243,null,null,null,null,null,null,null,null,null,null,null,null,null,null,null,null,null,null,null,null,null,null,null,null,0,0]
[244,null,null,null,null,null,null,null,null,null,null,null,null,null,null,null,null,null,null,null,null,null,null,null,null,0,0]
[245,null,null,null,null,null,null,null,null,null,null,null,null,null,null,null,null,null,null,null,null,null,null,null,null,0,0]
[246,null,null,null,null,null,null,null,null,null,null,null,null,null,null,null,null,null,null,null,null,null,null,null,null,0,0]
[247,null,null,null,null,null,null,null,null,null,null,null,null,null,null,null,null,null,null,null,null,null,null,null,null,0,0]
[248,null,null,null,null,null,null,null,null,null,null,null,null,null,null,null,null,null,null,null,null,null,null,null,null,0,0]
[249,null,null,null,null,null,null,null,null,null,null,null,null,null,null,null,null,null,null,null,null,null,null,null,null,0,0]
[250,null,null,null,null,null,null,null,null,null,null,null,null,null,null,null,null,null,null,null,null,null,null,null,null,0,0]
[251,null,null,null,null,null,null,null,null,null,null,null,null,null,null,null,null,null,null,null,null,null,null,null,null,0,0]
[252,null,null,null,null,null,null,null,null,null,null,null,null,null,null,null,null,null,null,null,null,null,null,null,null,0,0]
[253,null,null,null,null,null,null,null,null,null,null,null,null,null,null,null,null,null,null,null,null,null,null,null,null,0,0]
[254,null,null,null,null,null,null,null,null,null,null,null,null,null,null,null,null,null,null,null,null,null,null,null,null,0,0]
[255,null,null,null,null,null,null,null,null,null,null,null,null,null,null,null,null,null,null,null,null,null,null,null,null,0,0]
[256,null,null,null,null,null,null,null,null,null,null,null,null,null,null,null,null,null,null,null,null,null,null,null,null,0,0]
[257,null,null,null,null,null,null,null,null,null,null,null,null,null,null,null,null,null,null,null,null,null,null,null,null,0,0]
[258,null,null,null,null,null,null,null,null,null,null,null,null,null,null,null,null,null,null,null,null,null,null,null,null,0,0]
[259,null,null,null,null,null,null,null,null,null,null,null,null,null,null,null,null,null,null,null,null,null,null,null,null,0,0]
[260,null,null,null,null,null,null,null,null,null,null,null,null,null,null,null,null,null,null,null,null,null,null,null,null,0,0]
[261,null,null,null,null,null,null,null,null,null,null,null,null,null,null,null,null,null,null,null,null,null,null,null,null,0,0]
[262,null,null,null,null,null,null,null,null,null,null,null,null,null,null,null,null,null,null,null,null,null,null,null,null,0,0]
[263,null,null,null,null,null,null,null,null,null,null,null,null,null,null,null,null,null,null,null,null,null,null,null,null,0,0]
[264,null,null,null,null,null,null,null,null,null,null,null,null,null,null,null,null,null,null,null,null,null,null,null,null,0,0]
[265,null,null,null,null,null,null,null,null,null,null,null,null,null,null,null,null,null,null,null,null,null,null,null,null,0,0]
[266,null,null,null,null,null,null,null,null,null,null,null,null,null,null,null,null,null,null,null,null,null,null,null,null,0,0]
[267,null,null,null,null,null,null,null,null,null,null,null,null,null,null,null,null,null,null,null,null,null,null,null,null,0,0]
[268,null,null,null,null,null,null,null,null,null,null,null,null,null,null,null,null,null,null,null,null,null,null,null,null,0,0]
[269,null,null,null,null,null,null,null,null,null,null,null,null,null,null,null,null,null,null,null,null,null,null,null,null,0,0]
[270,null,null,null,null,null,null,null,null,null,null,null,null,null,null,null,null,null,null,null,null,null,null,null,null,0,0]
[271,null,null,null,null,null,null,null,null,null,null,null,null,null,null,null,null,null,null,null,null,null,null,null,null,0,0]
[272,null,null,null,null,null,null,null,null,null,null,null,null,null,null,null,null,null,null,null,null,null,null,null,null,0,0]
[273,null,null,null,null,null,null,null,null,null,null,null,null,null,null,null,null,null,null,null,null,null,null,null,null,0,0]
[274,null,null,null,null,null,null,null,null,null,null,null,null,null,null,null,null,null,null,null,null,null,null,null,null,0,0]
[275,null,null,null,null,null,null,null,null,null,null,null,null,null,null,null,null,null,null,null,null,null,null,null,null,0,0]
[276,null,null,null,null,null,null,null,null,null,null,null,null,null,null,null,null,null,null,null,null,null,null,null,null,0,0]
[277,null,null,null,null,null,null,null,null,null,null,null,null,null,null,null,null,null,null,null,null,null,null,null,null,0,0]
[278,null,null,null,null,null,null,null,null,null,null,null,null,null,null,null,null,null,null,null,null,null,null,null,null,0,0]
[279,null,null,null,null,null,null,null,null,null,null,null,null,null,null,null,null,null,null,null,null,null,null,null,null,0,0]
[280,null,null,null,null,null,null,null,null,null,null,null,null,null,null,null,null,null,null,null,null,null,null,null,null,0,0]
[281,null,null,null,null,null,null,null,null,null,null,null,null,null,null,null,null,null,null,null,null,null,null,null,null,0,0]
[282,null,null,null,null,null,null,null,null,null,null,null,null,null,null,null,null,null,null,null,null,null,null,null,null,0,0]
[283,null,null,null,null,null,null,null,null,null,null,null,null,null,null,null,null,null,null,null,null,null,null,null,null,0,0]
[284,null,null,null,null,null,null,null,null,null,null,null,null,null,null,null,null,null,null,null,null,null,null,null,null,0,0]
[285,null,null,null,null,null,null,null,null,null,null,null,null,null,null,null,null,null,null,null,null,null,null,null,null,0,0]
[286,null,null,null,null,null,null,null,null,null,null,null,null,null,null,null,null,null,null,null,null,null,null,null,null,0,0]
[287,null,null,null,null,null,null,null,null,null,null,null,null,null,null,null,null,null,null,null,null,null,null,null,null,0,0]
[288,null,null,null,null,null,null,null,null,null,null,null,null,null,null,null,null,null,null,null,null,null,null,null,null,0,0]
[289,null,null,null,null,null,null,null,null,null,null,null,null,null,null,null,null,null,null,null,null,null,null,null,null,0,0]
[290,null,null,null,null,null,null,null,null,null,null,null,null,null,null,null,null,null,null,null,null,null,null,null,null,0,0]
[291,null,null,null,null,null,null,null,null,null,null,null,null,null,null,null,null,null,null,null,null,null,null,null,null,0,0]
[292,null,null,null,null,null,null,null,null,null,null,null,null,null,null,null,null,null,null,null,null,null,null,null,null,0,0]
[293,null,null,null,null,null,null,null,null,null,null,null,null,null,null,null,null,null,null,null,null,null,null,null,null,0,0]
[294,null,null,null,null,null,null,null,null,null,null,null,null,null,null,null,null,null,null,null,null,null,null,null,null,0,0]
[295,null,null,null,null,null,null,null,null,null,null,null,null,null,null,null,null,null,null,null,null,null,null,null,null,0,0]
[296,null,null,null,null,null,null,null,null,null,null,null,null,null,null,null,null,null,null,null,null,null,null,null,null,0,0]
[297,null,null,null,null,null,null,null,null,null,null,null,null,null,null,null,null,null,null,null,null,null,null,null,null,0,0]
[298,null,null,null,null,null,null,null,null,null,null,null,null,null,null,null,null,null,null,null,null,null,null,null,null,0,0]
[299,null,null,null,null,null,null,null,null,null,null,null,null,null,null,null,null,null,null,null,null,null,null,null,null,0,0]
[300,null,null,null,null,null,null,null,null,null,null,null,null,null,null,null,null,null,null,null,null,null,null,null,null,0,0]
[301,null,null,null,null,null,null,null,null,null,null,null,null,null,null,null,null,null,null,null,null,null,null,null,null,0,0]
[302,null,null,null,null,null,null,null,null,null,null,null,null,null,null,null,null,null,null,null,null,null,null,null,null,0,0]
[303,null,null,null,null,null,null,null,null,null,null,null,null,null,null,null,null,null,null,null,null,null,null,null,null,0,0]
[304,null,null,null,null,null,null,null,null,null,null,null,null,null,null,null,null,null,null,null,null,null,null,null,null,0,0]
[305,null,null,null,null,null,null,null,null,null,null,null,null,null,null,null,null,null,null,null,null,null,null,null,null,0,0]
[306,null,null,null,null,null,null,null,null,null,null,null,null,null,null,null,null,null,null,null,null,null,null,null,null,0,0]
[307,null,null,null,null,null,null,null,null,null,null,null,null,null,null,null,null,null,null,null,null,null,null,null,null,0,0]
[308,null,null,null,null,null,null,null,null,null,null,null,null,null,null,null,null,null,null,null,null,null,null,null,null,0,0]
[309,null,null,null,null,null,null,null,null,null,null,null,null,null,null,null,null,null,null,null,null,null,null,null,null,0,0]
[310,null,null,null,null,null,null,null,null,null,null,null,null,null,null,null,null,null,null,null,null,null,null,null,null,0,0]

{"sheet":"ERKEK GRUP","index":1,"n_rows":69,"n_cols":33,"rows_kept":69,"cut":false,"hidden":false,"merged":[[58,28,58,29],[54,28,54,29],[49,28,49,29],[46,28,46,29],[49,26,49,27],[50,26,50,27],[52,26,52,27],[52,28,52,29],[54,26,54,27],[46,26,46,27],[48,26,48,27],[53,26,53,27],[53,28,53,29],[48,28,48,29],[50,28,50,29],[56,28,56,29],[56,26,56,27],[5,26,5,27],[5,28,5,29],[6,26,6,27],[6,28,6,29],[4,26,4,27],[4,28,4,29],[9,26,9,27],[9,28,9,29],[8,26,8,27],[8,28,8,29],[10,26,10,27],[10,28,10,29],[12,26,12,27],[12,28,12,29],[13,26,13,27],[13,28,13,29],[14,26,14,27],[14,28,14,29],[16,26,16,27],[16,28,16,29],[17,26,17,27],[17,28,17,29],[58,26,58,27],[52,22,52,23],[52,24,52,25],[48,22,48,23],[48,24,48,25],[4,24,4,25],[8,22,8,23],[8,24,8,25],[12,22,12,23],[12,24,12,25],[65,22,65,23],[60,24,60,25],[60,26,60,27],[60,22,60,23],[65,24,65,25],[65,26,65,27],[67,1,67,3],[67,4,67,5],[67,6,67,7],[67,8,67,9],[67,10,67,11],[67,28,67,29],[67,30,67,31],[62,1,62,3],[62,4,62,5],[62,6,62,7],[62,8,62,9],[62,10,62,11],[62,28,62,29],[62,30,62,31],[60,28,60,29],[60,30,60,31],[65,8,65,9],[65,10,65,11],[65,28,65,29],[65,30,65,31],[57,1,57,3],[57,4,57,5],[57,6,57,7],[57,8,57,9],[57,10,57,11],[57,28,57,29],[57,26,57,27],[56,1,56,3],[56,4,56,5],[56,6,56,7],[56,8,56,9],[56,10,56,11],[56,22,56,23],[56,24,56,25],[0,1,1,33],[2,1,2,33],[4,1,4,3],[4,4,4,5],[4,6,4,7],[4,8,4,9],[4,10,4,11],[4,22,4,23],[5,1,5,3],[5,4,5,5],[5,6,5,7],[5,8,5,9],[5,10,5,11],[9,1,9,3],[9,4,9,5],[9,6,9,7],[9,8,9,9],[9,10,9,11],[8,1,8,3],[8,4,8,5],[8,6,8,7],[8,8,8,9],[8,10,8,11],[12,1,12,3],[12,4,12,5],[12,6,12,7],[12,8,12,9],[12,10,12,11],[13,1,13,3],[13,4,13,5],[13,6,13,7],[13,8,13,9],[13,10,13,11],[16,1,16,3],[16,4,16,5],[16,6,16,7],[16,8,16,9],[16,10,16,11],[16,22,16,23],[16,24,16,25],[17,1,17,3],[17,4,17,5],[17,6,17,7],[17,8,17,9],[17,10,17,11],[18,26,18,27],[18,28,18,29],[20,1,20,3],[20,4,20,5],[20,6,20,7],[20,8,20,9],[20,10,20,11],[20,22,20,23],[20,24,20,25],[20,26,20,27],[20,28,20,29],[21,1,21,3],[21,4,21,5],[21,6,21,7],[21,8,21,9],[21,10,21,11],[21,26,21,27],[21,28,21,29],[22,26,22,27],[22,28,22,29],[24,1,24,3],[24,4,24,5],[24,6,24,7],[24,8,24,9],[24,10,24,11],[24,22,24,23],[24,24,24,25],[24,26,24,27],[24,28,24,29],[25,1,25,3],[25,4,25,5],[25,6,25,7],[25,8,25,9],[25,10,25,11],[25,26,25,27],[25,28,25,29],[26,26,26,27],[26,28,26,29],[28,1,28,3],[28,4,28,5],[28,6,28,7],[28,8,28,9],[28,10,28,11],[28,22,28,23],[28,24,28,25],[28,26,28,27],[28,28,28,29],[29,1,29,3],[29,4,29,5],[29,6,29,7],[29,8,29,9],[29,10,29,11],[29,26,29,27],[29,28,29,29],[30,26,30,27],[30,28,30,29],[32,1,32,3],[32,4,32,5],[32,6,32,7],[32,8,32,9],[32,10,32,11],[32,22,32,23],[32,24,32,25],[32,26,32,27],[32,28,32,29],[33,1,33,3],[33,4,33,5],[33,6,33,7],[33,8,33,9],[33,10,33,11],[33,26,33,27],[33,28,33,29],[34,26,34,27],[34,28,34,29],[36,1,36,3],[36,4,36,5],[36,6,36,7],[36,8,36,9],[36,10,36,11],[36,22,36,23],[36,24,36,25],[36,26,36,27],[36,28,36,29],[37,1,37,3],[37,4,37,5],[37,6,37,7],[37,8,37,9],[37,10,37,11],[37,26,37,27],[37,28,37,29],[38,26,38,27],[38,28,38,29],[40,1,40,3],[40,4,40,5],[40,6,40,7],[40,8,40,9],[40,10,40,11],[40,22,40,23],[40,24,40,25],[40,26,40,27],[40,28,40,29],[41,1,41,3],[41,4,41,5],[41,6,41,7],[41,8,41,9],[41,10,41,11],[41,26,41,27],[41,28,41,29],[42,26,42,27],[42,28,42,29],[44,1,44,3],[44,4,44,5],[44,6,44,7],[44,8,44,9],[44,10,44,11],[44,22,44,23],[44,24,44,25],[44,26,44,27],[44,28,44,29],[49,10,49,11],[52,1,52,3],[52,4,52,5],[52,6,52,7],[52,8,52,9],[52,10,52,11],[49,1,49,3],[49,4,49,5],[49,6,49,7],[49,8,49,9],[48,1,48,3],[48,4,48,5],[48,6,48,7],[60,1,60,3],[60,4,60,5],[60,6,60,7],[60,8,60,9],[60,10,60,11],[66,1,66,3],[66,4,66,5],[66,6,66,7],[66,8,66,9],[66,10,66,11],[61,1,61,3],[61,4,61,5],[61,6,61,7],[61,8,61,9],[61,10,61,11],[45,1,45,3],[45,4,45,5],[45,6,45,7],[45,8,45,9],[45,10,45,11],[45,28,45,29],[45,26,45,27],[48,8,48,9],[48,10,48,11],[53,1,53,3],[53,4,53,5],[53,6,53,7],[53,8,53,9],[53,10,53,11],[63,30,63,31],[68,1,68,3],[68,4,68,5],[68,6,68,7],[68,8,68,9],[68,10,68,11],[68,28,68,29],[68,30,68,31],[61,28,61,29],[65,1,65,3],[65,4,65,5],[65,6,65,7],[63,1,63,3],[63,4,63,5],[63,6,63,7],[63,8,63,9],[63,10,63,11],[63,28,63,29],[66,28,66,29],[66,30,66,31],[61,30,61,31]]}
[1,"TÜRKİYE MASA TENİSİ FEDERASYONU\nYILDIZLAR KUZEYBATI BÖLGE YARIŞMALARI"]
[]
[null,"ERKEK TAKIM  [01-02 Mart 2025 BALIKESİR] [ Grup ]"]
[]
[2,"Tarih",null,null,"Saat",null,"Tur",null,"Maç",null,"Masa",null,null,3,"Grup",null,1,null,null,null,null,null,1,null,2,null,"Puan",null,"Sıralama"]
[null,"2025-03-02",null,null,"09:30:00",null,1,null,"1 - 2",null,null,null,1,{"$error":"#REF!"},1,"YALOVA BLD. SPOR (A) (YLV)",null,null,null,null,null,null,null,null,3,0,2,null,1,null,3]
[null,".",null,null,null,null,null,null,null,null,null,null,32,{"$error":"#REF!"},2,"BOYBEYİ SPOR (A) (SKR)",null,null,null,null,null,null,0,3,null,null,1,null,2,null,3]
[]
[2,"Tarih",null,null,"Saat",null,"Tur",null,"Maç",null,"Masa",null,null,3,"Grup",null,2,null,null,null,null,null,1,null,2,null,"Puan",null,"Sıralama"]
[null,"2025-03-02",null,null,"09:30:00",null,1,null,"1 - 2",null,null,null,2,{"$error":"#REF!"},1,"FENERBAHÇE (A) (İST)",null,null,null,null,null,null,null,null,3,0,2,null,1,null,3]
[null,".",null,null,null,null,null,null,null,null,null,null,31,{"$error":"#REF!"},2,"YALOVA BLD. SPOR (B) (YLV)",null,null,null,null,null,null,0,3,null,null,1,null,2,null,3]
[]
[2,"Tarih",null,null,"Saat",null,"Tur",null,"Maç",null,"Masa",null,null,3,"Grup",null,3,null,null,null,null,null,1,null,2,null,"Puan",null,"Sıralama"]
[null,"2025-03-02",null,null,"09:30:00",null,1,null,"1 - 2",null,null,null,3,{"$error":"#REF!"},1,"YILDIZ RAKETLER SPOR (A) (İST)",null,null,null,null,null,null,null,null,3,0,2,null,1,null,3]
[null,".",null,null,null,null,null,null,null,null,null,null,30,{"$error":"#REF!"},2,"GÖNEN TAYFUNSPOR (A) (BLK)",null,null,null,null,null,null,0,3,null,null,1,null,2,null,3]
[]
[2,"Tarih",null,null,"Saat",null,"Tur",null,"Maç",null,"Masa",null,null,3,"Grup",null,4,null,null,null,null,null,1,null,2,null,"Puan",null,"Sıralama"]
[null,"2025-03-02",null,null,"09:30:00",null,1,null,"1 - 2",null,null,null,4,{"$error":"#REF!"},1,"İSTANBUL BBSK (A) (İST)",null,null,null,null,null,null,null,null,3,0,2,null,1,null,3]
[null,".",null,null,null,null,null,null,null,null,null,null,29,{"$error":"#REF!"},2,"EDİRNE YURDUM SPOR (B) (EDR)",null,null,null,null,null,null,0,3,null,null,1,null,2,null,3]
[]
[2,"Tarih",null,null,"Saat",null,"Tur",null,"Maç",null,"Masa",null,null,3,"Grup",null,5,null,null,null,null,null,1,null,2,null,"Puan",null,"Sıralama"]
[null,"2025-03-02",null,null,"09:30:00",null,1,null,"1 - 2",null,null,null,5,{"$error":"#REF!"},1,"İSTANBUL DSİ SPOR (A) (İST)",null,null,null,null,null,null,null,null,3,1,2,null,1,null,4]
[null,".",null,null,null,null,null,null,null,null,null,null,28,{"$error":"#REF!"},2,"YALOVA BLD. SPOR (C) (YLV)",null,null,null,null,null,null,1,3,null,null,1,null,2,null,4]
[]
[2,"Tarih",null,null,"Saat",null,"Tur",null,"Maç",null,"Masa",null,null,3,"Grup",null,6,null,null,null,null,null,1,null,2,null,"Puan",null,"Sıralama"]
[null,"2025-03-02",null,null,"09:30:00",null,1,null,"1 - 2",null,null,null,6,{"$error":"#REF!"},1,"BURSA B. ŞEHİR BLD. SPOR (A) (BRS)",null,null,null,null,null,null,null,null,2,3,1,null,2,null,5]
[null,".",null,null,null,null,null,null,null,null,null,null,27,{"$error":"#REF!"},2,"İSTANBUL DSİ SPOR (B) (İST)",null,null,null,null,null,null,3,2,null,null,2,null,1,null,5]
[]
[2,"Tarih",null,null,"Saat",null,"Tur",null,"Maç",null,"Masa",null,null,3,"Grup",null,7,null,null,null,null,null,1,null,2,null,"Puan",null,"Sıralama"]
[null,"2025-03-02",null,null,"09:30:00",null,1,null,"1 - 2",null,null,null,7,{"$error":"#REF!"},1,"PENDİK BLD. SPOR (A) (İST)",null,null,null,null,null,null,null,null,3,0,2,null,1,null,3]
[null,".",null,null,null,null,null,null,null,null,null,null,26,{"$error":"#REF!"},2,"GENÇ TRAKYA SPOR (C) (EDR)",null,null,null,null,null,null,0,3,null,null,1,null,2,null,3]
[]
[2,"Tarih",null,null,"Saat",null,"Tur",null,"Maç",null,"Masa",null,null,3,"Grup",null,8,null,null,null,null,null,1,null,2,null,"Puan",null,"Sıralama"]
[null,"2025-03-02",null,null,"09:30:00",null,1,null,"1 - 2",null,null,null,8,{"$error":"#REF!"},1,"UMUDUMUZ ÖZEL SPORCULAR GSK (A) (BRT)",null,null,null,null,null,null,null,null,3,0,2,null,1,null,3]
[null,".",null,null,null,null,null,null,null,null,null,null,25,{"$error":"#REF!"},2,"BALIKESİR B. ŞEHİR BLD. SPOR (A) (BLK)",null,null,null,null,null,null,0,3,null,null,1,null,2,null,3]
[]
[2,"Tarih",null,null,"Saat",null,"Tur",null,"Maç",null,"Masa",null,null,3,"Grup",null,9,null,null,null,null,null,1,null,2,null,"Puan",null,"Sıralama"]
[null,"2025-03-02",null,null,"09:30:00",null,1,null,"1 - 2",null,null,null,9,{"$error":"#REF!"},1,"BALIKESİR B. ŞEHİR BLD. SPOR (C) (BLK)",null,null,null,null,null,null,null,null,1,3,1,null,2,null,4]
[null,".",null,null,null,null,null,null,null,null,null,null,24,{"$error":"#REF!"},2,"LÜLEBURGAZ GENÇLİK SPOR  (A) (KRL)",null,null,null,null,null,null,3,1,null,null,2,null,1,null,4]
[]
[2,"Tarih",null,null,"Saat",null,"Tur",null,"Maç",null,"Masa",null,null,3,"Grup",null,10,null,null,null,null,null,1,null,2,null,"Puan",null,"Sıralama"]
[null,"2025-03-02",null,null,"09:30:00",null,1,null,"1 - 2",null,null,null,10,{"$error":"#REF!"},1,"GENÇLİKSPOR KIRKLARELİ (B) (KRL)",null,null,null,null,null,null,null,null,3,1,2,null,1,null,4]
[null,".",null,null,null,null,null,null,null,null,null,null,23,{"$error":"#REF!"},2,"BALIKESİR B. ŞEHİR BLD. SPOR (B) (BLK)",null,null,null,null,null,null,1,3,null,null,1,null,2,null,4]
[]
[2,"Tarih",null,null,"Saat",null,"Tur",null,"Maç",null,"Masa",null,null,3,"Grup",null,11,null,null,null,null,null,1,null,2,null,"Puan",null,"Sıralama"]
[null,"2025-03-02",null,null,"09:30:00",null,1,null,"1 - 2",null,null,null,11,{"$error":"#REF!"},1,"GENÇ TRAKYA SPOR (A) (EDR)",null,null,null,null,null,null,null,null,0,3,1,null,2,null,3]
[null,".",null,null,null,null,null,null,null,null,null,null,22,{"$error":"#REF!"},2,"ÇERKEZKÖY BLD. GSK (A) (TKD)",null,null,null,null,null,null,3,0,null,null,2,null,1,null,3]
[]
[2,"Tarih",null,null,"Saat",null,"Tur",null,"Maç",null,"Masa",null,null,3,"Grup",null,12,null,null,null,null,null,1,null,2,null,"Puan",null,"Sıralama"]
[null,"2025-03-02",null,null,"09:30:00",null,1,null,"1 - 2",null,null,null,12,{"$error":"#REF!"},1,"BEYOĞLUSPOR (A) (İST)",null,null,null,null,null,null,null,null,3,0,2,null,1,null,3]
[null,".",null,null,null,null,null,null,null,null,null,null,21,{"$error":"#REF!"},2,"TRAKER SPOR (B) (KRL)",null,null,null,null,null,null,0,3,null,null,1,null,2,null,3]
[]
[2,"Tarih",null,null,"Saat",null,"Tur",null,"Maç",null,"Masa",null,null,3,"Grup",null,13,null,null,null,null,null,1,null,2,null,"Puan",null,"Sıralama"]
[null,"2025-03-02",null,null,"09:30:00",null,1,null,"1 - 2",null,null,null,13,{"$error":"#REF!"},1,"BALIKESİR G.SPOR(A) (BLK)",null,null,null,null,null,null,null,null,0,3,1,null,2,null,3]
[null,".",null,null,null,null,null,null,null,null,null,null,20,{"$error":"#REF!"},2,"YILDIZ RAKETLER SPOR (B) (İST)",null,null,null,null,null,null,3,0,null,null,2,null,1,null,3]
[]
[2,"Tarih",null,null,"Saat",null,"Tur",null,"Maç",null,"Masa",null,null,3,"Grup",null,14,null,null,null,null,null,1,null,2,null,"Puan",null,"Sıralama"]
[null,"2025-03-02",null,null,"09:30:00",null,1,null,"1 - 2",null,null,null,14,{"$error":"#REF!"},1,"GENÇLİKSPOR KIRKLARELİ (A) (KRL)",null,null,null,null,null,null,null,null,3,0,2,null,1,null,3]
[null,".",null,null,null,null,null,null,null,null,null,null,19,{"$error":"#REF!"},2,"LÜLEBURGAZ ZİRVE SPOR  (A) (KRL)",null,null,null,null,null,null,0,3,null,null,1,null,2,null,3]
[]
[3,"Tarih",null,null,"Saat",null,"Tur",null,"Maç",null,"Masa",null,null,3,"Grup",null,15,null,null,null,null,null,1,null,2,null,3,null,"Puan",null,"Sıralama"]
[null,"2025-03-02",null,null,"09:30:00",null,1,null,"1 - 3",null,null,null,15,{"$error":"#REF!"},1,"İSTANBUL BBSK (B) (İST)",null,null,null,null,null,null,null,null,3,2,3,1,4,null,1,null,9]
[null,"2025-03-02",null,null,"10:30:00",null,2,null,"1 - 2",null,null,null,18,{"$error":"#REF!"},2,"EDİRNE YURDUM SPOR (A) (EDR)",null,null,null,null,null,null,2,3,null,null,3,0,3,null,2,null,8]
[null,"2025-03-02",null,null,"11:30:00",null,3,null,"2 - 3",null,null,null,33,{"$error":"#REF!"},3,"GÖNEN TAYFUNSPOR (B) (BLK)",null,null,null,null,null,null,1,3,0,3,null,null,2,null,3,null,7]
[]
[3,"Tarih",null,null,"Saat",null,"Tur",null,"Maç",null,"Masa",null,null,3,"Grup",null,16,null,null,null,null,null,1,null,2,null,3,null,"Puan",null,"Sıralama"]
[null,"2025-03-02",null,null,"09:30:00",null,1,null,"1 - 3",null,null,null,16,{"$error":"#REF!"},1,"TRAKER SPOR (A) (KRL)",null,null,null,null,null,null,null,null,3,0,3,0,4,null,1,null,6]
[null,"2025-03-02",null,null,"10:30:00",null,2,null,"1 - 2",null,null,null,17,{"$error":"#REF!"},2,"İSTANBUL BBSK (C) (İST)",null,null,null,null,null,null,0,3,null,null,2,3,2,null,3,null,8]
[null,"2025-03-02",null,null,"11:30:00",null,3,null,"2 - 3",null,null,null,34,{"$error":"#REF!"},3,"YALOVA GENÇLİK SPOR (A) (YLV)",null,null,null,null,null,null,0,3,3,2,null,null,3,null,2,null,8]

{"sheet":"On_Eleme","index":2,"n_rows":195,"n_cols":52,"rows_kept":195,"cut":false,"hidden":true,"merged":[[0,4,1,7],[2,4,2,7],[3,47,3,48],[3,49,3,50],[3,51,3,52],[3,41,3,42],[3,43,3,44],[3,45,3,46]]}
[null,null,null,null,{"$f":"KATILIM!AC1","v":"TÜRKİYE MASA TENİSİ FEDERASYONU\nYILDIZLAR KUZEYBATI BÖLGE YARIŞMALARI"},null,null,null,null,null,null,null,null,null,null,null,null,null,null,null,null,null,null,null,null,null,null,null,null,null,null,null,null,null,null,null,null,null,null,{"$f":"COUNTIF(AN5:AN68,\"<>0\")","v":16}]
[]
[null,null,null,null,{"$f":"KATILIM!A2&\" \"&KATILIM!AC3","v":"ERKEK TAKIM  [01-02 Mart 2025 BALIKESİR] [ Ön Eleme ]"}]
[null,null,null,null,"Sporcu","Skor","Galip",null,"Külüp Adı",null,null,"Eleme tablosu ilk turda denk gelip gelmediğinin kontrolü yapılır",null,null,null,null,null,null,null,null,null,null,null,null,null,null,null,null,null,null,null,null,null,null,"#","Date","Time","Table","Competition","Player-A","Player-B","Set1",null,"Set2",null,"Set3",null,"Set4",null,"Set5",null,"Result"]
[1,"E1",19,null,{"$f":"IFERROR(VLOOKUP(C5,KATILIM!$A$4:$Z$301,26,0),0)","v":"LÜLEBURGAZ ZİRVE SPOR  (A) (KRL)"},{"$f":"AZ5","v":0},{"$f":"IF(AND(F5=0,F6=0),\"\",IF(F5>F6,E5,E6))","v":""},null,{"$f":"IFERROR(VLOOKUP(C5,KATILIM!$A$4:$G$301,6,0),0)","v":"KIRKLARELİ"},null,null,"E1",1,{"$f":"OFFSET(#REF!,M5,#REF!)","v":{"$error":"#REF!"}},{"$f":"IFERROR(VLOOKUP(N5,KATILIM!$A$4:$Z$301,26,0),0)","v":0},{"$f":"IFERROR(VLOOKUP(N5,KATILIM!$A$4:$G$301,6,0),0)","v":0},null,null,null,null,null,null,null,null,null,null,null,null,null,null,null,null,null,null,1,null,null,null,null,{"$f":"E5","v":"LÜLEBURGAZ ZİRVE SPOR  (A) (KRL)"},{"$f":"E6","v":"GÖNEN TAYFUNSPOR (B) (BLK)"}]
["1.1",null,33,null,{"$f":"IFERROR(VLOOKUP(C6,KATILIM!$A$4:$Z$301,26,0),0)","v":"GÖNEN TAYFUNSPOR (B) (BLK)"},{"$f":"BA5","v":0},null,null,{"$f":"IFERROR(VLOOKUP(C6,KATILIM!$A$4:$G$301,6,0),0)","v":"BALIKESİR"},null,null,null,null,null,null,null,null,null,null,null,null,null,null,null,null,null,null,null,null,null,null,null,null,null,2,null,null,null,null,{"$f":"E8","v":"YILDIZ RAKETLER SPOR (B) (İST)"},{"$f":"E9","v":"YALOVA GENÇLİK SPOR (A) (YLV)"}]
[null,null,null,null,null,null,null,null,null,null,null,null,null,null,null,null,null,null,null,null,null,null,null,null,null,null,null,null,null,null,null,null,null,null,3,null,null,null,null,{"$f":"E11","v":"EDİRNE YURDUM SPOR (A) (EDR)"},{"$f":"E12","v":0}]
[2,"E2",20,null,{"$f":"IFERROR(VLOOKUP(C8,KATILIM!$A$4:$Z$301,26,0),0)","v":"YILDIZ RAKETLER SPOR (B) (İST)"},{"$f":"AZ6","v":0},{"$f":"IF(AND(F8=0,F9=0),\"\",IF(F8>F9,E8,E9))","v":""},null,{"$f":"IFERROR(VLOOKUP(C8,KATILIM!$A$4:$G$301,6,0),0)","v":"İSTANBUL"},null,null,"E2",2,{"$f":"OFFSET(#REF!,M8,#REF!)","v":{"$error":"#REF!"}},{"$f":"IFERROR(VLOOKUP(N8,KATILIM!$A$4:$Z$301,26,0),0)","v":0},{"$f":"IFERROR(VLOOKUP(N8,KATILIM!$A$4:$G$301,6,0),0)","v":0},null,null,null,null,null,null,null,null,null,null,null,null,null,null,null,null,null,null,4,null,null,null,null,{"$f":"E14","v":"İSTANBUL BBSK (C) (İST)"},{"$f":"E15","v":0}]
["2.2",null,34,null,{"$f":"IFERROR(VLOOKUP(C9,KATILIM!$A$4:$Z$301,26,0),0)","v":"YALOVA GENÇLİK SPOR (A) (YLV)"},{"$f":"BA6","v":0},null,null,{"$f":"IFERROR(VLOOKUP(C9,KATILIM!$A$4:$G$301,6,0),0)","v":"YALOVA"},null,null,null,null,null,null,null,null,null,null,null,null,null,null,null,null,null,null,null,null,null,null,null,null,null,5,null,null,null,null,{"$f":"E17","v":"ÇERKEZKÖY BLD. GSK (A) (TKD)"},{"$f":"E18","v":0}]
[null,null,null,null,null,null,null,null,null,null,null,null,null,null,null,null,null,null,null,null,null,null,null,null,null,null,null,null,null,null,null,null,null,null,6,null,null,null,null,{"$f":"E20","v":"TRAKER SPOR (B) (KRL)"},{"$f":"E21","v":0}]
[3,"E3",18,null,{"$f":"IFERROR(VLOOKUP(C11,KATILIM!$A$4:$Z$301,26,0),0)","v":"EDİRNE YURDUM SPOR (A) (EDR)"},{"$f":"AZ7","v":0},{"$f":"IF(AND(F11=0,F12=0),\"\",IF(F11>F12,E11,E12))","v":""},null,{"$f":"IFERROR(VLOOKUP(C11,KATILIM!$A$4:$G$301,6,0),0)","v":"EDİRNE"},null,null,"E3",3,{"$f":"OFFSET(#REF!,M11,#REF!)","v":{"$error":"#REF!"}},{"$f":"IFERROR(VLOOKUP(N11,KATILIM!$A$4:$Z$301,26,0),0)","v":0},{"$f":"IFERROR(VLOOKUP(N11,KATILIM!$A$4:$G$301,6,0),0)","v":0},null,null,null,null,null,null,null,null,null,null,null,null,null,null,null,null,null,null,7,null,null,null,null,{"$f":"E23","v":"BALIKESİR B. ŞEHİR BLD. SPOR (B) (BLK)"},{"$f":"E24","v":0}]
["3.3",null,35,null,{"$f":"IFERROR(VLOOKUP(C12,KATILIM!$A$4:$Z$301,26,0),0)","v":0},{"$f":"BA7","v":0},null,null,{"$f":"IFERROR(VLOOKUP(C12,KATILIM!$A$4:$G$301,6,0),0)","v":0},null,null,null,null,null,null,null,null,null,null,null,null,null,null,null,null,null,null,null,null,null,null,null,null,null,8,null,null,null,null,{"$f":"E26","v":"LÜLEBURGAZ GENÇLİK SPOR  (A) (KRL)"},{"$f":"E27","v":0}]
[null,null,null,null,null,null,null,null,null,null,null,null,null,null,null,null,null,null,null,null,null,null,null,null,null,null,null,null,null,null,null,null,null,null,9,null,null,null,null,{"$f":"E29","v":"İSTANBUL DSİ SPOR (B) (İST)"},{"$f":"E30","v":0}]
[4,"E4",17,null,{"$f":"IFERROR(VLOOKUP(C14,KATILIM!$A$4:$Z$301,26,0),0)","v":"İSTANBUL BBSK (C) (İST)"},{"$f":"AZ8","v":0},{"$f":"IF(AND(F14=0,F15=0),\"\",IF(F14>F15,E14,E15))","v":""},null,{"$f":"IFERROR(VLOOKUP(C14,KATILIM!$A$4:$G$301,6,0),0)","v":"İSTANBUL"},null,null,"E4",4,{"$f":"OFFSET(#REF!,M14,#REF!)","v":{"$error":"#REF!"}},{"$f":"IFERROR(VLOOKUP(N14,KATILIM!$A$4:$Z$301,26,0),0)","v":0},{"$f":"IFERROR(VLOOKUP(N14,KATILIM!$A$4:$G$301,6,0),0)","v":0},null,null,null,null,null,null,null,null,null,null,null,null,null,null,null,null,null,null,10,null,null,null,null,{"$f":"E32","v":"YALOVA BLD. SPOR (C) (YLV)"},{"$f":"E33","v":0}]
["4.4",null,36,null,{"$f":"IFERROR(VLOOKUP(C15,KATILIM!$A$4:$Z$301,26,0),0)","v":0},{"$f":"BA8","v":0},null,null,{"$f":"IFERROR(VLOOKUP(C15,KATILIM!$A$4:$G$301,6,0),0)","v":0},null,null,null,null,null,null,null,null,null,null,null,null,null,null,null,null,null,null,null,null,null,null,null,null,null,11,null,null,null,null,{"$f":"E35","v":"GENÇ TRAKYA SPOR (C) (EDR)"},{"$f":"E36","v":0}]
[null,null,null,null,null,null,null,null,null,null,null,null,null,null,null,null,null,null,null,null,null,null,null,null,null,null,null,null,null,null,null,null,null,null,12,null,null,null,null,{"$f":"E38","v":"BALIKESİR B. ŞEHİR BLD. SPOR (A) (BLK)"},{"$f":"E39","v":0}]
[5,"E5",22,null,{"$f":"IFERROR(VLOOKUP(C17,KATILIM!$A$4:$Z$301,26,0),0)","v":"ÇERKEZKÖY BLD. GSK (A) (TKD)"},{"$f":"AZ9","v":0},{"$f":"IF(AND(F17=0,F18=0),\"\",IF(F17>F18,E17,E18))","v":""},null,{"$f":"IFERROR(VLOOKUP(C17,KATILIM!$A$4:$G$301,6,0),0)","v":"TEKİRDAĞ"},null,null,"E5",5,{"$f":"OFFSET(#REF!,M17,#REF!)","v":{"$error":"#REF!"}},{"$f":"IFERROR(VLOOKUP(N17,KATILIM!$A$4:$Z$301,26,0),0)","v":0},{"$f":"IFERROR(VLOOKUP(N17,KATILIM!$A$4:$G$301,6,0),0)","v":0},null,null,null,null,null,null,null,null,null,null,null,null,null,null,null,null,null,null,13,null,null,null,null,{"$f":"E41","v":"GÖNEN TAYFUNSPOR (A) (BLK)"},{"$f":"E42","v":0}]
["5.5",null,37,null,{"$f":"IFERROR(VLOOKUP(C18,KATILIM!$A$4:$Z$301,26,0),0)","v":0},{"$f":"BA9","v":0},null,null,{"$f":"IFERROR(VLOOKUP(C18,KATILIM!$A$4:$G$301,6,0),0)","v":0},null,null,null,null,null,null,null,null,null,null,null,null,null,null,null,null,null,null,null,null,null,null,null,null,null,14,null,null,null,null,{"$f":"E44","v":"EDİRNE YURDUM SPOR (B) (EDR)"},{"$f":"E45","v":0}]
[null,null,null,null,null,null,null,null,null,null,null,null,null,null,null,null,null,null,null,null,null,null,null,null,null,null,null,null,null,null,null,null,null,null,15,null,null,null,null,{"$f":"E47","v":"YALOVA BLD. SPOR (B) (YLV)"},{"$f":"E48","v":0}]
[6,"E6",21,null,{"$f":"IFERROR(VLOOKUP(C20,KATILIM!$A$4:$Z$301,26,0),0)","v":"TRAKER SPOR (B) (KRL)"},{"$f":"AZ10","v":0},{"$f":"IF(AND(F20=0,F21=0),\"\",IF(F20>F21,E20,E21))","v":""},null,{"$f":"IFERROR(VLOOKUP(C20,KATILIM!$A$4:$G$301,6,0),0)","v":"KIRKLARELİ"},null,null,"E6",6,{"$f":"OFFSET(#REF!,M20,#REF!)","v":{"$error":"#REF!"}},{"$f":"IFERROR(VLOOKUP(N20,KATILIM!$A$4:$Z$301,26,0),0)","v":0},{"$f":"IFERROR(VLOOKUP(N20,KATILIM!$A$4:$G$301,6,0),0)","v":0},null,null,null,null,null,null,null,null,null,null,null,null,null,null,null,null,null,null,16,null,null,null,null,{"$f":"E50","v":"BOYBEYİ SPOR (A) (SKR)"},{"$f":"E51","v":0}]
["6.6",null,38,null,{"$f":"IFERROR(VLOOKUP(C21,KATILIM!$A$4:$Z$301,26,0),0)","v":0},{"$f":"BA10","v":0},null,null,{"$f":"IFERROR(VLOOKUP(C21,KATILIM!$A$4:$G$301,6,0),0)","v":0},null,null,null,null,null,null,null,null,null,null,null,null,null,null,null,null,null,null,null,null,null,null,null,null,null,17,null,null,null,null,{"$f":"E53","v":0},{"$f":"E54","v":0}]
[null,null,null,null,null,null,null,null,null,null,null,null,null,null,null,null,null,null,null,null,null,null,null,null,null,null,null,null,null,null,null,null,null,null,18,null,null,null,null,{"$f":"E56","v":0},{"$f":"E57","v":0}]
[7,"E7",23,null,{"$f":"IFERROR(VLOOKUP(C23,KATILIM!$A$4:$Z$301,26,0),0)","v":"BALIKESİR B. ŞEHİR BLD. SPOR (B) (BLK)"},{"$f":"AZ11","v":0},{"$f":"IF(AND(F23=0,F24=0),\"\",IF(F23>F24,E23,E24))","v":""},null,{"$f":"IFERROR(VLOOKUP(C23,KATILIM!$A$4:$G$301,6,0),0)","v":"BALIKESİR"},null,null,"E7",7,{"$f":"OFFSET(#REF!,M23,#REF!)","v":{"$error":"#REF!"}},{"$f":"IFERROR(VLOOKUP(N23,KATILIM!$A$4:$Z$301,26,0),0)","v":0},{"$f":"IFERROR(VLOOKUP(N23,KATILIM!$A$4:$G$301,6,0),0)","v":0},null,null,null,null,null,null,null,null,null,null,null,null,null,null,null,null,null,null,19,null,null,null,null,{"$f":"E59","v":0},{"$f":"E60","v":0}]
["7.7",null,39,null,{"$f":"IFERROR(VLOOKUP(C24,KATILIM!$A$4:$Z$301,26,0),0)","v":0},{"$f":"BA11","v":0},null,null,{"$f":"IFERROR(VLOOKUP(C24,KATILIM!$A$4:$G$301,6,0),0)","v":0},null,null,null,null,null,null,null,null,null,null,null,null,null,null,null,null,null,null,null,null,null,null,null,null,null,20,null,null,null,null,{"$f":"E62","v":0},{"$f":"E63","v":0}]
[null,null,null,null,null,null,null,null,null,null,null,null,null,null,null,null,null,null,null,null,null,null,null,null,null,null,null,null,null,null,null,null,null,null,21,null,null,null,null,{"$f":"E65","v":0},{"$f":"E66","v":0}]
[8,"E8",24,null,{"$f":"IFERROR(VLOOKUP(C26,KATILIM!$A$4:$Z$301,26,0),0)","v":"LÜLEBURGAZ GENÇLİK SPOR  (A) (KRL)"},{"$f":"AZ12","v":0},{"$f":"IF(AND(F26=0,F27=0),\"\",IF(F26>F27,E26,E27))","v":""},null,{"$f":"IFERROR(VLOOKUP(C26,KATILIM!$A$4:$G$301,6,0),0)","v":"KIRKLARELİ"},null,null,"E8",8,{"$f":"OFFSET(#REF!,M26,#REF!)","v":{"$error":"#REF!"}},{"$f":"IFERROR(VLOOKUP(N26,KATILIM!$A$4:$Z$301,26,0),0)","v":0},{"$f":"IFERROR(VLOOKUP(N26,KATILIM!$A$4:$G$301,6,0),0)","v":0},null,null,null,null,null,null,null,null,null,null,null,null,null,null,null,null,null,null,22,null,null,null,null,{"$f":"E68","v":0},{"$f":"E69","v":0}]
["8.8",null,40,null,{"$f":"IFERROR(VLOOKUP(C27,KATILIM!$A$4:$Z$301,26,0),0)","v":0},{"$f":"BA12","v":0},null,null,{"$f":"IFERROR(VLOOKUP(C27,KATILIM!$A$4:$G$301,6,0),0)","v":0},null,null,null,null,null,null,null,null,null,null,null,null,null,null,null,null,null,null,null,null,null,null,null,null,null,23,null,null,null,null,{"$f":"E71","v":0},{"$f":"E72","v":0}]
[null,null,null,null,null,null,null,null,null,null,null,null,null,null,null,null,null,null,null,null,null,null,null,null,null,null,null,null,null,null,null,null,null,null,24,null,null,null,null,{"$f":"E74","v":0},{"$f":"E75","v":0}]
[9,"E9",27,null,{"$f":"IFERROR(VLOOKUP(C29,KATILIM!$A$4:$Z$301,26,0),0)","v":"İSTANBUL DSİ SPOR (B) (İST)"},{"$f":"AZ13","v":0},{"$f":"IF(AND(F29=0,F30=0),\"\",IF(F29>F30,E29,E30))","v":""},null,{"$f":"IFERROR(VLOOKUP(C29,KATILIM!$A$4:$G$301,6,0),0)","v":"İSTANBUL"},null,null,"E9",9,{"$f":"OFFSET(#REF!,M29,#REF!)","v":{"$error":"#REF!"}},{"$f":"IFERROR(VLOOKUP(N29,KATILIM!$A$4:$Z$301,26,0),0)","v":0},{"$f":"IFERROR(VLOOKUP(N29,KATILIM!$A$4:$G$301,6,0),0)","v":0},null,null,null,null,null,null,null,null,null,null,null,null,null,null,null,null,null,null,25,null,null,null,null,{"$f":"E77","v":0},{"$f":"E78","v":0}]
["9.9",null,41,null,{"$f":"IFERROR(VLOOKUP(C30,KATILIM!$A$4:$Z$301,26,0),0)","v":0},{"$f":"BA13","v":0},null,null,{"$f":"IFERROR(VLOOKUP(C30,KATILIM!$A$4:$G$301,6,0),0)","v":0},null,null,null,null,null,null,null,null,null,null,null,null,null,null,null,null,null,null,null,null,null,null,null,null,null,26,null,null,null,null,{"$f":"E80","v":0},{"$f":"E81","v":0}]
[null,null,null,null,null,null,null,null,null,null,null,null,null,null,null,null,null,null,null,null,null,null,null,null,null,null,null,null,null,null,null,null,null,null,27,null,null,null,null,{"$f":"E83","v":0},{"$f":"E84","v":0}]
[10,"E10",28,null,{"$f":"IFERROR(VLOOKUP(C32,KATILIM!$A$4:$Z$301,26,0),0)","v":"YALOVA BLD. SPOR (C) (YLV)"},{"$f":"AZ14","v":0},{"$f":"IF(AND(F32=0,F33=0),\"\",IF(F32>F33,E32,E33))","v":""},null,{"$f":"IFERROR(VLOOKUP(C32,KATILIM!$A$4:$G$301,6,0),0)","v":"YALOVA"},null,null,"E10",10,{"$f":"OFFSET(#REF!,M32,#REF!)","v":{"$error":"#REF!"}},{"$f":"IFERROR(VLOOKUP(N32,KATILIM!$A$4:$Z$301,26,0),0)","v":0},{"$f":"IFERROR(VLOOKUP(N32,KATILIM!$A$4:$G$301,6,0),0)","v":0},null,null,null,null,null,null,null,null,null,null,null,null,null,null,null,null,null,null,28,null,null,null,null,{"$f":"E86","v":0},{"$f":"E87","v":0}]
["10.10",null,42,null,{"$f":"IFERROR(VLOOKUP(C33,KATILIM!$A$4:$Z$301,26,0),0)","v":0},{"$f":"BA14","v":0},null,null,{"$f":"IFERROR(VLOOKUP(C33,KATILIM!$A$4:$G$301,6,0),0)","v":0},null,null,null,null,null,null,null,null,null,null,null,null,null,null,null,null,null,null,null,null,null,null,null,null,null,29,null,null,null,null,{"$f":"E89","v":0},{"$f":"E90","v":0}]
[null,null,null,null,null,null,null,null,null,null,null,null,null,null,null,null,null,null,null,null,null,null,null,null,null,null,null,null,null,null,null,null,null,null,30,null,null,null,null,{"$f":"E92","v":0},{"$f":"E93","v":0}]
[11,"E11",26,null,{"$f":"IFERROR(VLOOKUP(C35,KATILIM!$A$4:$Z$301,26,0),0)","v":"GENÇ TRAKYA SPOR (C) (EDR)"},{"$f":"AZ15","v":0},{"$f":"IF(AND(F35=0,F36=0),\"\",IF(F35>F36,E35,E36))","v":""},null,{"$f":"IFERROR(VLOOKUP(C35,KATILIM!$A$4:$G$301,6,0),0)","v":"EDİRNE"},null,null,"E11",11,{"$f":"OFFSET(#REF!,M35,#REF!)","v":{"$error":"#REF!"}},{"$f":"IFERROR(VLOOKUP(N35,KATILIM!$A$4:$Z$301,26,0),0)","v":0},{"$f":"IFERROR(VLOOKUP(N35,KATILIM!$A$4:$G$301,6,0),0)","v":0},null,null,null,null,null,null,null,null,null,null,null,null,null,null,null,null,null,null,31,null,null,null,null,{"$f":"E95","v":0},{"$f":"E96","v":0}]
["11.11",null,43,null,{"$f":"IFERROR(VLOOKUP(C36,KATILIM!$A$4:$Z$301,26,0),0)","v":0},{"$f":"BA15","v":0},null,null,{"$f":"IFERROR(VLOOKUP(C36,KATILIM!$A$4:$G$301,6,0),0)","v":0},null,null,null,null,null,null,null,null,null,null,null,null,null,null,null,null,null,null,null,null,null,null,null,null,null,32,null,null,null,null,{"$f":"E98","v":0},{"$f":"E99","v":0}]
[null,null,null,null,null,null,null,null,null,null,null,null,null,null,null,null,null,null,null,null,null,null,null,null,null,null,null,null,null,null,null,null,null,null,33,null,null,null,null,{"$f":"E101","v":0},{"$f":"E102","v":0}]
[12,"E12",25,null,{"$f":"IFERROR(VLOOKUP(C38,KATILIM!$A$4:$Z$301,26,0),0)","v":"BALIKESİR B. ŞEHİR BLD. SPOR (A) (BLK)"},{"$f":"AZ16","v":0},{"$f":"IF(AND(F38=0,F39=0),\"\",IF(F38>F39,E38,E39))","v":""},null,{"$f":"IFERROR(VLOOKUP(C38,KATILIM!$A$4:$G$301,6,0),0)","v":"BALIKESİR"},null,null,"E12",12,{"$f":"OFFSET(#REF!,M38,#REF!)","v":{"$error":"#REF!"}},{"$f":"IFERROR(VLOOKUP(N38,KATILIM!$A$4:$Z$301,26,0),0)","v":0},{"$f":"IFERROR(VLOOKUP(N38,KATILIM!$A$4:$G$301,6,0),0)","v":0},null,null,null,null,null,null,null,null,null,null,null,null,null,null,null,null,null,null,34,null,null,null,null,{"$f":"E104","v":0},{"$f":"E105","v":0}]
["12.12",null,44,null,{"$f":"IFERROR(VLOOKUP(C39,KATILIM!$A$4:$Z$301,26,0),0)","v":0},{"$f":"BA16","v":0},null,null,{"$f":"IFERROR(VLOOKUP(C39,KATILIM!$A$4:$G$301,6,0),0)","v":0},null,null,null,null,null,null,null,null,null,null,null,null,null,null,null,null,null,null,null,null,null,null,null,null,null,35,null,null,null,null,{"$f":"E107","v":0},{"$f":"E108","v":0}]
[null,null,null,null,null,null,null,null,null,null,null,null,null,null,null,null,null,null,null,null,null,null,null,null,null,null,null,null,null,null,null,null,null,null,36,null,null,null,null,{"$f":"E110","v":0},{"$f":"E111","v":0}]
[13,"E13",30,null,{"$f":"IFERROR(VLOOKUP(C41,KATILIM!$A$4:$Z$301,26,0),0)","v":"GÖNEN TAYFUNSPOR (A) (BLK)"},{"$f":"AZ17","v":0},{"$f":"IF(AND(F41=0,F42=0),\"\",IF(F41>F42,E41,E42))","v":""},null,{"$f":"IFERROR(VLOOKUP(C41,KATILIM!$A$4:$G$301,6,0),0)","v":"BALIKESİR"},null,null,"E13",13,{"$f":"OFFSET(#REF!,M41,#REF!)","v":{"$error":"#REF!"}},{"$f":"IFERROR(VLOOKUP(N41,KATILIM!$A$4:$Z$301,26,0),0)","v":0},{"$f":"IFERROR(VLOOKUP(N41,KATILIM!$A$4:$G$301,6,0),0)","v":0},null,null,null,null,null,null,null,null,null,null,null,null,null,null,null,null,null,null,37,null,null,null,null,{"$f":"E113","v":0},{"$f":"E114","v":0}]
["13.13",null,45,null,{"$f":"IFERROR(VLOOKUP(C42,KATILIM!$A$4:$Z$301,26,0),0)","v":0},{"$f":"BA17","v":0},null,null,{"$f":"IFERROR(VLOOKUP(C42,KATILIM!$A$4:$G$301,6,0),0)","v":0},null,null,null,null,null,null,null,null,null,null,null,null,null,null,null,null,null,null,null,null,null,null,null,null,null,38,null,null,null,null,{"$f":"E116","v":0},{"$f":"E117","v":0}]
[null,null,null,null,null,null,null,null,null,null,null,null,null,null,null,null,null,null,null,null,null,null,null,null,null,null,null,null,null,null,null,null,null,null,39,null,null,null,null,{"$f":"E119","v":0},{"$f":"E120","v":0}]
[14,"E14",29,null,{"$f":"IFERROR(VLOOKUP(C44,KATILIM!$A$4:$Z$301,26,0),0)","v":"EDİRNE YURDUM SPOR (B) (EDR)"},{"$f":"AZ18","v":0},{"$f":"IF(AND(F44=0,F45=0),\"\",IF(F44>F45,E44,E45))","v":""},null,{"$f":"IFERROR(VLOOKUP(C44,KATILIM!$A$4:$G$301,6,0),0)","v":"EDİRNE"},null,null,"E14",14,{"$f":"OFFSET(#REF!,M44,#REF!)","v":{"$error":"#REF!"}},{"$f":"IFERROR(VLOOKUP(N44,KATILIM!$A$4:$Z$301,26,0),0)","v":0},{"$f":"IFERROR(VLOOKUP(N44,KATILIM!$A$4:$G$301,6,0),0)","v":0},null,null,null,null,null,null,null,null,null,null,null,null,null,null,null,null,null,null,40,null,null,null,null,{"$f":"E122","v":0},{"$f":"E123","v":0}]
["14.14",null,46,null,{"$f":"IFERROR(VLOOKUP(C45,KATILIM!$A$4:$Z$301,26,0),0)","v":0},{"$f":"BA18","v":0},null,null,{"$f":"IFERROR(VLOOKUP(C45,KATILIM!$A$4:$G$301,6,0),0)","v":0},null,null,null,null,null,null,null,null,null,null,null,null,null,null,null,null,null,null,null,null,null,null,null,null,null,41,null,null,null,null,{"$f":"E125","v":0},{"$f":"E126","v":0}]
[null,null,null,null,null,null,null,null,null,null,null,null,null,null,null,null,null,null,null,null,null,null,null,null,null,null,null,null,null,null,null,null,null,null,42,null,null,null,null,{"$f":"E128","v":0},{"$f":"E129","v":0}]
[15,"E15",31,null,{"$f":"IFERROR(VLOOKUP(C47,KATILIM!$A$4:$Z$301,26,0),0)","v":"YALOVA BLD. SPOR (B) (YLV)"},{"$f":"AZ19","v":0},{"$f":"IF(AND(F47=0,F48=0),\"\",IF(F47>F48,E47,E48))","v":""},null,{"$f":"IFERROR(VLOOKUP(C47,KATILIM!$A$4:$G$301,6,0),0)","v":"YALOVA"},null,null,"E15",15,{"$f":"OFFSET(#REF!,M47,#REF!)","v":{"$error":"#REF!"}},{"$f":"IFERROR(VLOOKUP(N47,KATILIM!$A$4:$Z$301,26,0),0)","v":0},{"$f":"IFERROR(VLOOKUP(N47,KATILIM!$A$4:$G$301,6,0),0)","v":0},null,null,null,null,null,null,null,null,null,null,null,null,null,null,null,null,null,null,43,null,null,null,null,{"$f":"E131","v":0},{"$f":"E132","v":0}]
["15.15",null,47,null,{"$f":"IFERROR(VLOOKUP(C48,KATILIM!$A$4:$Z$301,26,0),0)","v":0},{"$f":"BA19","v":0},null,null,{"$f":"IFERROR(VLOOKUP(C48,KATILIM!$A$4:$G$301,6,0),0)","v":0},null,null,null,null,null,null,null,null,null,null,null,null,null,null,null,null,null,null,null,null,null,null,null,null,null,44,null,null,null,null,{"$f":"E134","v":0},{"$f":"E135","v":0}]
[null,null,null,null,null,null,null,null,null,null,null,null,null,null,null,null,null,null,null,null,null,null,null,null,null,null,null,null,null,null,null,null,null,null,45,null,null,null,null,{"$f":"E137","v":0},{"$f":"E138","v":0}]
[16,"E16",32,null,{"$f":"IFERROR(VLOOKUP(C50,KATILIM!$A$4:$Z$301,26,0),0)","v":"BOYBEYİ SPOR (A) (SKR)"},{"$f":"AZ20","v":0},{"$f":"IF(AND(F50=0,F51=0),\"\",IF(F50>F51,E50,E51))","v":""},null,{"$f":"IFERROR(VLOOKUP(C50,KATILIM!$A$4:$G$301,6,0),0)","v":"SAKARYA"},null,null,"E16",16,{"$f":"OFFSET(#REF!,M50,#REF!)","v":{"$error":"#REF!"}},{"$f":"IFERROR(VLOOKUP(N50,KATILIM!$A$4:$Z$301,26,0),0)","v":0},{"$f":"IFERROR(VLOOKUP(N50,KATILIM!$A$4:$G$301,6,0),0)","v":0},null,null,null,null,null,null,null,null,null,null,null,null,null,null,null,null,null,null,46,null,null,null,null,{"$f":"E140","v":0},{"$f":"E141","v":0}]
["16.16",null,48,null,{"$f":"IFERROR(VLOOKUP(C51,KATILIM!$A$4:$Z$301,26,0),0)","v":0},{"$f":"BA20","v":0},null,null,{"$f":"IFERROR(VLOOKUP(C51,KATILIM!$A$4:$G$301,6,0),0)","v":0},null,null,null,null,null,null,null,null,null,null,null,null,null,null,null,null,null,null,null,null,null,null,null,null,null,47,null,null,null,null,{"$f":"E143","v":0},{"$f":"E144","v":0}]
[null,null,null,null,null,null,null,null,null,null,null,null,null,null,null,null,null,null,null,null,null,null,null,null,null,null,null,null,null,null,null,null,null,null,48,null,null,null,null,{"$f":"E146","v":0},{"$f":"E147","v":0}]
[17,"E17",null,null,{"$f":"IFERROR(VLOOKUP(C53,KATILIM!$A$4:$Z$301,26,0),0)","v":0},{"$f":"AZ21","v":0},{"$f":"IF(AND(F53=0,F54=0),\"\",IF(F53>F54,E53,E54))","v":""},null,{"$f":"IFERROR(VLOOKUP(C53,KATILIM!$A$4:$G$301,6,0),0)","v":0},null,null,"E17",17,{"$f":"OFFSET(#REF!,M53,#REF!)","v":{"$error":"#REF!"}},{"$f":"IFERROR(VLOOKUP(N53,KATILIM!$A$4:$Z$301,26,0),0)","v":0},{"$f":"IFERROR(VLOOKUP(N53,KATILIM!$A$4:$G$301,6,0),0)","v":0},null,null,null,null,null,null,null,null,null,null,null,null,null,null,null,null,null,null,49,null,null,null,null,{"$f":"E149","v":0},{"$f":"E150","v":0}]
["17.17",null,null,null,{"$f":"IFERROR(VLOOKUP(C54,KATILIM!$A$4:$Z$301,26,0),0)","v":0},{"$f":"BA21","v":0},null,null,{"$f":"IFERROR(VLOOKUP(C54,KATILIM!$A$4:$G$301,6,0),0)","v":0},null,null,null,null,null,null,null,null,null,null,null,null,null,null,null,null,null,null,null,null,null,null,null,null,null,50,null,null,null,null,{"$f":"E152","v":0},{"$f":"E153","v":0}]
[null,null,null,null,null,null,null,null,null,null,null,null,null,null,null,null,null,null,null,null,null,null,null,null,null,null,null,null,null,null,null,null,null,null,51,null,null,null,null,{"$f":"E155","v":0},{"$f":"E156","v":0}]
[18,"E18",null,null,{"$f":"IFERROR(VLOOKUP(C56,KATILIM!$A$4:$Z$301,26,0),0)","v":0},{"$f":"AZ22","v":0},{"$f":"IF(AND(F56=0,F57=0),\"\",IF(F56>F57,E56,E57))","v":""},null,{"$f":"IFERROR(VLOOKUP(C56,KATILIM!$A$4:$G$301,6,0),0)","v":0},null,null,"E18",18,{"$f":"OFFSET(#REF!,M56,#REF!)","v":{"$error":"#REF!"}},{"$f":"IFERROR(VLOOKUP(N56,KATILIM!$A$4:$Z$301,26,0),0)","v":0},{"$f":"IFERROR(VLOOKUP(N56,KATILIM!$A$4:$G$301,6,0),0)","v":0},null,null,null,null,null,null,null,null,null,null,null,null,null,null,null,null,null,null,52,null,null,null,null,{"$f":"E158","v":0},{"$f":"E159","v":0}]
["18.18",null,null,null,{"$f":"IFERROR(VLOOKUP(C57,KATILIM!$A$4:$Z$301,26,0),0)","v":0},{"$f":"BA22","v":0},null,null,{"$f":"IFERROR(VLOOKUP(C57,KATILIM!$A$4:$G$301,6,0),0)","v":0},null,null,null,null,null,null,null,null,null,null,null,null,null,null,null,null,null,null,null,null,null,null,null,null,null,53,null,null,null,null,{"$f":"E161","v":0},{"$f":"E162","v":0}]
[null,null,null,null,null,null,null,null,null,null,null,null,null,null,null,null,null,null,null,null,null,null,null,null,null,null,null,null,null,null,null,null,null,null,54,null,null,null,null,{"$f":"E164","v":0},{"$f":"E165","v":0}]
[19,"E19",null,null,{"$f":"IFERROR(VLOOKUP(C59,KATILIM!$A$4:$Z$301,26,0),0)","v":0},{"$f":"AZ23","v":0},{"$f":"IF(AND(F59=0,F60=0),\"\",IF(F59>F60,E59,E60))","v":""},null,{"$f":"IFERROR(VLOOKUP(C59,KATILIM!$A$4:$G$301,6,0),0)","v":0},null,null,"E19",19,{"$f":"OFFSET(#REF!,M59,#REF!)","v":{"$error":"#REF!"}},{"$f":"IFERROR(VLOOKUP(N59,KATILIM!$A$4:$Z$301,26,0),0)","v":0},{"$f":"IFERROR(VLOOKUP(N59,KATILIM!$A$4:$G$301,6,0),0)","v":0},null,null,null,null,null,null,null,null,null,null,null,null,null,null,null,null,null,null,55,null,null,null,null,{"$f":"E167","v":0},{"$f":"E168","v":0}]
["19.19",null,null,null,{"$f":"IFERROR(VLOOKUP(C60,KATILIM!$A$4:$Z$301,26,0),0)","v":0},{"$f":"BA23","v":0},null,null,{"$f":"IFERROR(VLOOKUP(C60,KATILIM!$A$4:$G$301,6,0),0)","v":0},null,null,null,null,null,null,null,null,null,null,null,null,null,null,null,null,null,null,null,null,null,null,null,null,null,56,null,null,null,null,{"$f":"E170","v":0},{"$f":"E171","v":0}]
[null,null,null,null,null,null,null,null,null,null,null,null,null,null,null,null,null,null,null,null,null,null,null,null,null,null,null,null,null,null,null,null,null,null,57,null,null,null,null,{"$f":"E173","v":0},{"$f":"E174","v":0}]
[20,"E20",null,null,{"$f":"IFERROR(VLOOKUP(C62,KATILIM!$A$4:$Z$301,26,0),0)","v":0},{"$f":"AZ24","v":0},{"$f":"IF(AND(F62=0,F63=0),\"\",IF(F62>F63,E62,E63))","v":""},null,{"$f":"IFERROR(VLOOKUP(C62,KATILIM!$A$4:$G$301,6,0),0)","v":0},null,null,"E20",20,{"$f":"OFFSET(#REF!,M62,#REF!)","v":{"$error":"#REF!"}},{"$f":"IFERROR(VLOOKUP(N62,KATILIM!$A$4:$Z$301,26,0),0)","v":0},{"$f":"IFERROR(VLOOKUP(N62,KATILIM!$A$4:$G$301,6,0),0)","v":0},null,null,null,null,null,null,null,null,null,null,null,null,null,null,null,null,null,null,58,null,null,null,null,{"$f":"E176","v":0},{"$f":"E177","v":0}]
["20.20",null,null,null,{"$f":"IFERROR(VLOOKUP(C63,KATILIM!$A$4:$Z$301,26,0),0)","v":0},{"$f":"BA24","v":0},null,null,{"$f":"IFERROR(VLOOKUP(C63,KATILIM!$A$4:$G$301,6,0),0)","v":0},null,null,null,null,null,null,null,null,null,null,null,null,null,null,null,null,null,null,null,null,null,null,null,null,null,59,null,null,null,null,{"$f":"E179","v":0},{"$f":"E180","v":0}]
[null,null,null,null,null,null,null,null,null,null,null,null,null,null,null,null,null,null,null,null,null,null,null,null,null,null,null,null,null,null,null,null,null,null,60,null,null,null,null,{"$f":"E182","v":0},{"$f":"E183","v":0}]
[21,"E21",null,null,{"$f":"IFERROR(VLOOKUP(C65,KATILIM!$A$4:$Z$301,26,0),0)","v":0},{"$f":"AZ25","v":0},{"$f":"IF(AND(F65=0,F66=0),\"\",IF(F65>F66,E65,E66))","v":""},null,{"$f":"IFERROR(VLOOKUP(C65,KATILIM!$A$4:$G$301,6,0),0)","v":0},null,null,"E21",21,{"$f":"OFFSET(#REF!,M65,#REF!)","v":{"$error":"#REF!"}},{"$f":"IFERROR(VLOOKUP(N65,KATILIM!$A$4:$Z$301,26,0),0)","v":0},{"$f":"IFERROR(VLOOKUP(N65,KATILIM!$A$4:$G$301,6,0),0)","v":0},null,null,null,null,null,null,null,null,null,null,null,null,null,null,null,null,null,null,61,null,null,null,null,{"$f":"E185","v":0},{"$f":"E186","v":0}]
["21.21",null,null,null,{"$f":"IFERROR(VLOOKUP(C66,KATILIM!$A$4:$Z$301,26,0),0)","v":0},{"$f":"BA25","v":0},null,null,{"$f":"IFERROR(VLOOKUP(C66,KATILIM!$A$4:$G$301,6,0),0)","v":0},null,null,null,null,null,null,null,null,null,null,null,null,null,null,null,null,null,null,null,null,null,null,null,null,null,62,null,null,null,null,{"$f":"E188","v":0},{"$f":"E189","v":0}]
[null,null,null,null,null,null,null,null,null,null,null,null,null,null,null,null,null,null,null,null,null,null,null,null,null,null,null,null,null,null,null,null,null,null,63,null,null,null,null,{"$f":"E191","v":0},{"$f":"E192","v":0}]
[22,"E22",null,null,{"$f":"IFERROR(VLOOKUP(C68,KATILIM!$A$4:$Z$301,26,0),0)","v":0},{"$f":"AZ26","v":0},{"$f":"IF(AND(F68=0,F69=0),\"\",IF(F68>F69,E68,E69))","v":""},null,{"$f":"IFERROR(VLOOKUP(C68,KATILIM!$A$4:$G$301,6,0),0)","v":0},null,null,"E22",22,{"$f":"OFFSET(#REF!,M68,#REF!)","v":{"$error":"#REF!"}},{"$f":"IFERROR(VLOOKUP(N68,KATILIM!$A$4:$Z$301,26,0),0)","v":0},{"$f":"IFERROR(VLOOKUP(N68,KATILIM!$A$4:$G$301,6,0),0)","v":0},null,null,null,null,null,null,null,null,null,null,null,null,null,null,null,null,null,null,64,null,null,null,null,{"$f":"E194","v":0},{"$f":"E195","v":0}]
["22.22",null,null,null,{"$f":"IFERROR(VLOOKUP(C69,KATILIM!$A$4:$Z$301,26,0),0)","v":0},{"$f":"BA26","v":0},null,null,{"$f":"IFERROR(VLOOKUP(C69,KATILIM!$A$4:$G$301,6,0),0)","v":0}]
[]
[23,"E23",null,null,{"$f":"IFERROR(VLOOKUP(C71,KATILIM!$A$4:$Z$301,26,0),0)","v":0},{"$f":"AZ27","v":0},{"$f":"IF(AND(F71=0,F72=0),\"\",IF(F71>F72,E71,E72))","v":""},null,{"$f":"IFERROR(VLOOKUP(C71,KATILIM!$A$4:$G$301,6,0),0)","v":0},null,null,"E23",23,{"$f":"OFFSET(#REF!,M71,#REF!)","v":{"$error":"#REF!"}},{"$f":"IFERROR(VLOOKUP(N71,KATILIM!$A$4:$Z$301,26,0),0)","v":0},{"$f":"IFERROR(VLOOKUP(N71,KATILIM!$A$4:$G$301,6,0),0)","v":0}]
["23.23",null,null,null,{"$f":"IFERROR(VLOOKUP(C72,KATILIM!$A$4:$Z$301,26,0),0)","v":0},{"$f":"BA27","v":0},null,null,{"$f":"IFERROR(VLOOKUP(C72,KATILIM!$A$4:$G$301,6,0),0)","v":0}]
[]
[24,"E24",null,null,{"$f":"IFERROR(VLOOKUP(C74,KATILIM!$A$4:$Z$301,26,0),0)","v":0},{"$f":"AZ28","v":0},{"$f":"IF(AND(F74=0,F75=0),\"\",IF(F74>F75,E74,E75))","v":""},null,{"$f":"IFERROR(VLOOKUP(C74,KATILIM!$A$4:$G$301,6,0),0)","v":0},null,null,"E24",24,{"$f":"OFFSET(#REF!,M74,#REF!)","v":{"$error":"#REF!"}},{"$f":"IFERROR(VLOOKUP(N74,KATILIM!$A$4:$Z$301,26,0),0)","v":0},{"$f":"IFERROR(VLOOKUP(N74,KATILIM!$A$4:$G$301,6,0),0)","v":0}]
["24.24",null,null,null,{"$f":"IFERROR(VLOOKUP(C75,KATILIM!$A$4:$Z$301,26,0),0)","v":0},{"$f":"BA28","v":0},null,null,{"$f":"IFERROR(VLOOKUP(C75,KATILIM!$A$4:$G$301,6,0),0)","v":0}]
[]
[25,"E25",null,null,{"$f":"IFERROR(VLOOKUP(C77,KATILIM!$A$4:$Z$301,26,0),0)","v":0},{"$f":"AZ29","v":0},{"$f":"IF(AND(F77=0,F78=0),\"\",IF(F77>F78,E77,E78))","v":""},null,{"$f":"IFERROR(VLOOKUP(C77,KATILIM!$A$4:$G$301,6,0),0)","v":0},null,null,"E25",25,{"$f":"OFFSET(#REF!,M77,#REF!)","v":{"$error":"#REF!"}},{"$f":"IFERROR(VLOOKUP(N77,KATILIM!$A$4:$Z$301,26,0),0)","v":0},{"$f":"IFERROR(VLOOKUP(N77,KATILIM!$A$4:$G$301,6,0),0)","v":0}]
["25.25",null,null,null,{"$f":"IFERROR(VLOOKUP(C78,KATILIM!$A$4:$Z$301,26,0),0)","v":0},{"$f":"BA29","v":0},null,null,{"$f":"IFERROR(VLOOKUP(C78,KATILIM!$A$4:$G$301,6,0),0)","v":0}]
[]
[26,"E26",null,null,{"$f":"IFERROR(VLOOKUP(C80,KATILIM!$A$4:$Z$301,26,0),0)","v":0},{"$f":"AZ30","v":0},{"$f":"IF(AND(F80=0,F81=0),\"\",IF(F80>F81,E80,E81))","v":""},null,{"$f":"IFERROR(VLOOKUP(C80,KATILIM!$A$4:$G$301,6,0),0)","v":0},null,null,"E26",26,{"$f":"OFFSET(#REF!,M80,#REF!)","v":{"$error":"#REF!"}},{"$f":"IFERROR(VLOOKUP(N80,KATILIM!$A$4:$Z$301,26,0),0)","v":0},{"$f":"IFERROR(VLOOKUP(N80,KATILIM!$A$4:$G$301,6,0),0)","v":0}]
["26.26",null,null,null,{"$f":"IFERROR(VLOOKUP(C81,KATILIM!$A$4:$Z$301,26,0),0)","v":0},{"$f":"BA30","v":0},null,null,{"$f":"IFERROR(VLOOKUP(C81,KATILIM!$A$4:$G$301,6,0),0)","v":0}]
[]
[27,"E27",null,null,{"$f":"IFERROR(VLOOKUP(C83,KATILIM!$A$4:$Z$301,26,0),0)","v":0},{"$f":"AZ31","v":0},{"$f":"IF(AND(F83=0,F84=0),\"\",IF(F83>F84,E83,E84))","v":""},null,{"$f":"IFERROR(VLOOKUP(C83,KATILIM!$A$4:$G$301,6,0),0)","v":0},null,null,"E27",27,{"$f":"OFFSET(#REF!,M83,#REF!)","v":{"$error":"#REF!"}},{"$f":"IFERROR(VLOOKUP(N83,KATILIM!$A$4:$Z$301,26,0),0)","v":0},{"$f":"IFERROR(VLOOKUP(N83,KATILIM!$A$4:$G$301,6,0),0)","v":0}]
["27.27",null,null,null,{"$f":"IFERROR(VLOOKUP(C84,KATILIM!$A$4:$Z$301,26,0),0)","v":0},{"$f":"BA31","v":0},null,null,{"$f":"IFERROR(VLOOKUP(C84,KATILIM!$A$4:$G$301,6,0),0)","v":0}]
[]
[28,"E28",null,null,{"$f":"IFERROR(VLOOKUP(C86,KATILIM!$A$4:$Z$301,26,0),0)","v":0},{"$f":"AZ32","v":0},{"$f":"IF(AND(F86=0,F87=0),\"\",IF(F86>F87,E86,E87))","v":""},null,{"$f":"IFERROR(VLOOKUP(C86,KATILIM!$A$4:$G$301,6,0),0)","v":0},null,null,"E28",28,{"$f":"OFFSET(#REF!,M86,#REF!)","v":{"$error":"#REF!"}},{"$f":"IFERROR(VLOOKUP(N86,KATILIM!$A$4:$Z$301,26,0),0)","v":0},{"$f":"IFERROR(VLOOKUP(N86,KATILIM!$A$4:$G$301,6,0),0)","v":0}]
["28.28",null,null,null,{"$f":"IFERROR(VLOOKUP(C87,KATILIM!$A$4:$Z$301,26,0),0)","v":0},{"$f":"BA32","v":0},null,null,{"$f":"IFERROR(VLOOKUP(C87,KATILIM!$A$4:$G$301,6,0),0)","v":0}]
[]
[29,"E29",null,null,{"$f":"IFERROR(VLOOKUP(C89,KATILIM!$A$4:$Z$301,26,0),0)","v":0},{"$f":"AZ33","v":0},{"$f":"IF(AND(F89=0,F90=0),\"\",IF(F89>F90,E89,E90))","v":""},null,{"$f":"IFERROR(VLOOKUP(C89,KATILIM!$A$4:$G$301,6,0),0)","v":0},null,null,"E29",29,{"$f":"OFFSET(#REF!,M89,#REF!)","v":{"$error":"#REF!"}},{"$f":"IFERROR(VLOOKUP(N89,KATILIM!$A$4:$Z$301,26,0),0)","v":0},{"$f":"IFERROR(VLOOKUP(N89,KATILIM!$A$4:$G$301,6,0),0)","v":0}]
["29.29",null,null,null,{"$f":"IFERROR(VLOOKUP(C90,KATILIM!$A$4:$Z$301,26,0),0)","v":0},{"$f":"BA33","v":0},null,null,{"$f":"IFERROR(VLOOKUP(C90,KATILIM!$A$4:$G$301,6,0),0)","v":0}]
[]
[30,"E30",null,null,{"$f":"IFERROR(VLOOKUP(C92,KATILIM!$A$4:$Z$301,26,0),0)","v":0},{"$f":"AZ34","v":0},{"$f":"IF(AND(F92=0,F93=0),\"\",IF(F92>F93,E92,E93))","v":""},null,{"$f":"IFERROR(VLOOKUP(C92,KATILIM!$A$4:$G$301,6,0),0)","v":0},null,null,"E30",30,{"$f":"OFFSET(#REF!,M92,#REF!)","v":{"$error":"#REF!"}},{"$f":"IFERROR(VLOOKUP(N92,KATILIM!$A$4:$Z$301,26,0),0)","v":0},{"$f":"IFERROR(VLOOKUP(N92,KATILIM!$A$4:$G$301,6,0),0)","v":0}]
["30.30",null,null,null,{"$f":"IFERROR(VLOOKUP(C93,KATILIM!$A$4:$Z$301,26,0),0)","v":0},{"$f":"BA34","v":0},null,null,{"$f":"IFERROR(VLOOKUP(C93,KATILIM!$A$4:$G$301,6,0),0)","v":0}]
[]
[31,"E31",null,null,{"$f":"IFERROR(VLOOKUP(C95,KATILIM!$A$4:$Z$301,26,0),0)","v":0},{"$f":"AZ35","v":0},{"$f":"IF(AND(F95=0,F96=0),\"\",IF(F95>F96,E95,E96))","v":""},null,{"$f":"IFERROR(VLOOKUP(C95,KATILIM!$A$4:$G$301,6,0),0)","v":0},null,null,"E31",31,{"$f":"OFFSET(#REF!,M95,#REF!)","v":{"$error":"#REF!"}},{"$f":"IFERROR(VLOOKUP(N95,KATILIM!$A$4:$Z$301,26,0),0)","v":0},{"$f":"IFERROR(VLOOKUP(N95,KATILIM!$A$4:$G$301,6,0),0)","v":0}]
["31.31",null,null,null,{"$f":"IFERROR(VLOOKUP(C96,KATILIM!$A$4:$Z$301,26,0),0)","v":0},{"$f":"BA35","v":0},null,null,{"$f":"IFERROR(VLOOKUP(C96,KATILIM!$A$4:$G$301,6,0),0)","v":0}]
[]
[32,"E32",null,null,{"$f":"IFERROR(VLOOKUP(C98,KATILIM!$A$4:$Z$301,26,0),0)","v":0},{"$f":"AZ36","v":0},{"$f":"IF(AND(F98=0,F99=0),\"\",IF(F98>F99,E98,E99))","v":""},null,{"$f":"IFERROR(VLOOKUP(C98,KATILIM!$A$4:$G$301,6,0),0)","v":0},null,null,"E32",32,{"$f":"OFFSET(#REF!,M98,#REF!)","v":{"$error":"#REF!"}},{"$f":"IFERROR(VLOOKUP(N98,KATILIM!$A$4:$Z$301,26,0),0)","v":0},{"$f":"IFERROR(VLOOKUP(N98,KATILIM!$A$4:$G$301,6,0),0)","v":0}]
["32.32",null,null,null,{"$f":"IFERROR(VLOOKUP(C99,KATILIM!$A$4:$Z$301,26,0),0)","v":0},{"$f":"BA36","v":0},null,null,{"$f":"IFERROR(VLOOKUP(C99,KATILIM!$A$4:$G$301,6,0),0)","v":0}]
[]
[33,"E33",null,null,{"$f":"IFERROR(VLOOKUP(C101,KATILIM!$A$4:$Z$301,26,0),0)","v":0},{"$f":"AZ37","v":0},{"$f":"IF(AND(F101=0,F102=0),\"\",IF(F101>F102,E101,E102))","v":""},null,{"$f":"IFERROR(VLOOKUP(C101,KATILIM!$A$4:$G$301,6,0),0)","v":0},null,null,"E33",33,{"$f":"OFFSET(#REF!,M101,#REF!)","v":{"$error":"#REF!"}},{"$f":"IFERROR(VLOOKUP(N101,KATILIM!$A$4:$Z$301,26,0),0)","v":0},{"$f":"IFERROR(VLOOKUP(N101,KATILIM!$A$4:$G$301,6,0),0)","v":0}]
["33.33",null,null,null,{"$f":"IFERROR(VLOOKUP(C102,KATILIM!$A$4:$Z$301,26,0),0)","v":0},{"$f":"BA37","v":0},null,null,{"$f":"IFERROR(VLOOKUP(C102,KATILIM!$A$4:$G$301,6,0),0)","v":0}]
[]
[34,"E34",null,null,{"$f":"IFERROR(VLOOKUP(C104,KATILIM!$A$4:$Z$301,26,0),0)","v":0},{"$f":"AZ38","v":0},{"$f":"IF(AND(F104=0,F105=0),\"\",IF(F104>F105,E104,E105))","v":""},null,{"$f":"IFERROR(VLOOKUP(C104,KATILIM!$A$4:$G$301,6,0),0)","v":0},null,null,"E34",34,{"$f":"OFFSET(#REF!,M104,#REF!)","v":{"$error":"#REF!"}},{"$f":"IFERROR(VLOOKUP(N104,KATILIM!$A$4:$Z$301,26,0),0)","v":0},{"$f":"IFERROR(VLOOKUP(N104,KATILIM!$A$4:$G$301,6,0),0)","v":0}]
["34.34",null,null,null,{"$f":"IFERROR(VLOOKUP(C105,KATILIM!$A$4:$Z$301,26,0),0)","v":0},{"$f":"BA38","v":0},null,null,{"$f":"IFERROR(VLOOKUP(C105,KATILIM!$A$4:$G$301,6,0),0)","v":0}]
[]
[35,"E35",null,null,{"$f":"IFERROR(VLOOKUP(C107,KATILIM!$A$4:$Z$301,26,0),0)","v":0},{"$f":"AZ39","v":0},{"$f":"IF(AND(F107=0,F108=0),\"\",IF(F107>F108,E107,E108))","v":""},null,{"$f":"IFERROR(VLOOKUP(C107,KATILIM!$A$4:$G$301,6,0),0)","v":0},null,null,"E35",35,{"$f":"OFFSET(#REF!,M107,#REF!)","v":{"$error":"#REF!"}},{"$f":"IFERROR(VLOOKUP(N107,KATILIM!$A$4:$Z$301,26,0),0)","v":0},{"$f":"IFERROR(VLOOKUP(N107,KATILIM!$A$4:$G$301,6,0),0)","v":0}]
["35.35",null,null,null,{"$f":"IFERROR(VLOOKUP(C108,KATILIM!$A$4:$Z$301,26,0),0)","v":0},{"$f":"BA39","v":0},null,null,{"$f":"IFERROR(VLOOKUP(C108,KATILIM!$A$4:$G$301,6,0),0)","v":0}]
[]
[36,"E36",null,null,{"$f":"IFERROR(VLOOKUP(C110,KATILIM!$A$4:$Z$301,26,0),0)","v":0},{"$f":"AZ40","v":0},{"$f":"IF(AND(F110=0,F111=0),\"\",IF(F110>F111,E110,E111))","v":""},null,{"$f":"IFERROR(VLOOKUP(C110,KATILIM!$A$4:$G$301,6,0),0)","v":0},null,null,"E36",36,{"$f":"OFFSET(#REF!,M110,#REF!)","v":{"$error":"#REF!"}},{"$f":"IFERROR(VLOOKUP(N110,KATILIM!$A$4:$Z$301,26,0),0)","v":0},{"$f":"IFERROR(VLOOKUP(N110,KATILIM!$A$4:$G$301,6,0),0)","v":0}]
["36.36",null,null,null,{"$f":"IFERROR(VLOOKUP(C111,KATILIM!$A$4:$Z$301,26,0),0)","v":0},{"$f":"BA40","v":0},null,null,{"$f":"IFERROR(VLOOKUP(C111,KATILIM!$A$4:$G$301,6,0),0)","v":0}]
[]
[37,"E37",null,null,{"$f":"IFERROR(VLOOKUP(C113,KATILIM!$A$4:$Z$301,26,0),0)","v":0},{"$f":"AZ41","v":0},{"$f":"IF(AND(F113=0,F114=0),\"\",IF(F113>F114,E113,E114))","v":""},null,{"$f":"IFERROR(VLOOKUP(C113,KATILIM!$A$4:$G$301,6,0),0)","v":0},null,null,"E37",37,{"$f":"OFFSET(#REF!,M113,#REF!)","v":{"$error":"#REF!"}},{"$f":"IFERROR(VLOOKUP(N113,KATILIM!$A$4:$Z$301,26,0),0)","v":0},{"$f":"IFERROR(VLOOKUP(N113,KATILIM!$A$4:$G$301,6,0),0)","v":0}]
["37.37",null,null,null,{"$f":"IFERROR(VLOOKUP(C114,KATILIM!$A$4:$Z$301,26,0),0)","v":0},{"$f":"BA41","v":0},null,null,{"$f":"IFERROR(VLOOKUP(C114,KATILIM!$A$4:$G$301,6,0),0)","v":0}]
[]
[38,"E38",null,null,{"$f":"IFERROR(VLOOKUP(C116,KATILIM!$A$4:$Z$301,26,0),0)","v":0},{"$f":"AZ42","v":0},{"$f":"IF(AND(F116=0,F117=0),\"\",IF(F116>F117,E116,E117))","v":""},null,{"$f":"IFERROR(VLOOKUP(C116,KATILIM!$A$4:$G$301,6,0),0)","v":0},null,null,"E38",38,{"$f":"OFFSET(#REF!,M116,#REF!)","v":{"$error":"#REF!"}},{"$f":"IFERROR(VLOOKUP(N116,KATILIM!$A$4:$Z$301,26,0),0)","v":0},{"$f":"IFERROR(VLOOKUP(N116,KATILIM!$A$4:$G$301,6,0),0)","v":0}]
["38.38",null,null,null,{"$f":"IFERROR(VLOOKUP(C117,KATILIM!$A$4:$Z$301,26,0),0)","v":0},{"$f":"BA42","v":0},null,null,{"$f":"IFERROR(VLOOKUP(C117,KATILIM!$A$4:$G$301,6,0),0)","v":0}]
[]
[39,"E39",null,null,{"$f":"IFERROR(VLOOKUP(C119,KATILIM!$A$4:$Z$301,26,0),0)","v":0},{"$f":"AZ43","v":0},{"$f":"IF(AND(F119=0,F120=0),\"\",IF(F119>F120,E119,E120))","v":""},null,{"$f":"IFERROR(VLOOKUP(C119,KATILIM!$A$4:$G$301,6,0),0)","v":0},null,null,"E39",39,{"$f":"OFFSET(#REF!,M119,#REF!)","v":{"$error":"#REF!"}},{"$f":"IFERROR(VLOOKUP(N119,KATILIM!$A$4:$Z$301,26,0),0)","v":0},{"$f":"IFERROR(VLOOKUP(N119,KATILIM!$A$4:$G$301,6,0),0)","v":0}]
["39.39",null,null,null,{"$f":"IFERROR(VLOOKUP(C120,KATILIM!$A$4:$Z$301,26,0),0)","v":0},{"$f":"BA43","v":0},null,null,{"$f":"IFERROR(VLOOKUP(C120,KATILIM!$A$4:$G$301,6,0),0)","v":0}]
[]
[40,"E40",null,null,{"$f":"IFERROR(VLOOKUP(C122,KATILIM!$A$4:$Z$301,26,0),0)","v":0},{"$f":"AZ44","v":0},{"$f":"IF(AND(F122=0,F123=0),\"\",IF(F122>F123,E122,E123))","v":""},null,{"$f":"IFERROR(VLOOKUP(C122,KATILIM!$A$4:$G$301,6,0),0)","v":0},null,null,"E40",40,{"$f":"OFFSET(#REF!,M122,#REF!)","v":{"$error":"#REF!"}},{"$f":"IFERROR(VLOOKUP(N122,KATILIM!$A$4:$Z$301,26,0),0)","v":0},{"$f":"IFERROR(VLOOKUP(N122,KATILIM!$A$4:$G$301,6,0),0)","v":0}]
["40.40",null,null,null,{"$f":"IFERROR(VLOOKUP(C123,KATILIM!$A$4:$Z$301,26,0),0)","v":0},{"$f":"BA44","v":0},null,null,{"$f":"IFERROR(VLOOKUP(C123,KATILIM!$A$4:$G$301,6,0),0)","v":0}]
[]
[41,"E41",null,null,{"$f":"IFERROR(VLOOKUP(C125,KATILIM!$A$4:$Z$301,26,0),0)","v":0},{"$f":"AZ45","v":0},{"$f":"IF(AND(F125=0,F126=0),\"\",IF(F125>F126,E125,E126))","v":""},null,{"$f":"IFERROR(VLOOKUP(C125,KATILIM!$A$4:$G$301,6,0),0)","v":0},null,null,"E41",41,{"$f":"OFFSET(#REF!,M125,#REF!)","v":{"$error":"#REF!"}},{"$f":"IFERROR(VLOOKUP(N125,KATILIM!$A$4:$Z$301,26,0),0)","v":0},{"$f":"IFERROR(VLOOKUP(N125,KATILIM!$A$4:$G$301,6,0),0)","v":0}]
["41.41",null,null,null,{"$f":"IFERROR(VLOOKUP(C126,KATILIM!$A$4:$Z$301,26,0),0)","v":0},{"$f":"BA45","v":0},null,null,{"$f":"IFERROR(VLOOKUP(C126,KATILIM!$A$4:$G$301,6,0),0)","v":0}]
[]
[42,"E42",null,null,{"$f":"IFERROR(VLOOKUP(C128,KATILIM!$A$4:$Z$301,26,0),0)","v":0},{"$f":"AZ46","v":0},{"$f":"IF(AND(F128=0,F129=0),\"\",IF(F128>F129,E128,E129))","v":""},null,{"$f":"IFERROR(VLOOKUP(C128,KATILIM!$A$4:$G$301,6,0),0)","v":0},null,null,"E42",42,{"$f":"OFFSET(#REF!,M128,#REF!)","v":{"$error":"#REF!"}},{"$f":"IFERROR(VLOOKUP(N128,KATILIM!$A$4:$Z$301,26,0),0)","v":0},{"$f":"IFERROR(VLOOKUP(N128,KATILIM!$A$4:$G$301,6,0),0)","v":0}]
["42.42",null,null,null,{"$f":"IFERROR(VLOOKUP(C129,KATILIM!$A$4:$Z$301,26,0),0)","v":0},{"$f":"BA46","v":0},null,null,{"$f":"IFERROR(VLOOKUP(C129,KATILIM!$A$4:$G$301,6,0),0)","v":0}]
[]
[43,"E43",null,null,{"$f":"IFERROR(VLOOKUP(C131,KATILIM!$A$4:$Z$301,26,0),0)","v":0},{"$f":"AZ47","v":0},{"$f":"IF(AND(F131=0,F132=0),\"\",IF(F131>F132,E131,E132))","v":""},null,{"$f":"IFERROR(VLOOKUP(C131,KATILIM!$A$4:$G$301,6,0),0)","v":0},null,null,"E43",43,{"$f":"OFFSET(#REF!,M131,#REF!)","v":{"$error":"#REF!"}},{"$f":"IFERROR(VLOOKUP(N131,KATILIM!$A$4:$Z$301,26,0),0)","v":0},{"$f":"IFERROR(VLOOKUP(N131,KATILIM!$A$4:$G$301,6,0),0)","v":0}]
["43.43",null,null,null,{"$f":"IFERROR(VLOOKUP(C132,KATILIM!$A$4:$Z$301,26,0),0)","v":0},{"$f":"BA47","v":0},null,null,{"$f":"IFERROR(VLOOKUP(C132,KATILIM!$A$4:$G$301,6,0),0)","v":0}]
[]
[44,"E44",null,null,{"$f":"IFERROR(VLOOKUP(C134,KATILIM!$A$4:$Z$301,26,0),0)","v":0},{"$f":"AZ48","v":0},{"$f":"IF(AND(F134=0,F135=0),\"\",IF(F134>F135,E134,E135))","v":""},null,{"$f":"IFERROR(VLOOKUP(C134,KATILIM!$A$4:$G$301,6,0),0)","v":0},null,null,"E44",44,{"$f":"OFFSET(#REF!,M134,#REF!)","v":{"$error":"#REF!"}},{"$f":"IFERROR(VLOOKUP(N134,KATILIM!$A$4:$Z$301,26,0),0)","v":0},{"$f":"IFERROR(VLOOKUP(N134,KATILIM!$A$4:$G$301,6,0),0)","v":0}]
["44.44",null,null,null,{"$f":"IFERROR(VLOOKUP(C135,KATILIM!$A$4:$Z$301,26,0),0)","v":0},{"$f":"BA48","v":0},null,null,{"$f":"IFERROR(VLOOKUP(C135,KATILIM!$A$4:$G$301,6,0),0)","v":0}]
[]
[45,"E45",null,null,{"$f":"IFERROR(VLOOKUP(C137,KATILIM!$A$4:$Z$301,26,0),0)","v":0},{"$f":"AZ49","v":0},{"$f":"IF(AND(F137=0,F138=0),\"\",IF(F137>F138,E137,E138))","v":""},null,{"$f":"IFERROR(VLOOKUP(C137,KATILIM!$A$4:$G$301,6,0),0)","v":0},null,null,"E45",45,{"$f":"OFFSET(#REF!,M137,#REF!)","v":{"$error":"#REF!"}},{"$f":"IFERROR(VLOOKUP(N137,KATILIM!$A$4:$Z$301,26,0),0)","v":0},{"$f":"IFERROR(VLOOKUP(N137,KATILIM!$A$4:$G$301,6,0),0)","v":0}]
["45.45",null,null,null,{"$f":"IFERROR(VLOOKUP(C138,KATILIM!$A$4:$Z$301,26,0),0)","v":0},{"$f":"BA49","v":0},null,null,{"$f":"IFERROR(VLOOKUP(C138,KATILIM!$A$4:$G$301,6,0),0)","v":0}]
[]
[46,"E46",null,null,{"$f":"IFERROR(VLOOKUP(C140,KATILIM!$A$4:$Z$301,26,0),0)","v":0},{"$f":"AZ50","v":0},{"$f":"IF(AND(F140=0,F141=0),\"\",IF(F140>F141,E140,E141))","v":""},null,{"$f":"IFERROR(VLOOKUP(C140,KATILIM!$A$4:$G$301,6,0),0)","v":0},null,null,"E46",46,{"$f":"OFFSET(#REF!,M140,#REF!)","v":{"$error":"#REF!"}},{"$f":"IFERROR(VLOOKUP(N140,KATILIM!$A$4:$Z$301,26,0),0)","v":0},{"$f":"IFERROR(VLOOKUP(N140,KATILIM!$A$4:$G$301,6,0),0)","v":0}]
["46.46",null,null,null,{"$f":"IFERROR(VLOOKUP(C141,KATILIM!$A$4:$Z$301,26,0),0)","v":0},{"$f":"BA50","v":0},null,null,{"$f":"IFERROR(VLOOKUP(C141,KATILIM!$A$4:$G$301,6,0),0)","v":0}]
[]
[47,"E47",null,null,{"$f":"IFERROR(VLOOKUP(C143,KATILIM!$A$4:$Z$301,26,0),0)","v":0},{"$f":"AZ51","v":0},{"$f":"IF(AND(F143=0,F144=0),\"\",IF(F143>F144,E143,E144))","v":""},null,{"$f":"IFERROR(VLOOKUP(C143,KATILIM!$A$4:$G$301,6,0),0)","v":0},null,null,"E47",47,{"$f":"OFFSET(#REF!,M143,#REF!)","v":{"$error":"#REF!"}},{"$f":"IFERROR(VLOOKUP(N143,KATILIM!$A$4:$Z$301,26,0),0)","v":0},{"$f":"IFERROR(VLOOKUP(N143,KATILIM!$A$4:$G$301,6,0),0)","v":0}]
["47.47",null,null,null,{"$f":"IFERROR(VLOOKUP(C144,KATILIM!$A$4:$Z$301,26,0),0)","v":0},{"$f":"BA51","v":0},null,null,{"$f":"IFERROR(VLOOKUP(C144,KATILIM!$A$4:$G$301,6,0),0)","v":0}]
[]
[48,"E48",null,null,{"$f":"IFERROR(VLOOKUP(C146,KATILIM!$A$4:$Z$301,26,0),0)","v":0},{"$f":"AZ52","v":0},{"$f":"IF(AND(F146=0,F147=0),\"\",IF(F146>F147,E146,E147))","v":""},null,{"$f":"IFERROR(VLOOKUP(C146,KATILIM!$A$4:$G$301,6,0),0)","v":0},null,null,"E48",48,{"$f":"OFFSET(#REF!,M146,#REF!)","v":{"$error":"#REF!"}},{"$f":"IFERROR(VLOOKUP(N146,KATILIM!$A$4:$Z$301,26,0),0)","v":0},{"$f":"IFERROR(VLOOKUP(N146,KATILIM!$A$4:$G$301,6,0),0)","v":0}]
["48.48",null,null,null,{"$f":"IFERROR(VLOOKUP(C147,KATILIM!$A$4:$Z$301,26,0),0)","v":0},{"$f":"BA52","v":0},null,null,{"$f":"IFERROR(VLOOKUP(C147,KATILIM!$A$4:$G$301,6,0),0)","v":0}]
[]
[49,"E49",null,null,{"$f":"IFERROR(VLOOKUP(C149,KATILIM!$A$4:$Z$301,26,0),0)","v":0},{"$f":"AZ53","v":0},{"$f":"IF(AND(F149=0,F150=0),\"\",IF(F149>F150,E149,E150))","v":""},null,{"$f":"IFERROR(VLOOKUP(C149,KATILIM!$A$4:$G$301,6,0),0)","v":0},null,null,"E49",49,{"$f":"OFFSET(#REF!,M149,#REF!)","v":{"$error":"#REF!"}},{"$f":"IFERROR(VLOOKUP(N149,KATILIM!$A$4:$Z$301,26,0),0)","v":0},{"$f":"IFERROR(VLOOKUP(N149,KATILIM!$A$4:$G$301,6,0),0)","v":0}]
["49.49",null,null,null,{"$f":"IFERROR(VLOOKUP(C150,KATILIM!$A$4:$Z$301,26,0),0)","v":0},{"$f":"BA53","v":0},null,null,{"$f":"IFERROR(VLOOKUP(C150,KATILIM!$A$4:$G$301,6,0),0)","v":0}]
[]
[50,"E50",null,null,{"$f":"IFERROR(VLOOKUP(C152,KATILIM!$A$4:$Z$301,26,0),0)","v":0},{"$f":"AZ54","v":0},{"$f":"IF(AND(F152=0,F153=0),\"\",IF(F152>F153,E152,E153))","v":""},null,{"$f":"IFERROR(VLOOKUP(C152,KATILIM!$A$4:$G$301,6,0),0)","v":0},null,null,"E50",50,{"$f":"OFFSET(#REF!,M152,#REF!)","v":{"$error":"#REF!"}},{"$f":"IFERROR(VLOOKUP(N152,KATILIM!$A$4:$Z$301,26,0),0)","v":0},{"$f":"IFERROR(VLOOKUP(N152,KATILIM!$A$4:$G$301,6,0),0)","v":0}]
["50.50",null,null,null,{"$f":"IFERROR(VLOOKUP(C153,KATILIM!$A$4:$Z$301,26,0),0)","v":0},{"$f":"BA54","v":0},null,null,{"$f":"IFERROR(VLOOKUP(C153,KATILIM!$A$4:$G$301,6,0),0)","v":0}]
[]
[51,"E51",null,null,{"$f":"IFERROR(VLOOKUP(C155,KATILIM!$A$4:$Z$301,26,0),0)","v":0},{"$f":"AZ55","v":0},{"$f":"IF(AND(F155=0,F156=0),\"\",IF(F155>F156,E155,E156))","v":""},null,{"$f":"IFERROR(VLOOKUP(C155,KATILIM!$A$4:$G$301,6,0),0)","v":0},null,null,"E51",51,{"$f":"OFFSET(#REF!,M155,#REF!)","v":{"$error":"#REF!"}},{"$f":"IFERROR(VLOOKUP(N155,KATILIM!$A$4:$Z$301,26,0),0)","v":0},{"$f":"IFERROR(VLOOKUP(N155,KATILIM!$A$4:$G$301,6,0),0)","v":0}]
["51.51",null,null,null,{"$f":"IFERROR(VLOOKUP(C156,KATILIM!$A$4:$Z$301,26,0),0)","v":0},{"$f":"BA55","v":0},null,null,{"$f":"IFERROR(VLOOKUP(C156,KATILIM!$A$4:$G$301,6,0),0)","v":0}]
[]
[52,"E52",null,null,{"$f":"IFERROR(VLOOKUP(C158,KATILIM!$A$4:$Z$301,26,0),0)","v":0},{"$f":"AZ56","v":0},{"$f":"IF(AND(F158=0,F159=0),\"\",IF(F158>F159,E158,E159))","v":""},null,{"$f":"IFERROR(VLOOKUP(C158,KATILIM!$A$4:$G$301,6,0),0)","v":0},null,null,"E52",52,{"$f":"OFFSET(#REF!,M158,#REF!)","v":{"$error":"#REF!"}},{"$f":"IFERROR(VLOOKUP(N158,KATILIM!$A$4:$Z$301,26,0),0)","v":0},{"$f":"IFERROR(VLOOKUP(N158,KATILIM!$A$4:$G$301,6,0),0)","v":0}]
["52.52",null,null,null,{"$f":"IFERROR(VLOOKUP(C159,KATILIM!$A$4:$Z$301,26,0),0)","v":0},{"$f":"BA56","v":0},null,null,{"$f":"IFERROR(VLOOKUP(C159,KATILIM!$A$4:$G$301,6,0),0)","v":0}]
[]
[53,"E53",null,null,{"$f":"IFERROR(VLOOKUP(C161,KATILIM!$A$4:$Z$301,26,0),0)","v":0},{"$f":"AZ57","v":0},{"$f":"IF(AND(F161=0,F162=0),\"\",IF(F161>F162,E161,E162))","v":""},null,{"$f":"IFERROR(VLOOKUP(C161,KATILIM!$A$4:$G$301,6,0),0)","v":0},null,null,"E53",53,{"$f":"OFFSET(#REF!,M161,#REF!)","v":{"$error":"#REF!"}},{"$f":"IFERROR(VLOOKUP(N161,KATILIM!$A$4:$Z$301,26,0),0)","v":0},{"$f":"IFERROR(VLOOKUP(N161,KATILIM!$A$4:$G$301,6,0),0)","v":0}]
["53.53",null,null,null,{"$f":"IFERROR(VLOOKUP(C162,KATILIM!$A$4:$Z$301,26,0),0)","v":0},{"$f":"BA57","v":0},null,null,{"$f":"IFERROR(VLOOKUP(C162,KATILIM!$A$4:$G$301,6,0),0)","v":0}]
[]
[54,"E54",null,null,{"$f":"IFERROR(VLOOKUP(C164,KATILIM!$A$4:$Z$301,26,0),0)","v":0},{"$f":"AZ58","v":0},{"$f":"IF(AND(F164=0,F165=0),\"\",IF(F164>F165,E164,E165))","v":""},null,{"$f":"IFERROR(VLOOKUP(C164,KATILIM!$A$4:$G$301,6,0),0)","v":0},null,null,"E54",54,{"$f":"OFFSET(#REF!,M164,#REF!)","v":{"$error":"#REF!"}},{"$f":"IFERROR(VLOOKUP(N164,KATILIM!$A$4:$Z$301,26,0),0)","v":0},{"$f":"IFERROR(VLOOKUP(N164,KATILIM!$A$4:$G$301,6,0),0)","v":0}]
["54.54",null,null,null,{"$f":"IFERROR(VLOOKUP(C165,KATILIM!$A$4:$Z$301,26,0),0)","v":0},{"$f":"BA58","v":0},null,null,{"$f":"IFERROR(VLOOKUP(C165,KATILIM!$A$4:$G$301,6,0),0)","v":0}]
[]
[55,"E55",null,null,{"$f":"IFERROR(VLOOKUP(C167,KATILIM!$A$4:$Z$301,26,0),0)","v":0},{"$f":"AZ59","v":0},{"$f":"IF(AND(F167=0,F168=0),\"\",IF(F167>F168,E167,E168))","v":""},null,{"$f":"IFERROR(VLOOKUP(C167,KATILIM!$A$4:$G$301,6,0),0)","v":0},null,null,"E55",55,{"$f":"OFFSET(#REF!,M167,#REF!)","v":{"$error":"#REF!"}},{"$f":"IFERROR(VLOOKUP(N167,KATILIM!$A$4:$Z$301,26,0),0)","v":0},{"$f":"IFERROR(VLOOKUP(N167,KATILIM!$A$4:$G$301,6,0),0)","v":0}]
["55.55",null,null,null,{"$f":"IFERROR(VLOOKUP(C168,KATILIM!$A$4:$Z$301,26,0),0)","v":0},{"$f":"BA59","v":0},null,null,{"$f":"IFERROR(VLOOKUP(C168,KATILIM!$A$4:$G$301,6,0),0)","v":0}]
[]
[56,"E56",null,null,{"$f":"IFERROR(VLOOKUP(C170,KATILIM!$A$4:$Z$301,26,0),0)","v":0},{"$f":"AZ60","v":0},{"$f":"IF(AND(F170=0,F171=0),\"\",IF(F170>F171,E170,E171))","v":""},null,{"$f":"IFERROR(VLOOKUP(C170,KATILIM!$A$4:$G$301,6,0),0)","v":0},null,null,"E56",56,{"$f":"OFFSET(#REF!,M170,#REF!)","v":{"$error":"#REF!"}},{"$f":"IFERROR(VLOOKUP(N170,KATILIM!$A$4:$Z$301,26,0),0)","v":0},{"$f":"IFERROR(VLOOKUP(N170,KATILIM!$A$4:$G$301,6,0),0)","v":0}]
["56.56",null,null,null,{"$f":"IFERROR(VLOOKUP(C171,KATILIM!$A$4:$Z$301,26,0),0)","v":0},{"$f":"BA60","v":0},null,null,{"$f":"IFERROR(VLOOKUP(C171,KATILIM!$A$4:$G$301,6,0),0)","v":0}]
[]
[57,"E57",null,null,{"$f":"IFERROR(VLOOKUP(C173,KATILIM!$A$4:$Z$301,26,0),0)","v":0},{"$f":"AZ61","v":0},{"$f":"IF(AND(F173=0,F174=0),\"\",IF(F173>F174,E173,E174))","v":""},null,{"$f":"IFERROR(VLOOKUP(C173,KATILIM!$A$4:$G$301,6,0),0)","v":0},null,null,"E57",57,{"$f":"OFFSET(#REF!,M173,#REF!)","v":{"$error":"#REF!"}},{"$f":"IFERROR(VLOOKUP(N173,KATILIM!$A$4:$Z$301,26,0),0)","v":0},{"$f":"IFERROR(VLOOKUP(N173,KATILIM!$A$4:$G$301,6,0),0)","v":0}]
["57.57",null,null,null,{"$f":"IFERROR(VLOOKUP(C174,KATILIM!$A$4:$Z$301,26,0),0)","v":0},{"$f":"BA61","v":0},null,null,{"$f":"IFERROR(VLOOKUP(C174,KATILIM!$A$4:$G$301,6,0),0)","v":0}]
[]
[58,"E58",null,null,{"$f":"IFERROR(VLOOKUP(C176,KATILIM!$A$4:$Z$301,26,0),0)","v":0},{"$f":"AZ62","v":0},{"$f":"IF(AND(F176=0,F177=0),\"\",IF(F176>F177,E176,E177))","v":""},null,{"$f":"IFERROR(VLOOKUP(C176,KATILIM!$A$4:$G$301,6,0),0)","v":0},null,null,"E58",58,{"$f":"OFFSET(#REF!,M176,#REF!)","v":{"$error":"#REF!"}},{"$f":"IFERROR(VLOOKUP(N176,KATILIM!$A$4:$Z$301,26,0),0)","v":0},{"$f":"IFERROR(VLOOKUP(N176,KATILIM!$A$4:$G$301,6,0),0)","v":0}]
["58.58",null,null,null,{"$f":"IFERROR(VLOOKUP(C177,KATILIM!$A$4:$Z$301,26,0),0)","v":0},{"$f":"BA62","v":0},null,null,{"$f":"IFERROR(VLOOKUP(C177,KATILIM!$A$4:$G$301,6,0),0)","v":0}]
[]
[59,"E59",null,null,{"$f":"IFERROR(VLOOKUP(C179,KATILIM!$A$4:$Z$301,26,0),0)","v":0},{"$f":"AZ63","v":0},{"$f":"IF(AND(F179=0,F180=0),\"\",IF(F179>F180,E179,E180))","v":""},null,{"$f":"IFERROR(VLOOKUP(C179,KATILIM!$A$4:$G$301,6,0),0)","v":0},null,null,"E59",59,{"$f":"OFFSET(#REF!,M179,#REF!)","v":{"$error":"#REF!"}},{"$f":"IFERROR(VLOOKUP(N179,KATILIM!$A$4:$Z$301,26,0),0)","v":0},{"$f":"IFERROR(VLOOKUP(N179,KATILIM!$A$4:$G$301,6,0),0)","v":0}]
["59.59",null,null,null,{"$f":"IFERROR(VLOOKUP(C180,KATILIM!$A$4:$Z$301,26,0),0)","v":0},{"$f":"BA63","v":0},null,null,{"$f":"IFERROR(VLOOKUP(C180,KATILIM!$A$4:$G$301,6,0),0)","v":0}]
[]
[60,"E60",null,null,{"$f":"IFERROR(VLOOKUP(C182,KATILIM!$A$4:$Z$301,26,0),0)","v":0},{"$f":"AZ64","v":0},{"$f":"IF(AND(F182=0,F183=0),\"\",IF(F182>F183,E182,E183))","v":""},null,{"$f":"IFERROR(VLOOKUP(C182,KATILIM!$A$4:$G$301,6,0),0)","v":0},null,null,"E60",60,{"$f":"OFFSET(#REF!,M182,#REF!)","v":{"$error":"#REF!"}},{"$f":"IFERROR(VLOOKUP(N182,KATILIM!$A$4:$Z$301,26,0),0)","v":0},{"$f":"IFERROR(VLOOKUP(N182,KATILIM!$A$4:$G$301,6,0),0)","v":0}]
["60.60",null,null,null,{"$f":"IFERROR(VLOOKUP(C183,KATILIM!$A$4:$Z$301,26,0),0)","v":0},{"$f":"BA64","v":0},null,null,{"$f":"IFERROR(VLOOKUP(C183,KATILIM!$A$4:$G$301,6,0),0)","v":0}]
[]
[61,"E61",null,null,{"$f":"IFERROR(VLOOKUP(C185,KATILIM!$A$4:$Z$301,26,0),0)","v":0},{"$f":"AZ65","v":0},{"$f":"IF(AND(F185=0,F186=0),\"\",IF(F185>F186,E185,E186))","v":""},null,{"$f":"IFERROR(VLOOKUP(C185,KATILIM!$A$4:$G$301,6,0),0)","v":0},null,null,"E61",61,{"$f":"OFFSET(#REF!,M185,#REF!)","v":{"$error":"#REF!"}},{"$f":"IFERROR(VLOOKUP(N185,KATILIM!$A$4:$Z$301,26,0),0)","v":0},{"$f":"IFERROR(VLOOKUP(N185,KATILIM!$A$4:$G$301,6,0),0)","v":0}]
["61.61",null,null,null,{"$f":"IFERROR(VLOOKUP(C186,KATILIM!$A$4:$Z$301,26,0),0)","v":0},{"$f":"BA65","v":0},null,null,{"$f":"IFERROR(VLOOKUP(C186,KATILIM!$A$4:$G$301,6,0),0)","v":0}]
[]
[62,"E62",null,null,{"$f":"IFERROR(VLOOKUP(C188,KATILIM!$A$4:$Z$301,26,0),0)","v":0},{"$f":"AZ66","v":0},{"$f":"IF(AND(F188=0,F189=0),\"\",IF(F188>F189,E188,E189))","v":""},null,{"$f":"IFERROR(VLOOKUP(C188,KATILIM!$A$4:$G$301,6,0),0)","v":0},null,null,"E62",62,{"$f":"OFFSET(#REF!,M188,#REF!)","v":{"$error":"#REF!"}},{"$f":"IFERROR(VLOOKUP(N188,KATILIM!$A$4:$Z$301,26,0),0)","v":0},{"$f":"IFERROR(VLOOKUP(N188,KATILIM!$A$4:$G$301,6,0),0)","v":0}]
["62.62",null,null,null,{"$f":"IFERROR(VLOOKUP(C189,KATILIM!$A$4:$Z$301,26,0),0)","v":0},{"$f":"BA66","v":0},null,null,{"$f":"IFERROR(VLOOKUP(C189,KATILIM!$A$4:$G$301,6,0),0)","v":0}]
[]
[63,"E63",null,null,{"$f":"IFERROR(VLOOKUP(C191,KATILIM!$A$4:$Z$301,26,0),0)","v":0},{"$f":"AZ67","v":0},{"$f":"IF(AND(F191=0,F192=0),\"\",IF(F191>F192,E191,E192))","v":""},null,{"$f":"IFERROR(VLOOKUP(C191,KATILIM!$A$4:$G$301,6,0),0)","v":0},null,null,"E63",63,{"$f":"OFFSET(#REF!,M191,#REF!)","v":{"$error":"#REF!"}},{"$f":"IFERROR(VLOOKUP(N191,KATILIM!$A$4:$Z$301,26,0),0)","v":0},{"$f":"IFERROR(VLOOKUP(N191,KATILIM!$A$4:$G$301,6,0),0)","v":0}]
["63.63",null,null,null,{"$f":"IFERROR(VLOOKUP(C192,KATILIM!$A$4:$Z$301,26,0),0)","v":0},{"$f":"BA67","v":0},null,null,{"$f":"IFERROR(VLOOKUP(C192,KATILIM!$A$4:$G$301,6,0),0)","v":0}]
[]
[64,"E64",null,null,{"$f":"IFERROR(VLOOKUP(C194,KATILIM!$A$4:$Z$301,26,0),0)","v":0},{"$f":"AZ68","v":0},{"$f":"IF(AND(F194=0,F195=0),\"\",IF(F194>F195,E194,E195))","v":""},null,{"$f":"IFERROR(VLOOKUP(C194,KATILIM!$A$4:$G$301,6,0),0)","v":0},null,null,"E64",64,{"$f":"OFFSET(#REF!,M194,#REF!)","v":{"$error":"#REF!"}},{"$f":"IFERROR(VLOOKUP(N194,KATILIM!$A$4:$Z$301,26,0),0)","v":0},{"$f":"IFERROR(VLOOKUP(N194,KATILIM!$A$4:$G$301,6,0),0)","v":0}]
["64.64",null,null,null,{"$f":"IFERROR(VLOOKUP(C195,KATILIM!$A$4:$Z$301,26,0),0)","v":0},{"$f":"BA68","v":0},null,null,{"$f":"IFERROR(VLOOKUP(C195,KATILIM!$A$4:$G$301,6,0),0)","v":0}]

{"sheet":"ERKEK ELEME","index":3,"n_rows":769,"n_cols":54,"rows_kept":769,"cut":false,"hidden":false,"merged":[[189,26,189,28],[190,12,190,18],[191,5,191,11],[192,5,192,11],[192,19,192,25],[0,0,0,28],[1,0,1,28],[187,12,187,18],[188,5,188,11],[189,5,189,11],[182,5,182,11],[183,5,183,11],[184,12,184,18],[185,5,185,11],[169,12,169,18],[170,5,170,11],[164,5,164,11],[165,5,165,11],[165,26,165,28],[166,12,166,18],[167,5,167,11],[177,26,177,28],[171,5,171,11],[172,12,172,18],[193,12,193,18],[194,5,194,11],[185,19,185,25],[179,5,179,11],[180,5,180,11],[180,19,180,25],[181,12,181,18],[175,12,175,18],[176,5,176,11],[177,5,177,11],[186,5,186,11],[178,12,178,18],[173,5,173,11],[173,19,173,25],[174,5,174,11],[161,5,161,11],[161,19,161,25],[162,5,162,11],[163,12,163,18],[157,12,157,18],[158,5,158,11],[159,5,159,11],[160,12,160,18],[168,5,168,11],[168,19,168,25],[153,26,153,28],[154,12,154,18],[155,5,155,11],[156,5,156,11],[156,19,156,25],[150,5,150,11],[151,12,151,18],[152,5,152,11],[153,5,153,11],[146,5,146,11],[147,5,147,11],[148,12,148,18],[149,5,149,11],[149,19,149,25],[143,5,143,11],[144,5,144,11],[144,19,144,25],[145,12,145,18],[129,26,129,28],[130,12,130,18],[131,5,131,11],[139,12,139,18],[140,5,140,11],[141,5,141,11],[141,26,141,28],[142,12,142,18],[135,5,135,11],[136,12,136,18],[137,5,137,11],[137,19,137,25],[138,5,138,11],[127,12,127,18],[121,12,121,18],[122,5,122,11],[123,5,123,11],[124,12,124,18],[132,5,132,11],[132,19,132,25],[133,12,133,18],[134,5,134,11],[128,5,128,11],[129,5,129,11],[120,5,120,11],[120,19,120,25],[114,5,114,11],[115,12,115,18],[116,5,116,11],[117,5,117,11],[125,5,125,11],[125,19,125,25],[126,5,126,11],[113,5,113,11],[113,19,113,25],[107,5,107,11],[108,5,108,11],[108,19,108,25],[109,12,109,18],[117,26,117,28],[118,12,118,18],[119,5,119,11],[106,12,106,18],[99,5,99,11],[100,12,100,18],[101,5,101,11],[101,19,101,25],[102,5,102,11],[110,5,110,11],[111,5,111,11],[112,12,112,18],[98,5,98,11],[92,5,92,11],[93,5,93,11],[93,26,93,28],[94,12,94,18],[95,5,95,11],[103,12,103,18],[104,5,104,11],[105,5,105,11],[105,26,105,28],[90,5,90,11],[91,12,91,18],[85,12,85,18],[86,5,86,11],[87,5,87,11],[88,12,88,18],[96,5,96,11],[96,19,96,25],[97,12,97,18],[82,12,82,18],[83,5,83,11],[84,5,84,11],[84,19,84,25],[78,5,78,11],[79,12,79,18],[80,5,80,11],[81,5,81,11],[89,5,89,11],[89,19,89,25],[75,5,75,11],[76,12,76,18],[77,5,77,11],[77,19,77,25],[71,5,71,11],[72,5,72,11],[72,19,72,25],[73,12,73,18],[81,26,81,28],[69,5,69,11],[69,26,69,28],[70,12,70,18],[63,5,63,11],[64,12,64,18],[65,5,65,11],[65,19,65,25],[66,5,66,11],[74,5,74,11],[61,12,61,18],[62,5,62,11],[56,5,56,11],[57,5,57,11],[57,26,57,28],[58,12,58,18],[59,5,59,11],[67,12,67,18],[68,5,68,11],[53,5,53,11],[53,19,53,25],[54,5,54,11],[55,12,55,18],[49,12,49,18],[50,5,50,11],[51,5,51,11],[52,12,52,18],[60,5,60,11],[60,19,60,25],[45,26,45,28],[46,12,46,18],[47,5,47,11],[48,5,48,11],[48,19,48,25],[42,5,42,11],[43,12,43,18],[44,5,44,11],[45,5,45,11],[38,5,38,11],[39,5,39,11],[40,12,40,18],[41,5,41,11],[41,19,41,25],[35,5,35,11],[36,5,36,11],[36,19,36,25],[37,12,37,18],[32,5,32,11],[33,5,33,11],[33,26,33,28],[34,12,34,18],[27,5,27,11],[28,12,28,18],[29,5,29,11],[29,19,29,25],[30,5,30,11],[24,19,24,25],[25,12,25,18],[26,5,26,11],[20,5,20,11],[21,5,21,11],[21,26,21,28],[22,12,22,18],[23,5,23,11],[31,12,31,18],[3,5,3,11],[4,12,4,18],[5,5,5,11],[9,5,9,11],[9,26,9,28],[10,12,10,18],[11,5,11,11],[195,5,195,11],[197,5,197,11],[12,5,12,11],[12,19,12,25],[5,19,5,25],[6,5,6,11],[7,12,7,18],[8,5,8,11],[17,5,17,11],[17,19,17,25],[18,5,18,11],[19,12,19,18],[13,12,13,18],[14,5,14,11],[15,5,15,11],[16,12,16,18],[24,5,24,11],[198,5,198,11],[200,5,200,11],[201,5,201,11],[203,5,203,11],[204,5,204,11],[206,5,206,11],[207,5,207,11],[209,5,209,11],[210,5,210,11],[212,5,212,11],[213,5,213,11],[215,5,215,11],[216,5,216,11],[218,5,218,11],[219,5,219,11],[221,5,221,11],[222,5,222,11],[224,5,224,11],[225,5,225,11],[227,5,227,11],[228,5,228,11],[230,5,230,11],[231,5,231,11],[233,5,233,11],[234,5,234,11],[236,5,236,11],[237,5,237,11],[239,5,239,11],[240,5,240,11],[242,5,242,11],[243,5,243,11],[245,5,245,11],[246,5,246,11],[248,5,248,11],[249,5,249,11],[251,5,251,11],[252,5,252,11],[254,5,254,11],[255,5,255,11],[257,5,257,11],[258,5,258,11],[260,5,260,11],[261,5,261,11],[263,5,263,11],[264,5,264,11],[266,5,266,11],[267,5,267,11],[269,5,269,11],[270,5,270,11],[272,5,272,11],[273,5,273,11],[275,5,275,11],[276,5,276,11],[278,5,278,11],[279,5,279,11],[281,5,281,11],[282,5,282,11],[284,5,284,11],[285,5,285,11],[287,5,287,11],[288,5,288,11],[290,5,290,11],[291,5,291,11],[293,5,293,11],[294,5,294,11],[296,5,296,11],[297,5,297,11],[299,5,299,11],[300,5,300,11],[302,5,302,11],[303,5,303,11],[305,5,305,11],[306,5,306,11],[308,5,308,11],[309,5,309,11],[311,5,311,11],[312,5,312,11],[314,5,314,11],[315,5,315,11],[317,5,317,11],[318,5,318,11],[320,5,320,11],[321,5,321,11],[323,5,323,11],[324,5,324,11],[326,5,326,11],[327,5,327,11],[329,5,329,11],[330,5,330,11],[332,5,332,11],[333,5,333,11],[335,5,335,11],[336,5,336,11],[338,5,338,11],[339,5,339,11],[341,5,341,11],[342,5,342,11],[359,5,359,11],[360,5,360,11],[368,5,368,11],[369,5,369,11],[344,5,344,11],[345,5,345,11],[347,5,347,11],[348,5,348,11],[350,5,350,11],[351,5,351,11],[353,5,353,11],[354,5,354,11],[356,5,356,11],[201,26,201,28],[202,12,202,18],[204,19,204,25],[205,12,205,18],[208,12,208,18],[209,19,209,25],[211,12,211,18],[213,26,213,28],[214,12,214,18],[216,19,216,25],[217,12,217,18],[220,12,220,18],[221,19,221,25],[223,12,223,18],[384,5,384,11],[386,5,386,11],[196,12,196,18],[197,19,197,25],[199,12,199,18],[371,5,371,11],[372,5,372,11],[374,5,374,11],[375,5,375,11],[377,5,377,11],[378,5,378,11],[380,5,380,11],[381,5,381,11],[383,5,383,11],[357,5,357,11],[362,5,362,11],[363,5,363,11],[365,5,365,11],[366,5,366,11],[249,26,249,28],[233,19,233,25],[235,12,235,18],[237,26,237,28],[238,12,238,18],[240,19,240,25],[225,26,225,28],[226,12,226,18],[228,19,228,25],[229,12,229,18],[232,12,232,18],[250,12,250,18],[252,19,252,25],[253,12,253,18],[256,12,256,18],[257,19,257,25],[241,12,241,18],[244,12,244,18],[245,19,245,25],[247,12,247,18],[268,12,268,18],[269,19,269,25],[271,12,271,18],[273,26,273,28],[274,12,274,18],[259,12,259,18],[261,26,261,28],[262,12,262,18],[264,19,264,25],[265,12,265,18],[285,26,285,28],[286,12,286,18],[288,19,288,25],[289,12,289,18],[292,12,292,18],[276,19,276,25],[277,12,277,18],[280,12,280,18],[281,19,281,25],[283,12,283,18],[301,12,301,18],[304,12,304,18],[305,19,305,25],[307,12,307,18],[309,26,309,28],[293,19,293,25],[295,12,295,18],[297,26,297,28],[298,12,298,18],[300,19,300,25],[319,12,319,18],[321,26,321,28],[322,12,322,18],[324,19,324,25],[325,12,325,18],[310,12,310,18],[312,19,312,25],[313,12,313,18],[316,12,316,18],[317,19,317,25],[336,19,336,25],[337,12,337,18],[340,12,340,18],[341,19,341,25],[343,12,343,18],[328,12,328,18],[329,19,329,25],[331,12,331,18],[333,26,333,28],[334,12,334,18],[367,12,367,18],[369,26,369,28],[353,19,353,25],[355,12,355,18],[357,26,357,28],[358,12,358,18],[360,19,360,25],[345,26,345,28],[346,12,346,18],[348,19,348,25],[349,12,349,18],[352,12,352,18],[389,5,389,11],[390,12,390,18],[391,5,391,11],[391,19,391,25],[392,5,392,11],[393,12,393,18],[394,5,394,11],[395,5,395,11],[379,12,379,18],[381,26,381,28],[382,12,382,18],[384,19,384,25],[385,12,385,18],[370,12,370,18],[372,19,372,25],[373,12,373,18],[376,12,376,18],[377,19,377,25],[361,12,361,18],[364,12,364,18],[365,19,365,25],[395,26,395,28],[396,12,396,18],[397,5,397,11],[398,5,398,11],[398,19,398,25],[399,12,399,18],[400,5,400,11],[401,5,401,11],[402,12,402,18],[403,5,403,11],[403,19,403,25],[404,5,404,11],[405,12,405,18],[406,5,406,11],[407,5,407,11],[407,26,407,28],[408,12,408,18],[409,5,409,11],[410,5,410,11],[410,19,410,25],[411,12,411,18],[412,5,412,11],[413,5,413,11],[414,12,414,18],[415,5,415,11],[415,19,415,25],[416,5,416,11],[417,12,417,18],[418,5,418,11],[419,5,419,11],[419,26,419,28],[420,12,420,18],[421,5,421,11],[422,5,422,11],[422,19,422,25],[423,12,423,18],[424,5,424,11],[425,5,425,11],[426,12,426,18],[427,5,427,11],[427,19,427,25],[428,5,428,11],[429,12,429,18],[430,5,430,11],[431,5,431,11],[431,26,431,28],[432,12,432,18],[433,5,433,11],[434,5,434,11],[434,19,434,25],[435,12,435,18],[436,5,436,11],[437,5,437,11],[438,12,438,18],[439,5,439,11],[439,19,439,25],[440,5,440,11],[441,12,441,18],[442,5,442,11],[443,5,443,11],[443,26,443,28],[444,12,444,18],[445,5,445,11],[446,5,446,11],[446,19,446,25],[447,12,447,18],[448,5,448,11],[449,5,449,11],[450,12,450,18],[451,5,451,11],[451,19,451,25],[452,5,452,11],[453,12,453,18],[454,5,454,11],[455,5,455,11],[455,26,455,28],[456,12,456,18],[457,5,457,11],[458,5,458,11],[458,19,458,25],[459,12,459,18],[460,5,460,11],[461,5,461,11],[462,12,462,18],[463,5,463,11],[463,19,463,25],[464,5,464,11],[465,12,465,18],[466,5,466,11],[467,5,467,11],[467,26,467,28],[468,12,468,18],[469,5,469,11],[470,5,470,11],[470,19,470,25],[471,12,471,18],[472,5,472,11],[473,5,473,11],[474,12,474,18],[475,5,475,11],[475,19,475,25],[476,5,476,11],[477,12,477,18],[478,5,478,11],[479,5,479,11],[479,26,479,28],[480,12,480,18],[481,5,481,11],[482,5,482,11],[482,19,482,25],[483,12,483,18],[484,5,484,11],[485,5,485,11],[486,12,486,18],[487,5,487,11],[487,19,487,25],[488,5,488,11],[489,12,489,18],[490,5,490,11],[491,5,491,11],[491,26,491,28],[492,12,492,18],[493,5,493,11],[494,5,494,11],[494,19,494,25],[495,12,495,18],[496,5,496,11],[497,5,497,11],[498,12,498,18],[499,5,499,11],[499,19,499,25],[500,5,500,11],[501,12,501,18],[502,5,502,11],[503,5,503,11],[503,26,503,28],[504,12,504,18],[505,5,505,11],[506,5,506,11],[506,19,506,25],[507,12,507,18],[508,5,508,11],[509,5,509,11],[510,12,510,18],[511,5,511,11],[511,19,511,25],[512,5,512,11],[513,12,513,18],[514,5,514,11],[515,5,515,11],[515,26,515,28],[516,12,516,18],[517,5,517,11],[518,5,518,11],[518,19,518,25],[519,12,519,18],[520,5,520,11],[521,5,521,11],[522,12,522,18],[523,5,523,11],[523,19,523,25],[524,5,524,11],[525,12,525,18],[526,5,526,11],[527,5,527,11],[527,26,527,28],[528,12,528,18],[529,5,529,11],[530,5,530,11],[530,19,530,25],[531,12,531,18],[532,5,532,11],[533,5,533,11],[534,12,534,18],[535,5,535,11],[535,19,535,25],[536,5,536,11],[537,12,537,18],[538,5,538,11],[539,5,539,11],[539,26,539,28],[540,12,540,18],[541,5,541,11],[542,5,542,11],[542,19,542,25],[543,12,543,18],[544,5,544,11],[545,5,545,11],[546,12,546,18],[547,5,547,11],[547,19,547,25],[548,5,548,11],[549,12,549,18],[550,5,550,11],[551,5,551,11],[551,26,551,28],[552,12,552,18],[553,5,553,11],[554,5,554,11],[554,19,554,25],[555,12,555,18],[556,5,556,11],[570,12,570,18],[557,5,557,11],[558,12,558,18],[559,5,559,11],[559,19,559,25],[560,5,560,11],[561,12,561,18],[562,5,562,11],[563,5,563,11],[563,26,563,28],[575,26,575,28],[576,12,576,18],[577,5,577,11],[564,12,564,18],[565,5,565,11],[566,5,566,11],[566,19,566,25],[567,12,567,18],[568,5,568,11],[569,5,569,11],[578,5,578,11],[578,19,578,25],[579,12,579,18],[580,5,580,11],[571,5,571,11],[571,19,571,25],[572,5,572,11],[573,12,573,18],[574,5,574,11],[575,5,575,11],[607,5,607,11],[610,5,610,11],[609,5,609,11],[609,19,609,25],[611,12,611,18],[612,5,612,11],[601,5,601,11],[604,5,604,11],[601,26,601,28],[603,5,603,11],[604,19,604,25],[605,12,605,18],[606,5,606,11],[608,12,608,18],[620,12,620,18],[621,5,621,11],[621,19,621,25],[623,12,623,18],[624,5,624,11],[625,26,625,28],[626,12,626,18],[613,5,613,11],[616,5,616,11],[619,5,619,11],[613,26,613,28],[614,12,614,18],[615,5,615,11],[616,19,616,25],[617,12,617,18],[618,5,618,11],[627,5,627,11],[628,19,628,25],[629,12,629,18],[630,5,630,11],[632,12,632,18],[633,5,633,11],[633,19,633,25],[622,5,622,11],[625,5,625,11],[637,5,637,11],[640,5,640,11],[635,12,635,18],[636,5,636,11],[637,26,637,28],[638,12,638,18],[639,5,639,11],[640,19,640,25],[628,5,628,11],[631,5,631,11],[634,5,634,11],[648,5,648,11],[643,5,643,11],[646,5,646,11],[641,12,641,18],[642,5,642,11],[644,12,644,18],[645,5,645,11],[645,19,645,25],[647,12,647,18],[658,5,658,11],[661,5,661,11],[659,12,659,18],[660,5,660,11],[661,26,661,28],[662,12,662,18],[649,5,649,11],[652,5,652,11],[655,5,655,11],[664,5,664,11],[667,5,667,11],[663,5,663,11],[664,19,664,25],[665,12,665,18],[666,5,666,11],[668,12,668,18],[669,5,669,11],[669,19,669,25],[670,5,670,11],[673,5,673,11],[676,5,676,11],[671,12,671,18],[672,5,672,11],[673,26,673,28],[674,12,674,18],[675,5,675,11],[676,19,676,25],[684,5,684,11],[687,5,687,11],[690,5,690,11],[685,12,685,18],[688,12,688,18],[690,19,690,25],[683,5,683,11],[677,12,677,18],[678,5,678,11],[681,5,681,11],[682,12,682,18],[683,19,683,25],[704,5,704,11],[702,5,702,11],[700,12,700,18],[702,19,702,25],[703,12,703,18],[692,5,692,11],[695,5,695,11],[686,5,686,11],[689,5,689,11],[751,5,751,11],[752,5,752,11],[753,12,753,18],[754,5,754,11],[740,5,740,11],[741,12,741,18],[742,5,742,11],[743,5,743,11],[744,12,744,18],[745,5,745,11],[746,5,746,11],[747,12,747,18],[748,5,748,11],[749,5,749,11],[750,12,750,18],[733,5,733,11],[734,5,734,11],[735,12,735,18],[736,5,736,11],[737,5,737,11],[738,12,738,18],[739,5,739,11],[728,5,728,11],[731,5,731,11],[732,12,732,18],[727,12,727,18],[719,5,719,11],[722,5,722,11],[592,19,592,25],[593,12,593,18],[594,5,594,11],[596,12,596,18],[597,5,597,11],[597,19,597,25],[599,12,599,18],[600,5,600,11],[602,12,602,18],[592,5,592,11],[595,5,595,11],[598,5,598,11],[725,5,725,11],[720,5,720,11],[723,5,723,11],[719,19,719,25],[721,12,721,18],[724,12,724,18],[713,5,713,11],[716,5,716,11],[714,5,714,11],[588,5,588,11],[589,26,589,28],[590,12,590,18],[583,5,583,11],[591,5,591,11],[586,5,586,11],[589,5,589,11],[726,5,726,11],[726,19,726,25],[717,5,717,11],[712,12,712,18],[714,19,714,25],[715,12,715,18],[718,12,718,18],[707,5,707,11],[710,5,710,11],[705,5,705,11],[708,5,708,11],[711,5,711,11],[706,12,706,18],[707,19,707,25],[709,12,709,18],[698,5,698,11],[701,5,701,11],[733,19,733,25],[693,5,693,11],[696,5,696,11],[699,5,699,11],[691,12,691,18],[694,12,694,18],[695,19,695,25],[697,12,697,18],[649,26,649,28],[650,12,650,18],[651,5,651,11],[652,19,652,25],[653,12,653,18],[654,5,654,11],[656,12,656,18],[657,5,657,11],[657,19,657,25],[584,12,584,18],[585,5,585,11],[585,19,585,25],[587,12,587,18],[765,5,765,11],[766,5,766,11],[767,12,767,18],[768,5,768,11],[757,5,757,11],[758,12,758,18],[759,5,759,11],[759,19,759,25],[760,5,760,11],[761,12,761,18],[762,5,762,11],[763,5,763,11],[764,12,764,18]]}
["TÜRKİYE MASA TENİSİ FEDERASYONU\nYILDIZLAR KUZEYBATI BÖLGE YARIŞMALARI",null,null,null,null,null,null,null,null,null,null,null,null,null,null,null,null,null,null,null,null,null,null,null,null,null,null,null,null,null,null,"1st Round",1]
["ERKEK TAKIM  [01-02 Mart 2025 BALIKESİR] [ Eleme ]",null,null,null,null,null,null,null,null,null,null,null,null,null,null,null,null,null,null,null,null,null,null,null,null,null,null,null,null,null,null,"2sn Round"]
["Y","S","B","Q","#",null,null,null,null,null,null,null,null,null,null,null,null,null,null,null,null,null,null,null,null,null,null,null,null,null,null,"3th Round"]
[1,1,null,null,1,"YALOVA BLD. SPOR (A) (YLV)",null,null,null,null,null,null,null,null,null,null,null,null,null,null,null,null,null,null,null,null,null,null,null,null,null,"4th Round"]
[null,null,null,null,null,null,null,0,0,null,null,1,"",null,null,null,null,null,null,null,null,null,null,null,null,null,null,null,null,null,null,"5th Round",null,null,null,null,null,null,"Ön eleme müsabakasını kazanan…"]
[2,129,999,"",256,"BOYBEYİ SPOR (A) (SKR)",null,null,null,null,null,null,null,null,null,null,null,null,17,"",null,null,null,null,null,null,null,null,null,null,null,"6th Round",null,null,null,null,null,null,"E1",{"$error":"#N/A"},"E9",{"$error":"#N/A"},"E17",{"$error":"#N/A"},"E25",{"$error":"#N/A"},"E33",{"$error":"#N/A"},"E41",{"$error":"#N/A"},"E49",{"$error":"#N/A"},"E57",{"$error":"#N/A"}]
[3,129,999,"",128,"EDİRNE YURDUM SPOR (B) (EDR)",null,null,null,null,null,null,null,null,0,0,null,null,null,null,null,null,null,null,null,25,null,null,null,null,null,null,null,null,null,null,null,null,"E2",{"$error":"#N/A"},"E10",{"$error":"#N/A"},"E18",{"$error":"#N/A"},"E26",{"$error":"#N/A"},"E34",{"$error":"#N/A"},"E42",{"$error":"#N/A"},"E50",{"$error":"#N/A"},"E58",{"$error":"#N/A"}]
[null,null,null,"",null,null,null,0,0,null,null,2,"",null,null,null,null,null,null,null,null,null,null,null,null,null,null,null,null,null,null,null,null,null,null,null,null,null,"E3",{"$error":"#N/A"},"E11",{"$error":"#N/A"},"E19",{"$error":"#N/A"},"E27",{"$error":"#N/A"},"E35",{"$error":"#N/A"},"E43",{"$error":"#N/A"},"E51",{"$error":"#N/A"},"E59",{"$error":"#N/A"}]
[4,65,999,"",129,{"$error":"#N/A"},null,null,null,null,null,null,null,null,null,null,null,null,null,null,null,null,null,null,null,null,null,null,null,null,null,null,null,null,null,null,null,null,"E4",{"$error":"#N/A"},"E12",{"$error":"#N/A"},"E20",{"$error":"#N/A"},"E28",{"$error":"#N/A"},"E36",{"$error":"#N/A"},"E44",{"$error":"#N/A"},"E52",{"$error":"#N/A"},"E60",{"$error":"#N/A"}]
[5,65,999,"",65,{"$error":"#N/A"},null,null,null,null,null,null,null,null,null,null,null,null,null,null,null,0,0,null,null,null,"",null,null,null,null,null,null,null,null,null,null,null,"E5",{"$error":"#N/A"},"E13",{"$error":"#N/A"},"E21",{"$error":"#N/A"},"E29",{"$error":"#N/A"},"E37",{"$error":"#N/A"},"E45",{"$error":"#N/A"},"E53",{"$error":"#N/A"},"E61",{"$error":"#N/A"}]
[null,null,null,"",null,null,null,0,0,null,null,3,"",null,null,null,null,null,null,null,null,null,null,null,null,null,null,null,null,null,null,null,null,null,null,null,null,null,"E6",{"$error":"#N/A"},"E14",{"$error":"#N/A"},"E22",{"$error":"#N/A"},"E30",{"$error":"#N/A"},"E38",{"$error":"#N/A"},"E46",{"$error":"#N/A"},"E54",{"$error":"#N/A"},"E62",{"$error":"#N/A"}]
[6,129,999,"",192,"YALOVA BLD. SPOR (C) (YLV)",null,null,null,null,null,null,null,null,null,null,null,null,18,null,null,null,null,null,null,null,null,null,null,null,null,null,null,null,null,null,null,null,"E7",{"$error":"#N/A"},"E15",{"$error":"#N/A"},"E23",{"$error":"#N/A"},"E31",{"$error":"#N/A"},"E39",{"$error":"#N/A"},"E47",{"$error":"#N/A"},"E55",{"$error":"#N/A"},"E63",{"$error":"#N/A"}]
[7,129,999,"",64,"GENÇ TRAKYA SPOR (C) (EDR)",null,null,null,null,null,null,null,null,0,0,null,null,null,"",null,null,null,null,null,null,null,null,null,null,null,null,null,null,null,null,null,null,"E8",{"$error":"#N/A"},"E16",{"$error":"#N/A"},"E24",{"$error":"#N/A"},"E32",{"$error":"#N/A"},"E40",{"$error":"#N/A"},"E48",{"$error":"#N/A"},"E56",{"$error":"#N/A"},"E64",{"$error":"#N/A"}]
[null,null,null,"",null,null,null,0,0,null,null,4,""]
[8,64,999,"",193,{"$error":"#N/A"}]
[9,49,null,"",33,{"$error":"#N/A"}]
[null,null,null,"",null,null,null,0,0,null,null,5,""]
[10,129,49,"",224,"BALIKESİR B. ŞEHİR BLD. SPOR (C) (BLK)",null,null,null,null,null,null,null,null,null,null,null,null,19,""]
[11,129,null,"",96,"TRAKER SPOR (B) (KRL)",null,null,null,null,null,null,null,null,0,0,null,null,null,null,null,null,null,null,null,26]
[null,null,null,"",null,null,null,0,0,null,null,6,""]
[12,65,null,"",161,{"$error":"#N/A"}]
[13,65,null,"",97,{"$error":"#N/A"},null,null,null,null,null,null,null,null,null,null,null,null,null,null,null,0,0,null,null,null,""]
[null,null,null,"",null,null,null,0,0,null,null,7,""]
[14,129,null,"",160,"BALIKESİR G.SPOR(A) (BLK)",null,null,null,null,null,null,null,null,null,null,null,null,20]
[15,129,32,"E29",32,"YALOVA GENÇLİK SPOR (A) (YLV)",null,null,null,null,null,null,null,null,0,0,null,null,null,""]
[null,null,null,"",null,null,null,0,0,null,null,8,""]
[16,32,null,"",225,{"$error":"#N/A"}]
[17,17,null,"",17,{"$error":"#N/A"}]
[null,null,null,"",null,null,null,0,0,null,null,9,""]
[18,129,17,"",240,{"$error":"#N/A"},null,null,null,null,null,null,null,null,null,null,null,null,21,""]
[19,129,null,"",112,{"$error":"#N/A"},null,null,null,null,null,null,null,null,0,0,null,null,null,null,null,null,null,null,null,27]
[null,null,null,"",null,null,null,0,0,null,null,10,""]
[20,65,null,"",145,{"$error":"#N/A"}]
[21,65,null,"",81,{"$error":"#N/A"},null,null,null,null,null,null,null,null,null,null,null,null,null,null,null,0,0,null,null,null,""]
[null,null,null,"",null,null,null,0,0,null,null,11,""]
[22,129,null,"E8",176,{"$error":"#N/A"},null,null,null,null,null,null,null,null,null,null,null,null,22]
[23,129,48,"",48,{"$error":"#N/A"},null,null,null,null,null,null,null,null,0,0,null,null,null,""]
[null,null,null,"",null,null,null,0,0,null,null,12,""]
[24,48,null,"",209,{"$error":"#N/A"}]
[25,33,null,"",49,{"$error":"#N/A"}]
[null,null,null,"",null,null,null,0,0,null,null,13,""]
[26,129,33,"",208,{"$error":"#N/A"},null,null,null,null,null,null,null,null,null,null,null,null,23,""]
[27,129,null,"E24",80,{"$error":"#N/A"},null,null,null,null,null,null,null,null,0,0,null,null,null,null,null,null,null,null,null,28]
[null,null,null,"",null,null,null,0,0,null,null,14,""]
[28,65,null,"",177,{"$error":"#N/A"}]
[29,65,null,"",113,{"$error":"#N/A"},null,null,null,null,null,null,null,null,null,null,null,null,null,null,null,0,0,null,null,null,""]
[null,null,null,"",null,null,null,0,0,null,null,15,""]
[30,129,null,"",144,{"$error":"#N/A"},null,null,null,null,null,null,null,null,null,null,null,null,24]
[31,129,16,"",16,{"$error":"#N/A"},null,null,null,null,null,null,null,null,0,0,null,null,null,""]
[null,null,null,"",null,null,null,0,0,null,null,16,""]
[32,16,null,"",241,"İSTANBUL BBSK (B) (İST)"]
[33,9,null,"",9,"LÜLEBURGAZ GENÇLİK SPOR  (A) (KRL)"]
[null,null,null,"",null,null,null,0,0,null,null,17,""]
[34,129,9,"",248,{"$error":"#N/A"},null,null,null,null,null,null,null,null,null,null,null,null,25,""]
[35,129,null,"",120,{"$error":"#N/A"},null,null,null,null,null,null,null,null,0,0,null,null,null,null,null,null,null,null,null,29]
[null,null,null,"",null,null,null,0,0,null,null,18,""]
[36,65,null,"",137,{"$error":"#N/A"}]
[37,65,null,"",73,{"$error":"#N/A"},null,null,null,null,null,null,null,null,null,null,null,null,null,null,null,0,0,null,null,null,""]
[null,null,null,"",null,null,null,0,0,null,null,19,""]
[38,129,null,"E20",184,{"$error":"#N/A"},null,null,null,null,null,null,null,null,null,null,null,null,26]
[39,129,40,"",56,{"$error":"#N/A"},null,null,null,null,null,null,null,null,0,0,null,null,null,""]
[null,null,null,"",null,null,null,0,0,null,null,20,""]
[40,40,null,"",201,{"$error":"#N/A"}]
[41,41,null,"",41,{"$error":"#N/A"}]
[null,null,null,"",null,null,null,0,0,null,null,21,""]
[42,129,41,"",216,{"$error":"#N/A"},null,null,null,null,null,null,null,null,null,null,null,null,27,""]
[43,129,null,"E4",88,{"$error":"#N/A"},null,null,null,null,null,null,null,null,0,0,null,null,null,null,null,null,null,null,null,30]
[null,null,null,"",null,null,null,0,0,null,null,22,""]
[44,65,null,"",169,{"$error":"#N/A"}]
[45,65,null,"",105,{"$error":"#N/A"},null,null,null,null,null,null,null,null,null,null,null,null,null,null,null,0,0,null,null,null,""]
[null,null,null,"",null,null,null,0,0,null,null,23,""]
[46,129,null,"",152,{"$error":"#N/A"},null,null,null,null,null,null,null,null,null,null,null,null,28]
[47,129,24,"",24,{"$error":"#N/A"},null,null,null,null,null,null,null,null,0,0,null,null,null,""]
[null,null,null,"",null,null,null,0,0,null,null,24,""]
[48,24,null,"",233,{"$error":"#N/A"}]
[49,25,null,"",25,{"$error":"#N/A"}]
[null,null,null,"",null,null,null,0,0,null,null,25,""]
[50,129,25,"",232,{"$error":"#N/A"},null,null,null,null,null,null,null,null,null,null,null,null,29,""]
[51,129,null,"",104,{"$error":"#N/A"},null,null,null,null,null,null,null,null,0,0,null,null,null,null,null,null,null,null,null,31]
[null,null,null,"",null,null,null,0,0,null,null,26,""]
[52,65,null,"",153,{"$error":"#N/A"}]
[53,65,null,"",89,{"$error":"#N/A"},null,null,null,null,null,null,null,null,null,null,null,null,null,null,null,0,0,null,null,null,""]
[null,null,null,"",null,null,null,0,0,null,null,27,""]
[54,129,null,"E26",168,{"$error":"#N/A"},null,null,null,null,null,null,null,null,null,null,null,null,30]
[55,129,56,"",40,{"$error":"#N/A"},null,null,null,null,null,null,null,null,0,0,null,null,null,""]
[null,null,null,"",null,null,null,0,0,null,null,28,""]
[56,56,null,"",217,{"$error":"#N/A"}]
[57,57,999,"",57,{"$error":"#N/A"}]
[null,null,null,"",null,null,null,0,0,null,null,29,""]
[58,129,999,"",200,{"$error":"#N/A"},null,null,null,null,null,null,null,null,null,null,null,null,31,""]
[59,129,999,"",72,{"$error":"#N/A"},null,null,null,null,null,null,null,null,0,0,null,null,null,null,null,null,null,null,null,32]
[null,null,null,"",null,null,null,0,0,null,null,30,""]
[60,65,999,"",185,{"$error":"#N/A"}]
[61,65,999,"",121,{"$error":"#N/A"},null,null,null,null,null,null,null,null,null,null,null,null,null,null,null,0,0,null,null,null,""]
[null,null,null,"",null,null,null,0,0,null,null,31,""]
[62,129,999,"",136,{"$error":"#N/A"},null,null,null,null,null,null,null,null,null,null,null,null,32]
[63,129,999,"",249,{"$error":"#N/A"},null,null,null,null,null,null,null,null,0,0,null,null,null,""]
[null,null,null,"",null,null,null,0,0,null,null,32,""]
[64,8,null,"",8,"UMUDUMUZ ÖZEL SPORCULAR GSK (A) (BRT)"]
[65,5,null,"",5,"İSTANBUL DSİ SPOR (A) (İST)"]
[null,null,null,"",null,null,null,0,0,null,null,33,""]
[66,129,999,"",252,{"$error":"#N/A"},null,null,null,null,null,null,null,null,null,null,null,null,33,""]
[67,129,999,"",124,{"$error":"#N/A"},null,null,null,null,null,null,null,null,0,0,null,null,null,null,null,null,null,null,null,33]
[null,null,null,"",null,null,null,0,0,null,null,34,""]
[68,65,999,"",133,{"$error":"#N/A"}]
[69,65,999,"",69,{"$error":"#N/A"},null,null,null,null,null,null,null,null,null,null,null,null,null,null,null,0,0,null,null,null,""]
[null,null,null,"",null,null,null,0,0,null,null,35,""]
[70,129,999,"",188,{"$error":"#N/A"},null,null,null,null,null,null,null,null,null,null,null,null,34]
[71,129,999,"",60,{"$error":"#N/A"},null,null,null,null,null,null,null,null,0,0,null,null,null,""]
[null,null,null,"",null,null,null,0,0,null,null,36,""]
[72,60,999,"",197,{"$error":"#N/A"}]
[73,53,null,"",37,{"$error":"#N/A"}]
[null,null,null,"",null,null,null,0,0,null,null,37,""]
[74,129,53,"",220,{"$error":"#N/A"},null,null,null,null,null,null,null,null,null,null,null,null,35,""]
[75,129,null,"E10",92,{"$error":"#N/A"},null,null,null,null,null,null,null,null,0,0,null,null,null,null,null,null,null,null,null,34]
[null,null,null,"",null,null,null,0,0,null,null,38,""]
[76,65,null,"",165,{"$error":"#N/A"}]
[77,65,null,"",101,{"$error":"#N/A"},null,null,null,null,null,null,null,null,null,null,null,null,null,null,null,0,0,null,null,null,""]
[null,null,null,"",null,null,null,0,0,null,null,39,""]
[78,129,null,"",156,{"$error":"#N/A"},null,null,null,null,null,null,null,null,null,null,null,null,36]
[79,129,28,"E2",28,{"$error":"#N/A"},null,null,null,null,null,null,null,null,0,0,null,null,null,""]
[null,null,null,"",null,null,null,0,0,null,null,40,""]
[80,28,null,"",229,{"$error":"#N/A"}]
[81,21,null,"",21,{"$error":"#N/A"}]
[null,null,null,"",null,null,null,0,0,null,null,41,""]
[82,129,21,"E30",236,{"$error":"#N/A"},null,null,null,null,null,null,null,null,null,null,null,null,37,""]
[83,129,null,"",108,{"$error":"#N/A"},null,null,null,null,null,null,null,null,0,0,null,null,null,null,null,null,null,null,null,35]
[null,null,null,"",null,null,null,0,0,null,null,42,""]
[84,65,null,"",149,{"$error":"#N/A"}]
[85,65,null,"",85,{"$error":"#N/A"},null,null,null,null,null,null,null,null,null,null,null,null,null,null,null,0,0,null,null,null,""]
[null,null,null,"",null,null,null,0,0,null,null,43,""]
[86,129,null,"E16",172,{"$error":"#N/A"},null,null,null,null,null,null,null,null,null,null,null,null,38]
[87,129,44,"",44,{"$error":"#N/A"},null,null,null,null,null,null,null,null,0,0,null,null,null,""]
[null,null,null,"",null,null,null,0,0,null,null,44,""]
[88,44,null,"",213,{"$error":"#N/A"}]
[89,37,null,"",53,{"$error":"#N/A"}]
[null,null,null,"",null,null,null,0,0,null,null,45,""]
[90,129,37,"",204,{"$error":"#N/A"},null,null,null,null,null,null,null,null,null,null,null,null,39,""]
[91,129,null,"E18",76,{"$error":"#N/A"},null,null,null,null,null,null,null,null,0,0,null,null,null,null,null,null,null,null,null,36]
[null,null,null,"",null,null,null,0,0,null,null,46,""]
[92,65,null,"",181,{"$error":"#N/A"}]
[93,65,null,"",117,{"$error":"#N/A"},null,null,null,null,null,null,null,null,null,null,null,null,null,null,null,0,0,null,null,null,""]
[null,null,null,"",null,null,null,0,0,null,null,47,""]
[94,129,null,"",140,{"$error":"#N/A"},null,null,null,null,null,null,null,null,null,null,null,null,40]
[95,129,12,"",12,{"$error":"#N/A"},null,null,null,null,null,null,null,null,0,0,null,null,null,""]
[null,null,null,"",null,null,null,0,0,null,null,48,""]
[96,12,null,"",245,"ÇERKEZKÖY BLD. GSK (A) (TKD)"]
[97,13,null,"",13,"YILDIZ RAKETLER SPOR (B) (İST)"]
[null,null,null,"",null,null,null,0,0,null,null,49,""]
[98,129,13,"",244,{"$error":"#N/A"},null,null,null,null,null,null,null,null,null,null,null,null,41,""]
[99,129,null,"E27",116,{"$error":"#N/A"},null,null,null,null,null,null,null,null,0,0,null,null,null,null,null,null,null,null,null,37]
[null,null,null,"",null,null,null,0,0,null,null,50,""]
[100,65,null,"",141,{"$error":"#N/A"}]
[101,65,null,"",77,{"$error":"#N/A"},null,null,null,null,null,null,null,null,null,null,null,null,null,null,null,0,0,null,null,null,""]
[null,null,null,"",null,null,null,0,0,null,null,51,""]
[102,129,null,"E22",180,{"$error":"#N/A"},null,null,null,null,null,null,null,null,null,null,null,null,42]
[103,129,36,"",52,{"$error":"#N/A"},null,null,null,null,null,null,null,null,0,0,null,null,null,""]
[null,null,null,"",null,null,null,0,0,null,null,52,""]
[104,36,null,"",205,{"$error":"#N/A"}]
[105,45,null,"",45,{"$error":"#N/A"}]
[null,null,null,"",null,null,null,0,0,null,null,53,""]
[106,129,45,"",212,{"$error":"#N/A"},null,null,null,null,null,null,null,null,null,null,null,null,43,""]
[107,129,null,"E6",84,{"$error":"#N/A"},null,null,null,null,null,null,null,null,0,0,null,null,null,null,null,null,null,null,null,38]
[null,null,null,"",null,null,null,0,0,null,null,54,""]
[108,65,null,"",173,{"$error":"#N/A"}]
[109,65,null,"",109,{"$error":"#N/A"},null,null,null,null,null,null,null,null,null,null,null,null,null,null,null,0,0,null,null,null,""]
[null,null,null,"",null,null,null,0,0,null,null,55,""]
[110,129,null,"E12",148,{"$error":"#N/A"},null,null,null,null,null,null,null,null,null,null,null,null,44]
[111,129,20,"",20,{"$error":"#N/A"},null,null,null,null,null,null,null,null,0,0,null,null,null,""]
[null,null,null,"",null,null,null,0,0,null,null,56,""]
[112,20,null,"",237,{"$error":"#N/A"}]
[113,29,null,"",29,{"$error":"#N/A"}]
[null,null,null,"",null,null,null,0,0,null,null,57,""]
[114,129,29,"",228,{"$error":"#N/A"},null,null,null,null,null,null,null,null,null,null,null,null,45,""]
[115,129,null,"",100,{"$error":"#N/A"},null,null,null,null,null,null,null,null,0,0,null,null,null,null,null,null,null,null,null,39]
[null,null,null,"",null,null,null,0,0,null,null,58,""]
[116,65,null,"",157,{"$error":"#N/A"}]
[117,65,null,"",93,{"$error":"#N/A"},null,null,null,null,null,null,null,null,null,null,null,null,null,null,null,0,0,null,null,null,""]
[null,null,null,"",null,null,null,0,0,null,null,59,""]
[118,129,null,"E14",164,{"$error":"#N/A"},null,null,null,null,null,null,null,null,null,null,null,null,46]
[119,129,52,"",36,{"$error":"#N/A"},null,null,null,null,null,null,null,null,0,0,null,null,null,""]
[null,null,null,"",null,null,null,0,0,null,null,60,""]
[120,52,null,"",221,{"$error":"#N/A"}]
[121,61,999,"",61,{"$error":"#N/A"}]
[null,null,null,"",null,null,null,0,0,null,null,61,""]
[122,129,999,"",196,{"$error":"#N/A"},null,null,null,null,null,null,null,null,null,null,null,null,47,""]
[123,129,999,"",68,{"$error":"#N/A"},null,null,null,null,null,null,null,null,0,0,null,null,null,null,null,null,null,null,null,40]
[null,null,null,"",null,null,null,0,0,null,null,62,""]
[124,65,999,"",189,{"$error":"#N/A"}]
[125,65,999,"",125,{"$error":"#N/A"},null,null,null,null,null,null,null,null,null,null,null,null,null,null,null,0,0,null,null,null,""]
[null,null,null,"",null,null,null,0,0,null,null,63,""]
[126,129,999,"",132,{"$error":"#N/A"},null,null,null,null,null,null,null,null,null,null,null,null,48]
[127,129,999,"",253,{"$error":"#N/A"},null,null,null,null,null,null,null,null,0,0,null,null,null,""]
[null,null,null,"",null,null,null,0,0,null,null,64,""]
[128,4,null,"",4,"YILDIZ RAKETLER SPOR (A) (İST)"]
[129,3,null,"",3,"İSTANBUL BBSK (A) (İST)"]
[null,null,null,"",null,null,null,0,0,null,null,65,""]
[130,129,999,"",254,"BOYBEYİ SPOR (A) (SKR)",null,null,null,null,null,null,null,null,null,null,null,null,49,""]
[131,129,999,"",126,"EDİRNE YURDUM SPOR (B) (EDR)",null,null,null,null,null,null,null,null,0,0,null,null,null,null,null,null,null,null,null,41]
[null,null,null,"",null,null,null,0,0,null,null,66,""]
[132,65,999,"",131,{"$error":"#N/A"}]
[133,65,999,"",67,{"$error":"#N/A"},null,null,null,null,null,null,null,null,null,null,null,null,null,null,null,0,0,null,null,null,""]
[null,null,null,"",null,null,null,0,0,null,null,67,""]
[134,129,999,"",190,"YALOVA BLD. SPOR (C) (YLV)",null,null,null,null,null,null,null,null,null,null,null,null,50]
[135,129,999,"",62,"GENÇ TRAKYA SPOR (C) (EDR)",null,null,null,null,null,null,null,null,0,0,null,null,null,""]
[null,null,null,"",null,null,null,0,0,null,null,68,""]
[136,62,999,"",195,{"$error":"#N/A"}]
[137,51,null,"",35,{"$error":"#N/A"}]
[null,null,null,"",null,null,null,0,0,null,null,69,""]
[138,129,51,"",222,"BALIKESİR B. ŞEHİR BLD. SPOR (C) (BLK)",null,null,null,null,null,null,null,null,null,null,null,null,51,""]
[139,129,null,"E13",94,"TRAKER SPOR (B) (KRL)",null,null,null,null,null,null,null,null,0,0,null,null,null,null,null,null,null,null,null,42]
[null,null,null,"",null,null,null,0,0,null,null,70,""]
[140,65,null,"",163,{"$error":"#N/A"}]
[141,65,null,"",99,{"$error":"#N/A"},null,null,null,null,null,null,null,null,null,null,null,null,null,null,null,0,0,null,null,null,""]
[null,null,null,"",null,null,null,0,0,null,null,71,""]
[142,129,null,"",158,"BALIKESİR G.SPOR(A) (BLK)",null,null,null,null,null,null,null,null,null,null,null,null,52]
[143,129,30,"E28",30,"YALOVA GENÇLİK SPOR (A) (YLV)",null,null,null,null,null,null,null,null,0,0,null,null,null,""]
[null,null,null,"",null,null,null,0,0,null,null,72,""]
[144,30,null,"",227,{"$error":"#N/A"}]
[145,19,null,"",19,{"$error":"#N/A"}]
[null,null,null,"",null,null,null,0,0,null,null,73,""]
[146,129,19,"",238,{"$error":"#N/A"},null,null,null,null,null,null,null,null,null,null,null,null,53,""]
[147,129,null,"",110,{"$error":"#N/A"},null,null,null,null,null,null,null,null,0,0,null,null,null,null,null,null,null,null,null,43]
[null,null,null,"",null,null,null,0,0,null,null,74,""]
[148,65,null,"",147,{"$error":"#N/A"}]
[149,65,null,"",83,{"$error":"#N/A"},null,null,null,null,null,null,null,null,null,null,null,null,null,null,null,0,0,null,null,null,""]
[null,null,null,"",null,null,null,0,0,null,null,75,""]
[150,129,null,"E5",174,{"$error":"#N/A"},null,null,null,null,null,null,null,null,null,null,null,null,54]
[151,129,46,"",46,{"$error":"#N/A"},null,null,null,null,null,null,null,null,0,0,null,null,null,""]
[null,null,null,"",null,null,null,0,0,null,null,76,""]
[152,46,null,"",211,{"$error":"#N/A"}]
[153,35,null,"",51,{"$error":"#N/A"}]
[null,null,null,"",null,null,null,0,0,null,null,77,""]
[154,129,35,"",206,{"$error":"#N/A"},null,null,null,null,null,null,null,null,null,null,null,null,55,""]
[155,129,null,"E21",78,{"$error":"#N/A"},null,null,null,null,null,null,null,null,0,0,null,null,null,null,null,null,null,null,null,44]
[null,null,null,"",null,null,null,0,0,null,null,78,""]
[156,65,null,"",179,{"$error":"#N/A"}]
[157,65,null,"",115,{"$error":"#N/A"},null,null,null,null,null,null,null,null,null,null,null,null,null,null,null,0,0,null,null,null,""]
[null,null,null,"",null,null,null,0,0,null,null,79,""]
[158,129,null,"E31",142,{"$error":"#N/A"},null,null,null,null,null,null,null,null,null,null,null,null,56]
[159,129,14,"",14,{"$error":"#N/A"},null,null,null,null,null,null,null,null,0,0,null,null,null,""]
[null,null,null,"",null,null,null,0,0,null,null,80,""]
[160,14,null,"",243,"GENÇLİKSPOR KIRKLARELİ (A) (KRL)"]
[161,11,null,"",11,"BEYOĞLUSPOR (A) (İST)"]
[null,null,null,"",null,null,null,0,0,null,null,81,""]
[162,129,11,"",246,{"$error":"#N/A"},null,null,null,null,null,null,null,null,null,null,null,null,57,""]
[163,129,null,"",118,{"$error":"#N/A"},null,null,null,null,null,null,null,null,0,0,null,null,null,null,null,null,null,null,null,45]
[null,null,null,"",null,null,null,0,0,null,null,82,""]
[164,65,null,"",139,{"$error":"#N/A"}]
[165,65,null,"",75,{"$error":"#N/A"},null,null,null,null,null,null,null,null,null,null,null,null,null,null,null,0,0,null,null,null,""]
[null,null,null,"",null,null,null,0,0,null,null,83,""]
[166,129,null,"E17",182,{"$error":"#N/A"},null,null,null,null,null,null,null,null,null,null,null,null,58]
[167,129,38,"",54,{"$error":"#N/A"},null,null,null,null,null,null,null,null,0,0,null,null,null,""]
[null,null,null,"",null,null,null,0,0,null,null,84,""]
[168,38,null,"",203,{"$error":"#N/A"}]
[169,43,null,"",43,{"$error":"#N/A"}]
[null,null,null,"",null,null,null,0,0,null,null,85,""]
[170,129,43,"",214,{"$error":"#N/A"},null,null,null,null,null,null,null,null,null,null,null,null,59,""]
[171,129,null,"E1",86,{"$error":"#N/A"},null,null,null,null,null,null,null,null,0,0,null,null,null,null,null,null,null,null,null,46]
[null,null,null,"",null,null,null,0,0,null,null,86,""]
[172,65,null,"",171,{"$error":"#N/A"}]
[173,65,null,"",107,{"$error":"#N/A"},null,null,null,null,null,null,null,null,null,null,null,null,null,null,null,0,0,null,null,null,""]
[null,null,null,"",null,null,null,0,0,null,null,87,""]
[174,129,null,"",150,{"$error":"#N/A"},null,null,null,null,null,null,null,null,null,null,null,null,60]
[175,129,22,"",22,{"$error":"#N/A"},null,null,null,null,null,null,null,null,0,0,null,null,null,""]
[null,null,null,"",null,null,null,0,0,null,null,88,""]
[176,22,null,"",235,{"$error":"#N/A"}]
[177,27,null,"",27,{"$error":"#N/A"}]
[null,null,null,"",null,null,null,0,0,null,null,89,""]
[178,129,27,"",230,{"$error":"#N/A"},null,null,null,null,null,null,null,null,null,null,null,null,61,""]
[179,129,null,"",102,{"$error":"#N/A"},null,null,null,null,null,null,null,null,0,0,null,null,null,null,null,null,null,null,null,47]
[null,null,null,"",null,null,null,0,0,null,null,90,""]
[180,65,null,"",155,{"$error":"#N/A"}]
[181,65,null,"",91,{"$error":"#N/A"},null,null,null,null,null,null,null,null,null,null,null,null,null,null,null,0,0,null,null,null,""]
[null,null,null,"",null,null,null,0,0,null,null,91,""]
[182,129,null,"E9",166,{"$error":"#N/A"},null,null,null,null,null,null,null,null,null,null,null,null,62]
[183,129,54,"",38,{"$error":"#N/A"},null,null,null,null,null,null,null,null,0,0,null,null,null,""]
[null,null,null,"",null,null,null,0,0,null,null,92,""]
[184,54,null,"",219,{"$error":"#N/A"}]
[185,59,999,"",59,{"$error":"#N/A"}]
[null,null,null,"",null,null,null,0,0,null,null,93,""]
[186,129,999,"",198,{"$error":"#N/A"},null,null,null,null,null,null,null,null,null,null,null,null,63,""]
[187,129,999,"",70,{"$error":"#N/A"},null,null,null,null,null,null,null,null,0,0,null,null,null,null,null,null,null,null,null,48]
[null,null,null,"",null,null,null,0,0,null,null,94,""]
[188,65,999,"",187,{"$error":"#N/A"}]
[189,65,999,"",123,{"$error":"#N/A"},null,null,null,null,null,null,null,null,null,null,null,null,null,null,null,0,0,null,null,null,""]
[null,null,null,"",null,null,null,0,0,null,null,95,""]
[190,129,999,"",134,{"$error":"#N/A"},null,null,null,null,null,null,null,null,null,null,null,null,64]
[191,129,999,"",251,{"$error":"#N/A"},null,null,null,null,null,null,null,null,0,0,null,null,null,""]
[null,null,null,"",null,null,null,0,0,null,null,96,""]
[192,6,null,"",6,"İSTANBUL DSİ SPOR (B) (İST)"]
[193,7,null,"",7,"PENDİK BLD. SPOR (A) (İST)"]
[null,null,null,"",null,null,null,0,0,null,null,97,""]
[194,129,999,"",250,{"$error":"#N/A"},null,null,null,null,null,null,null,null,null,null,null,null,65,""]
[195,129,999,"",122,{"$error":"#N/A"},null,null,null,null,null,null,null,null,0,0,null,null,null,null,null,null,null,null,null,49]
[null,null,null,"",null,null,null,0,0,null,null,98,""]
[196,65,999,"",135,{"$error":"#N/A"}]
[197,65,999,"",71,{"$error":"#N/A"},null,null,null,null,null,null,null,null,null,null,null,null,null,null,null,0,0,null,null,null,""]
[null,null,null,"",null,null,null,0,0,null,null,99,""]
[198,129,999,"",186,{"$error":"#N/A"},null,null,null,null,null,null,null,null,null,null,null,null,66]
[199,129,999,"",58,{"$error":"#N/A"},null,null,null,null,null,null,null,null,0,0,null,null,null,""]
[null,null,null,"",null,null,null,0,0,null,null,100,""]
[200,58,999,"",199,{"$error":"#N/A"}]
[201,55,null,"",39,{"$error":"#N/A"}]
[null,null,null,"",null,null,null,0,0,null,null,101,""]
[202,129,55,"",218,{"$error":"#N/A"},null,null,null,null,null,null,null,null,null,null,null,null,67,""]
[203,129,null,"E11",90,{"$error":"#N/A"},null,null,null,null,null,null,null,null,0,0,null,null,null,null,null,null,null,null,null,50]
[null,null,null,"",null,null,null,0,0,null,null,102,""]
[204,65,null,"",167,{"$error":"#N/A"}]
[205,65,null,"",103,{"$error":"#N/A"},null,null,null,null,null,null,null,null,null,null,null,null,null,null,null,0,0,null,null,null,""]
[null,null,null,"",null,null,null,0,0,null,null,103,""]
[206,129,null,"E25",154,{"$error":"#N/A"},null,null,null,null,null,null,null,null,null,null,null,null,68]
[207,129,26,"",26,{"$error":"#N/A"},null,null,null,null,null,null,null,null,0,0,null,null,null,""]
[null,null,null,"",null,null,null,0,0,null,null,104,""]
[208,26,null,"",231,{"$error":"#N/A"}]
[209,23,null,"",23,{"$error":"#N/A"}]
[null,null,null,"",null,null,null,0,0,null,null,105,""]
[210,129,23,"",234,{"$error":"#N/A"},null,null,null,null,null,null,null,null,null,null,null,null,69,""]
[211,129,null,"",106,{"$error":"#N/A"},null,null,null,null,null,null,null,null,0,0,null,null,null,null,null,null,null,null,null,51]
[null,null,null,"",null,null,null,0,0,null,null,106,""]
[212,65,null,"",151,{"$error":"#N/A"}]
[213,65,null,"",87,{"$error":"#N/A"},null,null,null,null,null,null,null,null,null,null,null,null,null,null,null,0,0,null,null,null,""]
[null,null,null,"",null,null,null,0,0,null,null,107,""]
[214,129,null,"E3",170,{"$error":"#N/A"},null,null,null,null,null,null,null,null,null,null,null,null,70]
[215,129,42,"",42,{"$error":"#N/A"},null,null,null,null,null,null,null,null,0,0,null,null,null,""]
[null,null,null,"",null,null,null,0,0,null,null,108,""]
[216,42,null,"",215,{"$error":"#N/A"}]
[217,39,null,"",55,{"$error":"#N/A"}]
[null,null,null,"",null,null,null,0,0,null,null,109,""]
[218,129,39,"",202,{"$error":"#N/A"},null,null,null,null,null,null,null,null,null,null,null,null,71,""]
[219,129,null,"E19",74,{"$error":"#N/A"},null,null,null,null,null,null,null,null,0,0,null,null,null,null,null,null,null,null,null,52]
[null,null,null,"",null,null,null,0,0,null,null,110,""]
[220,65,null,"",183,{"$error":"#N/A"}]
[221,65,null,"",119,{"$error":"#N/A"},null,null,null,null,null,null,null,null,null,null,null,null,null,null,null,0,0,null,null,null,""]
[null,null,null,"",null,null,null,0,0,null,null,111,""]
[222,129,null,"",138,{"$error":"#N/A"},null,null,null,null,null,null,null,null,null,null,null,null,72]
[223,129,10,"",10,{"$error":"#N/A"},null,null,null,null,null,null,null,null,0,0,null,null,null,""]
[null,null,null,"",null,null,null,0,0,null,null,112,""]
[224,10,null,"",247,"GENÇLİKSPOR KIRKLARELİ (B) (KRL)"]
[225,15,null,"",15,"TRAKER SPOR (A) (KRL)"]
[null,null,null,"",null,null,null,0,0,null,null,113,""]
[226,129,15,"",242,{"$error":"#N/A"},null,null,null,null,null,null,null,null,null,null,null,null,73,""]
[227,129,null,"E32",114,{"$error":"#N/A"},null,null,null,null,null,null,null,null,0,0,null,null,null,null,null,null,null,null,null,53]
[null,null,null,"",null,null,null,0,0,null,null,114,""]
[228,65,null,"",143,{"$error":"#N/A"}]
[229,65,null,"",79,{"$error":"#N/A"},null,null,null,null,null,null,null,null,null,null,null,null,null,null,null,0,0,null,null,null,""]
[null,null,null,"",null,null,null,0,0,null,null,115,""]
[230,129,null,"E23",178,{"$error":"#N/A"},null,null,null,null,null,null,null,null,null,null,null,null,74]
[231,129,34,"",50,{"$error":"#N/A"},null,null,null,null,null,null,null,null,0,0,null,null,null,""]
[null,null,null,"",null,null,null,0,0,null,null,116,""]
[232,34,null,"",207,{"$error":"#N/A"}]
[233,47,null,"",47,{"$error":"#N/A"}]
[null,null,null,"",null,null,null,0,0,null,null,117,""]
[234,129,47,"",210,{"$error":"#N/A"},null,null,null,null,null,null,null,null,null,null,null,null,75,""]
[235,129,null,"E7",82,{"$error":"#N/A"},null,null,null,null,null,null,null,null,0,0,null,null,null,null,null,null,null,null,null,54]
[null,null,null,"",null,null,null,0,0,null,null,118,""]
[236,65,null,"",175,{"$error":"#N/A"}]
[237,65,null,"",111,{"$error":"#N/A"},null,null,null,null,null,null,null,null,null,null,null,null,null,null,null,0,0,null,null,null,""]
[null,null,null,"",null,null,null,0,0,null,null,119,""]
[238,129,null,"",146,{"$error":"#N/A"},null,null,null,null,null,null,null,null,null,null,null,null,76]
[239,129,18,"",18,{"$error":"#N/A"},null,null,null,null,null,null,null,null,0,0,null,null,null,""]
[null,null,null,"",null,null,null,0,0,null,null,120,""]
[240,18,null,"",239,{"$error":"#N/A"}]
[241,31,null,"",31,{"$error":"#N/A"}]
[null,null,null,"",null,null,null,0,0,null,null,121,""]
[242,129,31,"",226,{"$error":"#N/A"},null,null,null,null,null,null,null,null,null,null,null,null,77,""]
[243,129,null,"",98,{"$error":"#N/A"},null,null,null,null,null,null,null,null,0,0,null,null,null,null,null,null,null,null,null,55]
[null,null,null,"",null,null,null,0,0,null,null,122,""]
[244,65,null,"",159,{"$error":"#N/A"}]
[245,65,null,"",95,{"$error":"#N/A"},null,null,null,null,null,null,null,null,null,null,null,null,null,null,null,0,0,null,null,null,""]
[null,null,null,"",null,null,null,0,0,null,null,123,""]
[246,129,null,"E15",162,{"$error":"#N/A"},null,null,null,null,null,null,null,null,null,null,null,null,78]
[247,129,50,"",34,{"$error":"#N/A"},null,null,null,null,null,null,null,null,0,0,null,null,null,""]
[null,null,null,"",null,null,null,0,0,null,null,124,""]
[248,50,null,"",223,{"$error":"#N/A"}]
[249,63,999,"",63,{"$error":"#N/A"}]
[null,null,null,"",null,null,null,0,0,null,null,125,""]
[250,129,999,"",194,{"$error":"#N/A"},null,null,null,null,null,null,null,null,null,null,null,null,79,""]
[251,129,999,"",66,{"$error":"#N/A"},null,null,null,null,null,null,null,null,0,0,null,null,null,null,null,null,null,null,null,56]
[null,null,null,"",null,null,null,0,0,null,null,126,""]
[252,65,999,"",191,{"$error":"#N/A"}]
[253,65,999,"",127,{"$error":"#N/A"},null,null,null,null,null,null,null,null,null,null,null,null,null,null,null,0,0,null,null,null,""]
[null,null,null,"",null,null,null,0,0,null,null,127,""]
[254,129,999,"",130,{"$error":"#N/A"},null,null,null,null,null,null,null,null,null,null,null,null,80]
[255,129,999,"",255,{"$error":"#N/A"},null,null,null,null,null,null,null,null,0,0,null,null,null,""]
[null,null,null,"",null,null,null,0,0,null,null,128,""]
[256,2,null,"",2,"FENERBAHÇE (A) (İST)"]
[]
[]
[1,1,0,0,1,"YALOVA BLD. SPOR (A) (YLV)"]
[null,null,null,null,null,null,null,0,0,null,null,1,""]
[2,65,1,"E64",128,"YALOVA BLD. SPOR (B) (YLV)",null,null,null,null,null,null,null,null,null,null,null,null,65,""]
[3,65,33,"E32",64,"GÖNEN TAYFUNSPOR (A) (BLK)",null,null,null,null,null,null,null,null,0,0,null,null,null,null,null,null,null,null,null,97]
[null,null,null,"",null,null,null,0,0,null,null,2,""]
[4,33,0,"",65,{"$error":"#N/A"}]
[5,33,0,"",32,{"$error":"#N/A"},null,null,null,null,null,null,null,null,null,null,null,null,null,null,null,0,0,null,null,null,""]
[null,null,null,"",null,null,null,0,0,null,null,3,""]
[6,65,49,"E16",97,"BURSA B. ŞEHİR BLD. SPOR (A) (BRS)",null,null,null,null,null,null,null,null,null,null,null,null,66]
[7,65,17,"E48",33,"BALIKESİR B. ŞEHİR BLD. SPOR (A) (BLK)",null,null,null,null,null,null,null,null,0,0,null,null,null,""]
[null,null,null,"",null,null,null,0,0,null,null,4,""]
[8,17,0,"",96,{"$error":"#N/A"}]
[9,17,0,"",16,{"$error":"#N/A"}]
[null,null,null,"",null,null,null,0,0,null,null,5,""]
[10,65,25,"E40",113,"BALIKESİR B. ŞEHİR BLD. SPOR (B) (BLK)",null,null,null,null,null,null,null,null,null,null,null,null,67,""]
[11,65,57,"E8",49,"GENÇ TRAKYA SPOR (A) (EDR)",null,null,null,null,null,null,null,null,0,0,null,null,null,null,null,null,null,null,null,98]
[null,null,null,"",null,null,null,0,0,null,null,6,""]
[12,33,0,"",80,{"$error":"#N/A"}]
[13,33,0,"",17,{"$error":"#N/A"},null,null,null,null,null,null,null,null,null,null,null,null,null,null,null,0,0,null,null,null,""]
[null,null,null,"",null,null,null,0,0,null,null,7,""]
[14,65,41,"E24",112,"LÜLEBURGAZ ZİRVE SPOR  (A) (KRL)",null,null,null,null,null,null,null,null,null,null,null,null,68]
[15,65,9,"E56",48,"EDİRNE YURDUM SPOR (A) (EDR)",null,null,null,null,null,null,null,null,0,0,null,null,null,""]
[null,null,null,"",null,null,null,0,0,null,null,8,""]
[16,9,0,"",81,"YILDIZ RAKETLER SPOR (B) (İST)"]
[17,9,0,"",88,"LÜLEBURGAZ GENÇLİK SPOR  (A) (KRL)"]
[null,null,null,"",null,null,null,0,0,null,null,9,""]
[18,65,13,"E52",41,{"$error":"#N/A"},null,null,null,null,null,null,null,null,null,null,null,null,69,""]
[19,65,45,"E20",105,{"$error":"#N/A"},null,null,null,null,null,null,null,null,0,0,null,null,null,null,null,null,null,null,null,99]
[null,null,null,"",null,null,null,0,0,null,null,10,""]
[20,33,0,"",24,{"$error":"#N/A"}]
[21,33,0,"",73,{"$error":"#N/A"},null,null,null,null,null,null,null,null,null,null,null,null,null,null,null,0,0,null,null,null,""]
[null,null,null,"",null,null,null,0,0,null,null,11,""]
[22,65,61,"E4",56,{"$error":"#N/A"},null,null,null,null,null,null,null,null,null,null,null,null,70]
[23,65,29,"E36",120,{"$error":"#N/A"},null,null,null,null,null,null,null,null,0,0,null,null,null,""]
[null,null,null,"",null,null,null,0,0,null,null,12,""]
[24,17,0,"",9,{"$error":"#N/A"}]
[25,17,0,"",89,{"$error":"#N/A"}]
[null,null,null,"",null,null,null,0,0,null,null,13,""]
[26,65,21,"E44",40,{"$error":"#N/A"},null,null,null,null,null,null,null,null,null,null,null,null,71,""]
[27,65,53,"E12",104,{"$error":"#N/A"},null,null,null,null,null,null,null,null,0,0,null,null,null,null,null,null,null,null,null,100]
[null,null,null,"",null,null,null,0,0,null,null,14,""]
[28,33,0,"",25,{"$error":"#N/A"}]
[29,33,0,"",72,{"$error":"#N/A"},null,null,null,null,null,null,null,null,null,null,null,null,null,null,null,0,0,null,null,null,""]
[null,null,null,"",null,null,null,0,0,null,null,15,""]
[30,65,37,"E28",57,{"$error":"#N/A"},null,null,null,null,null,null,null,null,null,null,null,null,72]
[31,65,5,"E60",121,{"$error":"#N/A"},null,null,null,null,null,null,null,null,0,0,null,null,null,""]
[null,null,null,"",null,null,null,0,0,null,null,16,""]
[32,5,0,"",8,"PENDİK BLD. SPOR (A) (İST)"]
[33,5,0,"",5,"İSTANBUL DSİ SPOR (A) (İST)"]
[null,null,null,"",null,null,null,0,0,null,null,17,""]
[34,65,7,"E58",124,{"$error":"#N/A"},null,null,null,null,null,null,null,null,null,null,null,null,73,""]
[35,65,39,"E26",60,{"$error":"#N/A"},null,null,null,null,null,null,null,null,0,0,null,null,null,null,null,null,null,null,null,101]
[null,null,null,"",null,null,null,0,0,null,null,18,""]
[36,33,0,"",69,{"$error":"#N/A"}]
[37,33,0,"",28,{"$error":"#N/A"},null,null,null,null,null,null,null,null,null,null,null,null,null,null,null,0,0,null,null,null,""]
[null,null,null,"",null,null,null,0,0,null,null,19,""]
[38,65,55,"E10",101,{"$error":"#N/A"},null,null,null,null,null,null,null,null,null,null,null,null,74]
[39,65,23,"E42",37,{"$error":"#N/A"},null,null,null,null,null,null,null,null,0,0,null,null,null,""]
[null,null,null,"",null,null,null,0,0,null,null,20,""]
[40,17,0,"",92,{"$error":"#N/A"}]
[41,17,0,"",12,{"$error":"#N/A"}]
[null,null,null,"",null,null,null,0,0,null,null,21,""]
[42,65,31,"E34",117,{"$error":"#N/A"},null,null,null,null,null,null,null,null,null,null,null,null,75,""]
[43,65,63,"E2",53,{"$error":"#N/A"},null,null,null,null,null,null,null,null,0,0,null,null,null,null,null,null,null,null,null,102]
[null,null,null,"",null,null,null,0,0,null,null,22,""]
[44,33,0,"",76,{"$error":"#N/A"}]
[45,33,0,"",21,{"$error":"#N/A"},null,null,null,null,null,null,null,null,null,null,null,null,null,null,null,0,0,null,null,null,""]
[null,null,null,"",null,null,null,0,0,null,null,23,""]
[46,65,47,"E18",108,{"$error":"#N/A"},null,null,null,null,null,null,null,null,null,null,null,null,76]
[47,65,15,"E50",44,{"$error":"#N/A"},null,null,null,null,null,null,null,null,0,0,null,null,null,""]
[null,null,null,"",null,null,null,0,0,null,null,24,""]
[48,9,0,"",85,"BEYOĞLUSPOR (A) (İST)"]
[49,9,0,"",84,"TRAKER SPOR (A) (KRL)"]
[null,null,null,"",null,null,null,0,0,null,null,25,""]
[50,65,11,"E54",45,{"$error":"#N/A"},null,null,null,null,null,null,null,null,null,null,null,null,77,""]
[51,65,43,"E22",109,{"$error":"#N/A"},null,null,null,null,null,null,null,null,0,0,null,null,null,null,null,null,null,null,null,103]
[null,null,null,"",null,null,null,0,0,null,null,26,""]
[52,33,0,"",20,{"$error":"#N/A"}]
[53,33,0,"",77,{"$error":"#N/A"},null,null,null,null,null,null,null,null,null,null,null,null,null,null,null,0,0,null,null,null,""]
[null,null,null,"",null,null,null,0,0,null,null,27,""]
[54,65,59,"E6",52,{"$error":"#N/A"},null,null,null,null,null,null,null,null,null,null,null,null,78]
[55,65,27,"E38",116,{"$error":"#N/A"},null,null,null,null,null,null,null,null,0,0,null,null,null,""]
[null,null,null,"",null,null,null,0,0,null,null,28,""]
[56,17,0,"",13,{"$error":"#N/A"}]
[57,17,0,"",93,{"$error":"#N/A"}]
[null,null,null,"",null,null,null,0,0,null,null,29,""]
[58,65,19,"E46",36,{"$error":"#N/A"},null,null,null,null,null,null,null,null,null,null,null,null,79,""]
[59,65,51,"E14",100,{"$error":"#N/A"},null,null,null,null,null,null,null,null,0,0,null,null,null,null,null,null,null,null,null,104]
[null,null,null,"",null,null,null,0,0,null,null,30,""]
[60,33,0,"",29,{"$error":"#N/A"}]
[61,33,0,"",68,{"$error":"#N/A"},null,null,null,null,null,null,null,null,null,null,null,null,null,null,null,0,0,null,null,null,""]
[null,null,null,"",null,null,null,0,0,null,null,31,""]
[62,65,35,"E30",61,{"$error":"#N/A"},null,null,null,null,null,null,null,null,null,null,null,null,80]
[63,65,3,"E62",125,{"$error":"#N/A"},null,null,null,null,null,null,null,null,0,0,null,null,null,""]
[null,null,null,"",null,null,null,0,0,null,null,32,""]
[64,3,0,"",4,"İSTANBUL BBSK (A) (İST)"]
[65,3,0,"",3,"YILDIZ RAKETLER SPOR (A) (İST)"]
[null,null,null,"",null,null,null,0,0,null,null,33,""]
[66,65,4,"E61",126,"BOYBEYİ SPOR (A) (SKR)",null,null,null,null,null,null,null,null,null,null,null,null,81,""]
[67,65,36,"E29",62,"EDİRNE YURDUM SPOR (B) (EDR)",null,null,null,null,null,null,null,null,0,0,null,null,null,null,null,null,null,null,null,105]
[null,null,null,"",null,null,null,0,0,null,null,34,""]
[68,33,0,"",67,{"$error":"#N/A"}]
[69,33,0,"",30,{"$error":"#N/A"},null,null,null,null,null,null,null,null,null,null,null,null,null,null,null,0,0,null,null,null,""]
[null,null,null,"",null,null,null,0,0,null,null,35,""]
[70,65,52,"E13",99,"YALOVA BLD. SPOR (C) (YLV)",null,null,null,null,null,null,null,null,null,null,null,null,82]
[71,65,20,"E45",35,"GENÇ TRAKYA SPOR (C) (EDR)",null,null,null,null,null,null,null,null,0,0,null,null,null,""]
[null,null,null,"",null,null,null,0,0,null,null,36,""]
[72,17,0,"",94,{"$error":"#N/A"}]
[73,17,0,"",14,{"$error":"#N/A"}]
[null,null,null,"",null,null,null,0,0,null,null,37,""]
[74,65,28,"E37",115,"BALIKESİR B. ŞEHİR BLD. SPOR (C) (BLK)",null,null,null,null,null,null,null,null,null,null,null,null,83,""]
[75,65,60,"E5",51,"TRAKER SPOR (B) (KRL)",null,null,null,null,null,null,null,null,0,0,null,null,null,null,null,null,null,null,null,106]
[null,null,null,"",null,null,null,0,0,null,null,38,""]
[76,33,0,"",78,{"$error":"#N/A"}]
[77,33,0,"",19,{"$error":"#N/A"},null,null,null,null,null,null,null,null,null,null,null,null,null,null,null,0,0,null,null,null,""]
[null,null,null,"",null,null,null,0,0,null,null,39,""]
[78,65,44,"E21",110,"BALIKESİR G.SPOR(A) (BLK)",null,null,null,null,null,null,null,null,null,null,null,null,84]
[79,65,12,"E53",46,"YALOVA GENÇLİK SPOR (A) (YLV)",null,null,null,null,null,null,null,null,0,0,null,null,null,""]
[null,null,null,"",null,null,null,0,0,null,null,40,""]
[80,9,0,"",83,"İSTANBUL BBSK (B) (İST)"]
[81,9,0,"",86,"ÇERKEZKÖY BLD. GSK (A) (TKD)"]
[null,null,null,"",null,null,null,0,0,null,null,41,""]
[82,65,16,"E49",43,{"$error":"#N/A"},null,null,null,null,null,null,null,null,null,null,null,null,85,""]
[83,65,48,"E17",107,{"$error":"#N/A"},null,null,null,null,null,null,null,null,0,0,null,null,null,null,null,null,null,null,null,107]
[null,null,null,"",null,null,null,0,0,null,null,42,""]
[84,33,0,"",22,{"$error":"#N/A"}]
[85,33,0,"",75,{"$error":"#N/A"},null,null,null,null,null,null,null,null,null,null,null,null,null,null,null,0,0,null,null,null,""]
[null,null,null,"",null,null,null,0,0,null,null,43,""]
[86,65,64,"E1",54,{"$error":"#N/A"},null,null,null,null,null,null,null,null,null,null,null,null,86]
[87,65,32,"E33",118,{"$error":"#N/A"},null,null,null,null,null,null,null,null,0,0,null,null,null,""]
[null,null,null,"",null,null,null,0,0,null,null,44,""]
[88,17,0,"",11,{"$error":"#N/A"}]
[89,17,0,"",91,{"$error":"#N/A"}]
[null,null,null,"",null,null,null,0,0,null,null,45,""]
[90,65,24,"E41",38,{"$error":"#N/A"},null,null,null,null,null,null,null,null,null,null,null,null,87,""]
[91,65,56,"E9",102,{"$error":"#N/A"},null,null,null,null,null,null,null,null,0,0,null,null,null,null,null,null,null,null,null,108]
[null,null,null,"",null,null,null,0,0,null,null,46,""]
[92,33,0,"",27,{"$error":"#N/A"}]
[93,33,0,"",70,{"$error":"#N/A"},null,null,null,null,null,null,null,null,null,null,null,null,null,null,null,0,0,null,null,null,""]
[null,null,null,"",null,null,null,0,0,null,null,47,""]
[94,65,40,"E25",59,{"$error":"#N/A"},null,null,null,null,null,null,null,null,null,null,null,null,88]
[95,65,8,"E57",123,{"$error":"#N/A"},null,null,null,null,null,null,null,null,0,0,null,null,null,""]
[null,null,null,"",null,null,null,0,0,null,null,48,""]
[96,5,0,"",6,"İSTANBUL DSİ SPOR (B) (İST)"]
[97,5,0,"",7,"UMUDUMUZ ÖZEL SPORCULAR GSK (A) (BRT)"]
[null,null,null,"",null,null,null,0,0,null,null,49,""]
[98,65,6,"E59",122,{"$error":"#N/A"},null,null,null,null,null,null,null,null,null,null,null,null,89,""]
[99,65,38,"E27",58,{"$error":"#N/A"},null,null,null,null,null,null,null,null,0,0,null,null,null,null,null,null,null,null,null,109]
[null,null,null,"",null,null,null,0,0,null,null,50,""]
[100,33,0,"",71,{"$error":"#N/A"}]
[101,33,0,"",26,{"$error":"#N/A"},null,null,null,null,null,null,null,null,null,null,null,null,null,null,null,0,0,null,null,null,""]
[null,null,null,"",null,null,null,0,0,null,null,51,""]
[102,65,54,"E11",103,{"$error":"#N/A"},null,null,null,null,null,null,null,null,null,null,null,null,90]
[103,65,22,"E43",39,{"$error":"#N/A"},null,null,null,null,null,null,null,null,0,0,null,null,null,""]
[null,null,null,"",null,null,null,0,0,null,null,52,""]
[104,17,0,"",90,{"$error":"#N/A"}]
[105,17,0,"",10,{"$error":"#N/A"}]
[null,null,null,"",null,null,null,0,0,null,null,53,""]
[106,65,30,"E35",119,{"$error":"#N/A"},null,null,null,null,null,null,null,null,null,null,null,null,91,""]
[107,65,62,"E3",55,{"$error":"#N/A"},null,null,null,null,null,null,null,null,0,0,null,null,null,null,null,null,null,null,null,110]
[null,null,null,"",null,null,null,0,0,null,null,54,""]
[108,33,0,"",74,{"$error":"#N/A"}]
[109,33,0,"",23,{"$error":"#N/A"},null,null,null,null,null,null,null,null,null,null,null,null,null,null,null,0,0,null,null,null,""]
[null,null,null,"",null,null,null,0,0,null,null,55,""]
[110,65,46,"E19",106,{"$error":"#N/A"},null,null,null,null,null,null,null,null,null,null,null,null,92]
[111,65,14,"E51",42,{"$error":"#N/A"},null,null,null,null,null,null,null,null,0,0,null,null,null,""]
[null,null,null,"",null,null,null,0,0,null,null,56,""]
[112,9,0,"",87,"GENÇLİKSPOR KIRKLARELİ (B) (KRL)"]
[113,9,0,"",82,"GENÇLİKSPOR KIRKLARELİ (A) (KRL)"]
[null,null,null,"",null,null,null,0,0,null,null,57,""]
[114,65,10,"E55",47,{"$error":"#N/A"},null,null,null,null,null,null,null,null,null,null,null,null,93,""]
[115,65,42,"E23",111,{"$error":"#N/A"},null,null,null,null,null,null,null,null,0,0,null,null,null,null,null,null,null,null,null,111]
[null,null,null,"",null,null,null,0,0,null,null,58,""]
[116,33,0,"",18,{"$error":"#N/A"}]
[117,33,0,"",79,{"$error":"#N/A"},null,null,null,null,null,null,null,null,null,null,null,null,null,null,null,0,0,null,null,null,""]
[null,null,null,"",null,null,null,0,0,null,null,59,""]
[118,65,58,"E7",50,{"$error":"#N/A"},null,null,null,null,null,null,null,null,null,null,null,null,94]
[119,65,26,"E39",114,{"$error":"#N/A"},null,null,null,null,null,null,null,null,0,0,null,null,null,""]
[null,null,null,"",null,null,null,0,0,null,null,60,""]
[120,17,0,"",15,{"$error":"#N/A"}]
[121,17,0,"",95,{"$error":"#N/A"}]
[null,null,null,"",null,null,null,0,0,null,null,61,""]
[122,65,18,"E47",34,{"$error":"#N/A"},null,null,null,null,null,null,null,null,null,null,null,null,95,""]
[123,65,50,"E15",98,{"$error":"#N/A"},null,null,null,null,null,null,null,null,0,0,null,null,null,null,null,null,null,null,null,112]
[null,null,null,"",null,null,null,0,0,null,null,62,""]
[124,33,0,"",31,{"$error":"#N/A"}]
[125,33,0,"",66,{"$error":"#N/A"},null,null,null,null,null,null,null,null,null,null,null,null,null,null,null,0,0,null,null,null,""]
[null,null,null,"",null,null,null,0,0,null,null,63,""]
[126,65,34,"E31",63,{"$error":"#N/A"},null,null,null,null,null,null,null,null,null,null,null,null,96]
[127,65,2,"E63",127,{"$error":"#N/A"},null,null,null,null,null,null,null,null,0,0,null,null,null,""]
[null,null,null,null,null,null,null,0,0,null,null,64,""]
[128,2,0,0,2,"FENERBAHÇE (A) (İST)"]
[]
[]
[1,1,0," ",1,"YALOVA BLD. SPOR (A) (YLV)"]
[null,null,null,null,null,null,null,0,0,null,null,1,""]
[2,33,1,"E32",64,"YALOVA BLD. SPOR (B) (YLV)",null,null,null,null,null,null,null,null,null,null,null,null,33,""]
[3,33,17,"E16",48,"GÖNEN TAYFUNSPOR (A) (BLK)",null,null,null,null,null,null,null,null,0,0,null,null,null,null,null,null,null,null,null,49]
[null,null,null,"",null,null,null,0,0,null,null,2,""]
[4,17,0,"",32,{"$error":"#N/A"}]
[5,17,0,"",17,{"$error":"#N/A"},null,null,null,null,null,null,null,null,null,null,null,null,null,null,null,0,0,null,null,null,""]
[null,null,null,"",null,null,null,0,0,null,null,3,""]
[6,33,25,"E8",33,"BURSA B. ŞEHİR BLD. SPOR (A) (BRS)",null,null,null,null,null,null,null,null,null,null,null,null,34]
[7,33,9,"E24",49,"GENÇ TRAKYA SPOR (C) (EDR)",null,null,null,null,null,null,null,null,0,0,null,null,null,""]
[null,null,null,"",null,null,null,0,0,null,null,4,""]
[8,9," ","",16,"TRAKER SPOR (A) (KRL)"]
[9,9,0,"",9,"LÜLEBURGAZ GENÇLİK SPOR  (A) (KRL)"]
[null,null,null,"",null,null,null,0,0,null,null,5,""]
[10,33,13,"E20",56,"BALIKESİR B. ŞEHİR BLD. SPOR (B) (BLK)",null,null,null,null,null,null,null,null,null,null,null,null,35,""]
[11,33,29,"E4",40,"GENÇ TRAKYA SPOR (A) (EDR)",null,null,null,null,null,null,null,null,0,0,null,null,null,null,null,null,null,null,null,50]
[null,null,null,"",null,null,null,0,0,null,null,6,""]
[12,17,0,"",24,{"$error":"#N/A"}]
[13,17,0,"",25,{"$error":"#N/A"},null,null,null,null,null,null,null,null,null,null,null,null,null,null,null,0,0,null,null,null,""]
[null,null,null,"",null,null,null,0,0,null,null,7,""]
[14,33,21,"E12",41,"LÜLEBURGAZ ZİRVE SPOR  (A) (KRL)",null,null,null,null,null,null,null,null,null,null,null,null,36]
[15,33,5,"E28",57,"EDİRNE YURDUM SPOR (A) (EDR)",null,null,null,null,null,null,null,null,0,0,null,null,null,""]
[null,null,null,"",null,null,null,0,0,null,null,8,""]
[16,5," ","",8,"UMUDUMUZ ÖZEL SPORCULAR GSK (A) (BRT)"]
[17,5,0,"",5,"İSTANBUL DSİ SPOR (A) (İST)"]
[null,null,null,"",null,null,null,0,0,null,null,9,""]
[18,33,7,"E26",60,{"$error":"#N/A"},null,null,null,null,null,null,null,null,null,null,null,null,37,""]
[19,33,23,"E10",44,{"$error":"#N/A"},null,null,null,null,null,null,null,null,0,0,null,null,null,null,null,null,null,null,null,51]
[null,null,null,"",null,null,null,0,0,null,null,10,""]
[20,17,0,"",28,{"$error":"#N/A"}]
[21,17,0,"",21,{"$error":"#N/A"},null,null,null,null,null,null,null,null,null,null,null,null,null,null,null,0,0,null,null,null,""]
[null,null,null,"",null,null,null,0,0,null,null,11,""]
[22,33,31,"E2",37,{"$error":"#N/A"},null,null,null,null,null,null,null,null,null,null,null,null,38]
[23,33,15,"E18",53,{"$error":"#N/A"},null,null,null,null,null,null,null,null,0,0,null,null,null,""]
[null,null,null,"",null,null,null,0,0,null,null,12,""]
[24,9," ","",12,"BEYOĞLUSPOR (A) (İST)"]
[25,9,0,"",13,"YILDIZ RAKETLER SPOR (B) (İST)"]
[null,null,null,"",null,null,null,0,0,null,null,13,""]
[26,33,11,"E22",52,{"$error":"#N/A"},null,null,null,null,null,null,null,null,null,null,null,null,39,""]
[27,33,27,"E6",36,{"$error":"#N/A"},null,null,null,null,null,null,null,null,0,0,null,null,null,null,null,null,null,null,null,52]
[null,null,null,"",null,null,null,0,0,null,null,14,""]
[28,17,0,"",20,{"$error":"#N/A"}]
[29,17,0,"",29,{"$error":"#N/A"},null,null,null,null,null,null,null,null,null,null,null,null,null,null,null,0,0,null,null,null,""]
[null,null,null,"",null,null,null,0,0,null,null,15,""]
[30,33,19,"E14",45,{"$error":"#N/A"},null,null,null,null,null,null,null,null,null,null,null,null,40]
[31,33,3,"E30",61,{"$error":"#N/A"},null,null,null,null,null,null,null,null,0,0,null,null,null,""]
[null,null,null,"",null,null,null,0,0,null,null,16,""]
[32,3," ","",4,"İSTANBUL BBSK (A) (İST)"]
[33,3,0,"",3,"YILDIZ RAKETLER SPOR (A) (İST)"]
[null,null,null,"",null,null,null,0,0,null,null,17,""]
[34,33,4,"E29",62,"BOYBEYİ SPOR (A) (SKR)",null,null,null,null,null,null,null,null,null,null,null,null,41,""]
[35,33,20,"E13",46,"EDİRNE YURDUM SPOR (B) (EDR)",null,null,null,null,null,null,null,null,0,0,null,null,null,null,null,null,null,null,null,53]
[null,null,null,"",null,null,null,0,0,null,null,18,""]
[36,17,0,"",30,{"$error":"#N/A"}]
[37,17,0,"",19,{"$error":"#N/A"},null,null,null,null,null,null,null,null,null,null,null,null,null,null,null,0,0,null,null,null,""]
[null,null,null,"",null,null,null,0,0,null,null,19,""]
[38,33,28,"E5",35,"YALOVA BLD. SPOR (C) (YLV)",null,null,null,null,null,null,null,null,null,null,null,null,42]
[39,33,12,"E21",51,"BALIKESİR B. ŞEHİR BLD. SPOR (A) (BLK)",null,null,null,null,null,null,null,null,0,0,null,null,null,""]
[null,null,null,"",null,null,null,0,0,null,null,20,""]
[40,9," ","",14,"GENÇLİKSPOR KIRKLARELİ (A) (KRL)"]
[41,9,0,"",11,"ÇERKEZKÖY BLD. GSK (A) (TKD)"]
[null,null,null,"",null,null,null,0,0,null,null,21,""]
[42,33,16,"E17",54,"BALIKESİR B. ŞEHİR BLD. SPOR (C) (BLK)",null,null,null,null,null,null,null,null,null,null,null,null,43,""]
[43,33,0,"E1",38,"TRAKER SPOR (B) (KRL)",null,null,null,null,null,null,null,null,0,0,null,null,null,null,null,null,null,null,null,54]
[null,null,null,"",null,null,null,0,0,null,null,22,""]
[44,17,0,"",22,{"$error":"#N/A"}]
[45,17,0,"",27,{"$error":"#N/A"},null,null,null,null,null,null,null,null,null,null,null,null,null,null,null,0,0,null,null,null,""]
[null,null,null,"",null,null,null,0,0,null,null,23,""]
[46,33,24,"E9",43,"BALIKESİR G.SPOR(A) (BLK)",null,null,null,null,null,null,null,null,null,null,null,null,44]
[47,33,8,"E25",59,"YALOVA GENÇLİK SPOR (A) (YLV)",null,null,null,null,null,null,null,null,0,0,null,null,null,""]
[null,null,null,"",null,null,null,0,0,null,null,24,""]
[48,5," ","",6,"İSTANBUL DSİ SPOR (B) (İST)"]
[49,5,0,"",7,"PENDİK BLD. SPOR (A) (İST)"]
[null,null,null,"",null,null,null,0,0,null,null,25,""]
[50,33,6,"E27",58,{"$error":"#N/A"},null,null,null,null,null,null,null,null,null,null,null,null,45,""]
[51,33,22,"E11",42,{"$error":"#N/A"},null,null,null,null,null,null,null,null,0,0,null,null,null,null,null,null,null,null,null,55]
[null,null,null,"",null,null,null,0,0,null,null,26,""]
[52,17,0,"",26,{"$error":"#N/A"}]
[53,17,0,"",23,{"$error":"#N/A"},null,null,null,null,null,null,null,null,null,null,null,null,null,null,null,0,0,null,null,null,""]
[null,null,null,"",null,null,null,0,0,null,null,27,""]
[54,33,14,"E3",39,{"$error":"#N/A"},null,null,null,null,null,null,null,null,null,null,null,null,46]
[55,33,8,"E19",55,{"$error":"#N/A"},null,null,null,null,null,null,null,null,0,0,null,null,null,""]
[null,null,null,"",null,null,null,0,0,null,null,28,""]
[56,9," ","",10,"GENÇLİKSPOR KIRKLARELİ (B) (KRL)"]
[57,9,0,"",15,"İSTANBUL BBSK (B) (İST)"]
[null,null,null,"",null,null,null,0,0,null,null,29,""]
[58,33,10,"E23",50,{"$error":"#N/A"},null,null,null,null,null,null,null,null,null,null,null,null,47,""]
[59,33,26,"E7",34,{"$error":"#N/A"},null,null,null,null,null,null,null,null,0,0,null,null,null,null,null,null,null,null,null,56]
[null,null,null,"",null,null,null,0,0,null,null,30,""]
[60,17,0,"",18,{"$error":"#N/A"}]
[61,17,0,"",31,{"$error":"#N/A"},null,null,null,null,null,null,null,null,null,null,null,null,null,null,null,0,0,null,null,null,""]
[null,null,null,"",null,null,null,0,0,null,null,31,""]
[62,33,18,"E15",47,{"$error":"#N/A"},null,null,null,null,null,null,null,null,null,null,null,null,48]
[63,33,2,"E31",63,{"$error":"#N/A"},null,null,null,null,null,null,null,null,0,0,null,null,null,""]
[null,null,null,null,null,null,null,0,0,null,null,32,""]
[64,2," "," ",2,"FENERBAHÇE (A) (İST)"]
[]
[]
[1,1,0,0,1,"YALOVA BLD. SPOR (A) (YLV)"]
[null,null,null,null,null,null,null,3,0,null,null,1,"YALOVA BLD. SPOR (A) (YLV)"]
[2,17,1,"E16",32,"TRAKER SPOR (B) (KRL)",null,null,null,null,null,null,null,null,null,null,null,null,17,"",null,null,null,null,null,null,1]
[3,17,9,"E8",16,"YALOVA BLD. SPOR (B) (YLV)",null,null,null,null,null,null,null,null,0,0]
[null,null,null,"",null,null,null,3,0,null,null,2,"YALOVA BLD. SPOR (B) (YLV)"]
[4,9,0,"",17,"İSTANBUL BBSK (B) (İST)"]
[5,9,0,"",9,"GENÇLİKSPOR KIRKLARELİ (B) (KRL)"]
[null,null,null,"",null,null,null,3,0,null,null,3,"GENÇLİKSPOR KIRKLARELİ (B) (KRL)"]
[6,17,13,"E4",24,"GENÇ TRAKYA SPOR (C) (EDR)",null,null,null,null,null,null,null,null,null,null,null,null,18]
[7,17,5,"E12",25,"YALOVA GENÇLİK SPOR (A) (YLV)",null,null,null,null,null,null,null,null,0,0,null,null,null,"",null,null,null,null,null,null,2]
[null,null,null,"",null,null,null,0,3,null,null,4,"UMUDUMUZ ÖZEL SPORCULAR GSK (A) (BRT)"]
[8,5,0,"",8,"UMUDUMUZ ÖZEL SPORCULAR GSK (A) (BRT)"]
[9,5,0,"",5,"İSTANBUL DSİ SPOR (B) (İST)"]
[null,null,null,"",null,null,null,3,0,null,null,5,"İSTANBUL DSİ SPOR (B) (İST)"]
[10,17,7,"E10",28,"GENÇ TRAKYA SPOR (A) (EDR)",null,null,null,null,null,null,null,null,null,null,null,null,19,"",null,null,null,null,null,null,3]
[11,17,15,"E2",20,"BALIKESİR G.SPOR(A) (BLK)",null,null,null,null,null,null,null,null,0,0]
[null,null,null,"",null,null,null,3,0,null,null,6,"BALIKESİR G.SPOR(A) (BLK)"]
[12,9,0,"",12,"LÜLEBURGAZ GENÇLİK SPOR  (A) (KRL)"]
[13,9,0,"",13,"GENÇLİKSPOR KIRKLARELİ (A) (KRL)"]
[null,null,null,"",null,null,null,1,3,null,null,7,"YALOVA BLD. SPOR (C) (YLV)"]
[14,17,11,"E6",21,"YALOVA BLD. SPOR (C) (YLV)",null,null,null,null,null,null,null,null,null,null,null,null,20]
[15,17,3,"E14",29,"GÖNEN TAYFUNSPOR (A) (BLK)",null,null,null,null,null,null,null,null,0,0,null,null,null,"",null,null,null,null,null,null,4]
[null,null,null,"",null,null,null,0,3,null,null,8,"İSTANBUL BBSK (A) (İST)"]
[16,3,0,"",4,"İSTANBUL BBSK (A) (İST)"]
[17,3,0,"",3,"YILDIZ RAKETLER SPOR (A) (İST)"]
[null,null,null,"",null,null,null,3,0,null,null,9,"YILDIZ RAKETLER SPOR (A) (İST)"]
[18,17,4,"E13",30,"BALIKESİR B. ŞEHİR BLD. SPOR (C) (BLK)",null,null,null,null,null,null,null,null,null,null,null,null,21,"",null,null,null,null,null,null,5]
[19,17,12,"E5",22,"BALIKESİR B. ŞEHİR BLD. SPOR (B) (BLK)",null,null,null,null,null,null,null,null,0,0]
[null,null,null,"",null,null,null,0,3,null,null,10,"ÇERKEZKÖY BLD. GSK (A) (TKD)"]
[20,9,0,"",11,"ÇERKEZKÖY BLD. GSK (A) (TKD)"]
[21,9,0,"",14,"YILDIZ RAKETLER SPOR (B) (İST)"]
[null,null,null,"",null,null,null,3,0,null,null,11,"YILDIZ RAKETLER SPOR (B) (İST)"]
[22,17,0,"E1",19,"LÜLEBURGAZ ZİRVE SPOR  (A) (KRL)",null,null,null,null,null,null,null,null,null,null,null,null,22]
[23,17,8,"E9",27,"EDİRNE YURDUM SPOR (A) (EDR)",null,null,null,null,null,null,null,null,0,0,null,null,null,"",null,null,null,null,null,null,6]
[null,null,null,"",null,null,null,0,3,null,null,12,"İSTANBUL DSİ SPOR (A) (İST)"]
[24,5,0,"",6,"İSTANBUL DSİ SPOR (A) (İST)"]
[25,5,0,"",7,"PENDİK BLD. SPOR (A) (İST)"]
[null,null,null,"",null,null,null,3,2,null,null,13,"PENDİK BLD. SPOR (A) (İST)"]
[26,17,6,"E11",26,"BURSA B. ŞEHİR BLD. SPOR (A) (BRS)",null,null,null,null,null,null,null,null,null,null,null,null,23,"",null,null,null,null,null,null,7]
[27,17,14,"E3",18,"BALIKESİR B. ŞEHİR BLD. SPOR (A) (BLK)",null,null,null,null,null,null,null,null,0,0]
[null,null,null,"",null,null,null,0,3,null,null,14,"BEYOĞLUSPOR (A) (İST)"]
[28,9,0,"",10,"BEYOĞLUSPOR (A) (İST)"]
[29,9,0,"",15,"TRAKER SPOR (A) (KRL)"]
[null,null,null,"",null,null,null,3,0,null,null,15,"TRAKER SPOR (A) (KRL)"]
[30,17,10,"E7",23,"EDİRNE YURDUM SPOR (B) (EDR)",null,null,null,null,null,null,null,null,null,null,null,null,24]
[31,17,2,"E15",31,"BOYBEYİ SPOR (A) (SKR)",null,null,null,null,null,null,null,null,0,0,null,null,null,"",null,null,null,null,null,null,8]
[null,null,null,null,null,null,null,0,3,null,null,16,"FENERBAHÇE (A) (İST)"]
[32,2,0,0,2,"FENERBAHÇE (A) (İST)"]
[]
[]
[1,1,0,0,1,"YALOVA BLD. SPOR (A) (YLV)"]
[null,null,null,null,null,null,null,0,0,null,null,1,""]
[2,9,1,"E8",16,"YALOVA BLD. SPOR (C) (YLV)"]
[3,9,5,"E4",12,"GÖNEN TAYFUNSPOR (A) (BLK)"]
[null,null,null,"",null,null,null,0,0,null,null,2,""]
[4,5,0,"",8,"PENDİK BLD. SPOR (A) (İST)"]
[5,5,0,"",6,"İSTANBUL DSİ SPOR (B) (İST)"]
[null,null,null,"",null,null,null,0,0,null,null,3,""]
[6,9,7,"E2",10,"BALIKESİR B. ŞEHİR BLD. SPOR (A) (BLK)"]
[7,9,3,"E6",14,"YALOVA BLD. SPOR (B) (YLV)"]
[null,null,null,"",null,null,null,0,0,null,null,4,""]
[8,3,0,"",4,"İSTANBUL BBSK (A) (İST)"]
[9,3,0,"",3,"YILDIZ RAKETLER SPOR (A) (İST)"]
[null,null,null,"",null,null,null,0,0,null,null,5,""]
[10,9,4,"E5",13,"GENÇ TRAKYA SPOR (C) (EDR)"]
[11,9,0,"E1",9,"BURSA B. ŞEHİR BLD. SPOR (A) (BRS)"]
[null,null,null,"",null,null,null,0,0,null,null,6,""]
[12,5,0,"",5,"İSTANBUL DSİ SPOR (A) (İST)"]
[13,5,0,"",7,"UMUDUMUZ ÖZEL SPORCULAR GSK (A) (BRT)"]
[null,null,null,"",null,null,null,0,0,null,null,7,""]
[14,9,6,"E3",11,"EDİRNE YURDUM SPOR (B) (EDR)"]
[15,9,2,"E7",15,"BOYBEYİ SPOR (A) (SKR)"]
[null,null,null,null,null,null,null,0,0,null,null,8,""]
[16,2,0,0,2,"FENERBAHÇE (A) (İST)"]
[]
[]
[1,1,0,0,1,"YALOVA BLD. SPOR (A) (YLV)"]
[null,null,null,null,null,null,null,0,0,null,null,1,""]
[2,9,1,"E8",16,"YALOVA BLD. SPOR (B) (YLV)"]
[3,9,5,"E4",12,"EDİRNE YURDUM SPOR (B) (EDR)"]
[null,null,null,"",null,null,null,0,0,null,null,2,""]
[4,5,0,"",8,"YILDIZ RAKETLER SPOR (A) (İST)"]
[5,5,0,"",6,"İSTANBUL BBSK (A) (İST)"]
[null,null,null,"",null,null,null,0,0,null,null,3,""]
[6,9,7,"E2",10,"BOYBEYİ SPOR (A) (SKR)"]
[7,9,3,"E6",14,"GÖNEN TAYFUNSPOR (A) (BLK)"]
[null,null,null,"",null,null,null,0,0,null,null,4,""]
[8,3,0,"",4,"FENERBAHÇE (A) (İST)"]

{"sheet":"32DE","index":4,"n_rows":98,"n_cols":105,"rows_kept":98,"cut":false,"hidden":true,"merged":[[4,88,4,89],[4,90,4,91],[4,92,4,93],[4,94,4,95],[4,96,4,97],[4,98,4,99],[94,36,94,42],[95,43,95,49],[96,36,96,42],[87,50,87,56],[89,50,89,56],[83,50,83,56],[85,50,85,56],[60,57,60,63],[54,64,54,70],[48,57,48,63],[38,71,38,77],[37,50,37,56],[12,50,12,56],[97,43,97,49],[3,24,4,45],[90,29,90,35],[91,29,91,35],[91,43,91,49],[92,36,92,42],[93,29,93,35],[93,43,93,49],[86,43,86,49],[48,29,48,35],[48,43,48,49],[88,29,88,35],[88,43,88,49],[89,36,89,42],[82,36,82,42],[83,36,83,42],[84,43,84,49],[85,36,85,42],[79,15,79,21],[79,43,79,49],[80,8,80,14],[80,36,80,42],[80,50,80,56],[81,43,81,49],[76,8,76,14],[76,29,76,35],[76,57,76,63],[77,15,77,21],[77,43,77,49],[78,8,78,14],[78,22,78,28],[78,50,78,56],[74,8,74,14],[74,22,74,28],[74,36,74,42],[74,57,74,63],[75,15,75,21],[75,50,75,56],[70,57,70,63],[71,15,71,21],[71,43,71,49],[72,8,72,14],[72,29,72,35],[73,15,73,21],[73,50,73,56],[67,15,67,21],[68,8,68,14],[68,29,68,35],[68,50,68,56],[69,15,69,21],[70,8,70,14],[70,22,70,28],[64,8,64,14],[64,29,64,35],[64,43,64,49],[65,15,65,21],[66,8,66,14],[66,22,66,28],[66,36,66,42],[61,15,61,21],[62,8,62,14],[62,22,62,28],[62,64,62,70],[63,15,63,21],[58,8,58,14],[58,22,58,28],[58,36,58,42],[59,15,59,21],[60,8,60,14],[60,29,60,35],[55,15,55,21],[56,8,56,14],[56,29,56,35],[56,71,56,77],[57,15,57,21],[51,15,51,21],[51,50,51,56],[52,8,52,14],[52,29,52,35],[53,15,53,21],[54,8,54,14],[54,22,54,28],[54,43,54,49],[49,15,49,21],[50,8,50,14],[50,22,50,28],[50,36,50,42],[43,8,43,14],[44,1,44,7],[44,15,44,21],[45,1,45,7],[46,8,46,14],[47,1,47,7],[39,1,39,7],[39,15,39,21],[40,8,40,14],[41,1,41,7],[42,1,42,7],[42,29,42,35],[34,8,34,14],[35,1,35,7],[36,1,36,7],[37,8,37,14],[38,1,38,7],[30,1,30,7],[31,8,31,14],[31,29,31,35],[32,1,32,7],[32,15,32,21],[33,1,33,7],[25,8,25,14],[26,1,26,7],[27,1,27,7],[27,15,27,21],[28,8,28,14],[29,1,29,7],[21,1,21,7],[22,8,22,14],[23,1,23,7],[24,1,24,7],[24,64,24,70],[17,1,17,7],[17,29,17,35],[18,1,18,7],[18,22,18,28],[19,8,19,14],[20,1,20,7],[20,15,20,21],[13,8,13,14],[14,1,14,7],[15,1,15,7],[15,15,15,21],[16,8,16,14],[8,1,8,7],[8,15,8,21],[9,1,9,7],[10,8,10,14],[11,1,11,7],[12,1,12,7],[4,8,4,14],[5,1,5,7],[6,1,6,7],[6,29,6,35],[7,8,7,14],[0,1,0,7],[1,8,1,14],[2,1,2,7],[3,1,3,7],[3,15,3,21],[0,24,2,45]]}
[1,{"$f":"IF(#REF!=2,'ERKEK ELEME'!#REF!,IF(#REF!=3,'ERKEK ELEME'!#REF!,IF(#REF!=4,'ERKEK ELEME'!#REF!,IF(#REF!=5,'ERKEK ELEME'!#REF!))))","v":{"$error":"#REF!"}},null,null,null,null,null,null,null,null,null,null,null,null,null,null,null,null,null,null,null,null,null,null,{"$f":"+KATILIM!A1","v":"TÜRKİYE MASA TENİSİ FEDERASYONU\nYILDIZLAR KUZEYBATI BÖLGE YARIŞMALARI"},null,null,null,null,null,null,null,null,null,null,null,null,null,null,null,null,null,null,null,null,null,null,null,null,null,null,null,null,null,null,null,null,null,null,null,null,null,null,null,null,null,null,null,null,null,null,null,null,null,null,null,null,null,null,null,null,null,null,null,null,null,null,null,null,null,null,null,null,null,null,null,null,null,null,null,null,null,null,"1st Round",1]
[null,null,null,{"$f":"CU6","v":0},{"$f":"CV6","v":0},"Y1",null,1,{"$f":"IF(AND(D2=0,E2=0),\"\",IF(D2>E2,B1,B3))","v":""},null,null,null,null,null,null,null,null,null,null,null,null,null,null,null,null,null,null,null,null,null,null,null,null,null,null,null,null,null,null,null,null,null,null,null,null,null,null,null,null,null,null,null,null,null,null,null,null,null,null,null,null,null,null,null,null,null,null,null,null,null,null,null,null,null,null,null,null,null,null,null,null,null,null,null,null,null,null,null,null,null,null,null,null,null,null,null,null,null,null,null,null,null,null,"2sn Round"]
[2,{"$f":"IF(#REF!=2,'ERKEK ELEME'!#REF!,IF(#REF!=3,'ERKEK ELEME'!#REF!,IF(#REF!=4,'ERKEK ELEME'!#REF!,IF(#REF!=5,'ERKEK ELEME'!#REF!))))","v":{"$error":"#REF!"}},null,null,null,null,null,null,null,null,null,null,null,null,17,null,null,null,null,null,null,null,null,null,null,null,null,null,null,null,null,null,null,null,null,null,null,null,null,null,null,null,null,null,null,null,null,null,null,null,null,null,null,null,null,null,null,null,null,null,null,null,null,null,null,null,null,null,null,null,null,null,null,null,null,null,null,null,null,null,null,null,null,null,null,null,null,null,null,null,null,null,null,null,null,null,null,null,null,null,null,null,null,"3th Round"]
[3,{"$f":"IF(#REF!=2,'ERKEK ELEME'!#REF!,IF(#REF!=3,'ERKEK ELEME'!#REF!,IF(#REF!=4,'ERKEK ELEME'!#REF!,IF(#REF!=5,'ERKEK ELEME'!#REF!))))","v":{"$error":"#REF!"}},null,null,null,null,null,null,null,null,{"$f":"CU22","v":0},{"$f":"CV22","v":0},"Y17",null,null,{"$f":"IF(AND(K4=0,L4=0),\"\",IF(K4>L4,I2,I5))","v":""},null,null,null,null,null,null,null,null,{"$f":"KATILIM!AC2&\" \"&KATILIM!AE3","v":"ERKEK TAKIM  [01-02 Mart 2025 BALIKESİR] [ Ana Tablo ]"},null,null,null,null,null,null,null,null,null,null,null,null,null,null,null,null,null,null,null,null,null,null,null,null,null,null,null,null,null,null,null,null,null,null,null,null,null,null,null,null,null,null,null,null,null,null,null,null,null,null,null,null,null,null,null,null,null,null,null,null,null,null,null,null,null,null,null,null,null,null,null,null,null,null,null,null,null,null,"4th Round"]
[null,null,null,{"$f":"CU7","v":0},{"$f":"CV7","v":0},"Y2",null,2,{"$f":"IF(AND(D5=0,E5=0),\"\",IF(D5>E5,B4,B6))","v":""},null,null,null,null,null,null,null,null,null,null,null,null,33,null,null,null,null,null,null,null,null,null,null,null,null,null,null,null,null,null,null,null,null,null,null,null,null,null,null,null,null,null,null,null,null,null,null,null,null,null,null,null,null,null,null,null,null,null,null,null,null,null,null,null,null,null,null,null,null,null,null,null,"#","Date","Time","Table","Competition","Player A","Player B","Set1",null,"Set2",null,"Set3",null,"Set4",null,"Set5",null,"Result",null,null,null,null,"5th Round"]
[4,{"$f":"IF(#REF!=2,'ERKEK ELEME'!#REF!,IF(#REF!=3,'ERKEK ELEME'!#REF!,IF(#REF!=4,'ERKEK ELEME'!#REF!,IF(#REF!=5,'ERKEK ELEME'!#REF!))))","v":{"$error":"#REF!"}},null,null,null,null,null,null,null,null,null,null,null,null,null,null,null,null,null,null,null,null,null,null,null,null,null,null,null,null,null,null,null,null,null,null,null,null,null,null,null,null,null,null,null,null,null,null,null,null,null,null,null,null,null,null,null,null,null,null,null,null,null,null,null,null,null,null,null,null,null,null,null,null,null,null,null,null,null,null,null,1,null,null,null,null,{"$f":"B1","v":{"$error":"#REF!"}},{"$f":"B3","v":{"$error":"#REF!"}},null,null,null,null,null,null,null,null,null,null,null,null,null,null,null,"6th Round"]
[5,{"$f":"IF(#REF!=2,'ERKEK ELEME'!#REF!,IF(#REF!=3,'ERKEK ELEME'!#REF!,IF(#REF!=4,'ERKEK ELEME'!#REF!,IF(#REF!=5,'ERKEK ELEME'!#REF!))))","v":{"$error":"#REF!"}},null,null,null,null,null,null,null,null,null,null,null,null,null,null,null,{"$f":"CU38","v":0},{"$f":"CV38","v":0},"Y25",null,null,null,null,null,null,null,null,null,{"$f":"IF(AND(R7=0,S7=0),\"\",IF(R7>S7,P4,P9))","v":""},null,null,null,null,null,null,null,null,null,null,null,null,null,null,null,null,null,null,null,null,null,null,null,null,null,null,null,null,null,null,null,null,null,null,null,null,null,null,null,null,null,null,null,null,null,null,null,null,null,null,null,2,null,null,null,null,{"$f":"B4","v":{"$error":"#REF!"}},{"$f":"B6","v":{"$error":"#REF!"}},null,null,null,null,null,null,null,null,null,null,null,null,null,null,null,"7th Round"]
[null,null,null,{"$f":"CU8","v":0},{"$f":"CV8","v":0},"Y3",null,3,{"$f":"IF(AND(D8=0,E8=0),\"\",IF(D8>E8,B7,B9))","v":""},null,null,null,null,null,null,null,null,null,null,null,null,null,null,null,null,null,null,null,null,null,null,null,null,null,null,49,null,null,null,null,null,null,null,null,null,null,null,null,null,null,null,null,null,null,null,null,null,null,null,null,null,null,null,null,null,null,null,null,null,null,null,null,null,null,null,null,null,null,null,null,null,3,null,null,null,null,{"$f":"B7","v":{"$error":"#REF!"}},{"$f":"B9","v":{"$error":"#REF!"}},null,null,null,null,null,null,null,null,null,null,null,null,null,null,null,"8th Round"]
[6,{"$f":"IF(#REF!=2,'ERKEK ELEME'!#REF!,IF(#REF!=3,'ERKEK ELEME'!#REF!,IF(#REF!=4,'ERKEK ELEME'!#REF!,IF(#REF!=5,'ERKEK ELEME'!#REF!))))","v":{"$error":"#REF!"}},null,null,null,null,null,null,null,null,null,null,null,null,18,{"$f":"IF(AND(K10=0,L10=0),\"\",IF(K10>L10,I8,I11))","v":""},null,null,null,null,null,null,null,null,null,null,null,null,null,null,null,null,null,null,null,null,null,null,null,null,null,null,null,null,null,null,null,null,null,null,null,null,null,null,null,null,null,null,null,null,null,null,null,null,null,null,null,null,null,null,null,null,null,null,null,null,null,null,null,null,null,4,null,null,null,null,{"$f":"B10","v":{"$error":"#REF!"}},{"$f":"B12","v":{"$error":"#REF!"}},null,null,null,null,null,null,null,null,null,null,null,null,null,null,null,"9th Round"]
[7,{"$f":"IF(#REF!=2,'ERKEK ELEME'!#REF!,IF(#REF!=3,'ERKEK ELEME'!#REF!,IF(#REF!=4,'ERKEK ELEME'!#REF!,IF(#REF!=5,'ERKEK ELEME'!#REF!))))","v":{"$error":"#REF!"}},null,null,null,null,null,null,null,null,{"$f":"CU23","v":0},{"$f":"CV23","v":0},"Y18",null,null,null,null,null,null,null,null,null,null,null,null,null,null,null,null,null,null,null,null,null,null,null,null,null,null,null,null,null,null,null,null,null,null,null,null,null,null,null,null,null,null,null,null,null,null,null,null,null,null,null,null,null,null,null,null,null,null,null,null,null,null,null,null,null,null,null,null,5,null,null,null,null,{"$f":"B13","v":{"$error":"#REF!"}},{"$f":"B15","v":{"$error":"#REF!"}},null,null,null,null,null,null,null,null,null,null,null,null,null,null,null,"10th Round"]
[null,null,null,{"$f":"CU9","v":0},{"$f":"CV9","v":0},"Y4",null,4,{"$f":"IF(AND(D11=0,E11=0),\"\",IF(D11>E11,B10,B12))","v":""},null,null,null,null,null,null,null,null,null,null,null,null,null,null,null,null,null,null,null,null,null,null,null,null,null,null,null,null,null,null,null,null,null,null,null,null,null,null,null,null,null,null,null,null,null,null,null,null,null,null,null,null,null,null,null,null,null,null,null,null,null,null,null,null,null,null,null,null,null,null,null,null,6,null,null,null,null,{"$f":"B16","v":{"$error":"#REF!"}},{"$f":"B18","v":{"$error":"#REF!"}}]
[8,{"$f":"IF(#REF!=2,'ERKEK ELEME'!#REF!,IF(#REF!=3,'ERKEK ELEME'!#REF!,IF(#REF!=4,'ERKEK ELEME'!#REF!,IF(#REF!=5,'ERKEK ELEME'!#REF!))))","v":{"$error":"#REF!"}},null,null,null,null,null,null,null,null,null,null,null,null,null,null,null,null,null,null,null,null,null,null,null,null,null,null,null,null,null,null,null,null,null,null,null,null,null,null,null,null,null,null,null,null,null,null,null,null,null,null,null,null,null,null,null,null,null,null,null,null,null,null,null,null,null,null,null,null,null,null,null,null,null,null,null,null,null,null,null,7,null,null,null,null,{"$f":"B19","v":{"$error":"#REF!"}},{"$f":"B21","v":{"$error":"#REF!"}}]
[9,{"$f":"IF(#REF!=2,'ERKEK ELEME'!#REF!,IF(#REF!=3,'ERKEK ELEME'!#REF!,IF(#REF!=4,'ERKEK ELEME'!#REF!,IF(#REF!=5,'ERKEK ELEME'!#REF!))))","v":{"$error":"#REF!"}},null,null,null,null,null,null,null,null,null,null,null,null,null,null,null,null,null,null,null,null,null,null,null,null,null,null,null,null,null,{"$f":"CU54","v":0},{"$f":"CV54","v":0},"Y29",null,null,null,null,null,null,null,null,null,null,null,null,null,null,null,null,{"$f":"IF(AND(AF13=0,AG13=0),\"\",IF(AF13>AG13,AD7,AD18))","v":""},null,null,null,null,null,null,null,null,null,null,null,null,null,null,null,null,null,null,null,null,null,null,null,null,null,null,null,null,null,null,8,null,null,null,null,{"$f":"B22","v":{"$error":"#REF!"}},{"$f":"B24","v":{"$error":"#REF!"}}]
[null,null,null,{"$f":"CU10","v":0},{"$f":"CV10","v":0},"Y5",null,5,{"$f":"IF(AND(D14=0,E14=0),\"\",IF(D14>E14,B13,B15))","v":""},null,null,null,null,null,null,null,null,null,null,null,null,null,null,null,null,null,null,null,null,null,null,null,null,null,null,null,null,null,null,null,null,null,null,null,null,null,null,null,null,null,null,null,null,null,null,null,68,null,null,null,null,null,null,null,null,null,null,null,null,null,null,null,null,null,null,null,null,null,null,null,null,9,null,null,null,null,{"$f":"B25","v":{"$error":"#REF!"}},{"$f":"B27","v":{"$error":"#REF!"}}]
[10,{"$f":"IF(#REF!=2,'ERKEK ELEME'!#REF!,IF(#REF!=3,'ERKEK ELEME'!#REF!,IF(#REF!=4,'ERKEK ELEME'!#REF!,IF(#REF!=5,'ERKEK ELEME'!#REF!))))","v":{"$error":"#REF!"}},null,null,null,null,null,null,null,null,null,null,null,null,19,null,null,null,null,null,null,null,null,null,null,null,null,null,null,null,null,null,null,null,null,null,null,null,null,null,null,null,null,null,null,null,null,null,null,null,null,null,null,null,null,null,null,null,null,null,null,null,null,null,null,null,null,null,null,null,null,null,null,null,null,null,null,null,null,null,null,10,null,null,null,null,{"$f":"B28","v":{"$error":"#REF!"}},{"$f":"B30","v":{"$error":"#REF!"}}]
[11,{"$f":"IF(#REF!=2,'ERKEK ELEME'!#REF!,IF(#REF!=3,'ERKEK ELEME'!#REF!,IF(#REF!=4,'ERKEK ELEME'!#REF!,IF(#REF!=5,'ERKEK ELEME'!#REF!))))","v":{"$error":"#REF!"}},null,null,null,null,null,null,null,null,{"$f":"CU24","v":0},{"$f":"CV24","v":0},"Y19",null,null,{"$f":"IF(AND(K16=0,L16=0),\"\",IF(K16>L16,I14,I17))","v":""},null,null,null,null,null,null,null,null,null,null,null,null,null,null,null,null,null,null,null,null,null,null,null,null,null,null,null,null,null,null,null,null,null,null,null,null,null,null,null,null,null,null,null,null,null,null,null,null,null,null,null,null,null,null,null,null,null,null,null,null,null,null,null,null,null,11,null,null,null,null,{"$f":"B31","v":{"$error":"#REF!"}},{"$f":"B33","v":{"$error":"#REF!"}}]
[null,null,null,{"$f":"CU11","v":0},{"$f":"CV11","v":0},"Y6",null,6,{"$f":"IF(AND(D17=0,E17=0),\"\",IF(D17>E17,B16,B18))","v":""},null,null,null,null,null,null,null,null,null,null,null,null,34,null,null,null,null,null,null,null,null,null,null,null,null,null,null,null,null,null,null,null,null,null,null,null,null,null,null,null,null,null,null,null,null,null,null,null,null,null,null,null,null,null,null,null,null,null,null,null,null,null,null,null,null,null,null,null,null,null,null,null,12,null,null,null,null,{"$f":"B34","v":{"$error":"#REF!"}},{"$f":"B36","v":{"$error":"#REF!"}}]
[12,{"$f":"IF(#REF!=2,'ERKEK ELEME'!#REF!,IF(#REF!=3,'ERKEK ELEME'!#REF!,IF(#REF!=4,'ERKEK ELEME'!#REF!,IF(#REF!=5,'ERKEK ELEME'!#REF!))))","v":{"$error":"#REF!"}},null,null,null,null,null,null,null,null,null,null,null,null,null,null,null,null,null,null,null,null,null,null,null,null,null,null,null,{"$f":"IF(AND(R19=0,S19=0),\"\",IF(R19>S19,P16,P21))","v":""},null,null,null,null,null,null,null,null,null,null,null,null,null,null,null,null,null,null,null,null,null,null,null,null,null,null,null,null,null,null,null,null,null,null,null,null,null,null,null,null,null,null,null,null,null,null,null,null,null,null,null,13,null,null,null,null,{"$f":"B37","v":{"$error":"#REF!"}},{"$f":"B39","v":{"$error":"#REF!"}}]
[13,{"$f":"IF(#REF!=2,'ERKEK ELEME'!#REF!,IF(#REF!=3,'ERKEK ELEME'!#REF!,IF(#REF!=4,'ERKEK ELEME'!#REF!,IF(#REF!=5,'ERKEK ELEME'!#REF!))))","v":{"$error":"#REF!"}},null,null,null,null,null,null,null,null,null,null,null,null,null,null,null,{"$f":"CU39","v":0},{"$f":"CV39","v":0},"Y26",null,null,null,null,null,null,null,null,null,null,null,null,null,null,null,null,null,null,null,null,null,null,null,null,null,null,null,null,null,null,null,null,null,null,null,null,null,null,null,null,null,null,null,null,null,null,null,null,null,null,null,null,null,null,null,null,null,null,null,null,null,14,null,null,null,null,{"$f":"B40","v":{"$error":"#REF!"}},{"$f":"B42","v":{"$error":"#REF!"}}]
[null,null,null,{"$f":"CU12","v":0},{"$f":"CV12","v":0},"Y7",null,7,{"$f":"IF(AND(D20=0,E20=0),\"\",IF(D20>E20,B19,B21))","v":""},null,null,null,null,null,null,null,null,null,null,null,null,null,null,null,null,null,null,null,null,null,null,null,null,null,null,null,null,null,null,null,null,null,null,null,null,null,null,null,null,null,null,null,null,null,null,null,null,null,null,null,null,null,null,null,null,null,null,null,null,null,null,null,null,null,null,null,null,null,null,null,null,15,null,null,null,null,{"$f":"B43","v":{"$error":"#REF!"}},{"$f":"B45","v":{"$error":"#REF!"}}]
[14,{"$f":"IF(#REF!=2,'ERKEK ELEME'!#REF!,IF(#REF!=3,'ERKEK ELEME'!#REF!,IF(#REF!=4,'ERKEK ELEME'!#REF!,IF(#REF!=5,'ERKEK ELEME'!#REF!))))","v":{"$error":"#REF!"}},null,null,null,null,null,null,null,null,null,null,null,null,20,{"$f":"IF(AND(K22=0,L22=0),\"\",IF(K22>L22,I20,I23))","v":""},null,null,null,null,null,null,null,null,null,null,null,null,null,null,null,null,null,null,null,null,null,null,null,null,null,null,null,null,null,null,null,null,null,null,null,null,null,null,null,null,null,null,null,null,null,null,null,null,null,null,null,null,null,null,null,null,null,null,null,null,null,null,null,null,null,16,null,null,null,null,{"$f":"B46","v":{"$error":"#REF!"}},{"$f":"B48","v":{"$error":"#REF!"}}]
[15,{"$f":"IF(#REF!=2,'ERKEK ELEME'!#REF!,IF(#REF!=3,'ERKEK ELEME'!#REF!,IF(#REF!=4,'ERKEK ELEME'!#REF!,IF(#REF!=5,'ERKEK ELEME'!#REF!))))","v":{"$error":"#REF!"}},null,null,null,null,null,null,null,null,{"$f":"CU25","v":0},{"$f":"CV25","v":0},"Y20",null,null,null,null,null,null,null,null,null,null,null,null,null,null,null,null,null,null,null,null,null,null,null,null,null,null,null,null,null,null,null,null,null,null,null,null,null,null,null,null,null,null,null,null,null,null,null,null,null,null,null,null,null,null,null,null,null,null,null,null,null,null,null,null,null,null,null,null,17,null,null,null,null,{"$f":"I2","v":""},{"$f":"I5","v":""}]
[null,null,null,{"$f":"CU13","v":0},{"$f":"CV13","v":0},"Y8",null,8,{"$f":"IF(AND(D23=0,E23=0),\"\",IF(D23>E23,B22,B24))","v":""},null,null,null,null,null,null,null,null,null,null,null,null,null,null,null,null,null,null,null,null,null,null,null,null,null,null,null,null,null,null,null,null,null,null,null,null,null,null,null,null,null,null,null,null,null,null,null,null,null,null,null,null,null,null,null,null,null,null,null,null,null,null,null,null,null,null,null,null,null,null,null,null,18,null,null,null,null,{"$f":"I8","v":""},{"$f":"I11","v":""}]
[16,{"$f":"IF(#REF!=2,'ERKEK ELEME'!#REF!,IF(#REF!=3,'ERKEK ELEME'!#REF!,IF(#REF!=4,'ERKEK ELEME'!#REF!,IF(#REF!=5,'ERKEK ELEME'!#REF!))))","v":{"$error":"#REF!"}},null,null,null,null,null,null,null,null,null,null,null,null,null,null,null,null,null,null,null,null,null,null,null,null,null,null,null,null,null,null,null,null,null,null,null,null,null,null,null,null,null,null,null,null,null,null,null,null,null,null,null,null,null,null,null,null,null,null,null,null,null,null,null,null,null,null,null,null,null,null,null,null,null,null,null,null,null,null,null,19,null,null,null,null,{"$f":"I14","v":""},{"$f":"I17","v":""}]
[17,{"$f":"IF(#REF!=2,'ERKEK ELEME'!#REF!,IF(#REF!=3,'ERKEK ELEME'!#REF!,IF(#REF!=4,'ERKEK ELEME'!#REF!,IF(#REF!=5,'ERKEK ELEME'!#REF!))))","v":{"$error":"#REF!"}},null,null,null,null,null,null,null,null,null,null,null,null,null,{"$f":"IF(AND(K22=0,L22=0),\"\",IF(K22<L22,I20,I23))","v":""},null,null,null,null,null,null,null,null,null,null,null,null,null,null,null,null,null,null,null,null,null,null,null,null,null,null,null,null,null,null,null,null,null,null,null,null,{"$f":"CU73","v":0},{"$f":"CV73","v":0},"Y31",null,null,null,null,null,null,null,null,null,{"$f":"IF(AND(BA25=0,BB25=0),\"\",IF(BA25>BB25,AY13,AY38))","v":""},null,null,null,null,null,null,null,null,null,null,null,null,null,null,null,null,20,null,null,null,null,{"$f":"I20","v":""},{"$f":"I23","v":""}]
[null,null,null,{"$f":"CU14","v":0},{"$f":"CV14","v":0},"Y9",null,9,{"$f":"IF(AND(D26=0,E26=0),\"\",IF(D26>E26,B25,B27))","v":""},null,null,null,null,null,null,null,null,null,null,null,null,null,null,null,null,null,null,null,null,null,null,null,null,null,null,null,null,null,null,null,null,null,null,null,null,null,null,null,null,null,null,null,null,null,null,null,null,null,null,null,null,null,null,null,null,null,null,null,null,null,72,null,null,null,null,null,null,null,null,null,null,21,null,null,null,null,{"$f":"I26","v":""},{"$f":"I29","v":""}]
[18,{"$f":"IF(#REF!=2,'ERKEK ELEME'!#REF!,IF(#REF!=3,'ERKEK ELEME'!#REF!,IF(#REF!=4,'ERKEK ELEME'!#REF!,IF(#REF!=5,'ERKEK ELEME'!#REF!))))","v":{"$error":"#REF!"}},null,null,null,null,null,null,null,null,null,null,null,null,21,null,null,null,null,null,null,null,null,null,null,null,null,null,null,null,null,null,null,null,null,null,null,null,null,null,null,null,null,null,null,null,null,null,null,null,null,null,null,null,null,null,null,null,null,null,null,null,null,null,null,null,null,null,null,null,null,null,null,null,null,null,null,null,null,null,null,22,null,null,null,null,{"$f":"I32","v":""},{"$f":"I35","v":""}]
[19,{"$f":"IF(#REF!=2,'ERKEK ELEME'!#REF!,IF(#REF!=3,'ERKEK ELEME'!#REF!,IF(#REF!=4,'ERKEK ELEME'!#REF!,IF(#REF!=5,'ERKEK ELEME'!#REF!))))","v":{"$error":"#REF!"}},null,null,null,null,null,null,null,null,{"$f":"CU26","v":0},{"$f":"CV26","v":0},"Y21",null,null,{"$f":"IF(AND(K28=0,L28=0),\"\",IF(K28>L28,I26,I29))","v":""},null,null,null,null,null,null,null,null,null,null,null,null,null,null,null,null,null,null,null,null,null,null,null,null,null,null,null,null,null,null,null,null,null,null,null,null,null,null,null,null,null,null,null,null,null,null,null,null,null,null,null,null,null,null,null,null,null,null,null,null,null,null,null,null,null,23,null,null,null,null,{"$f":"I38","v":""},{"$f":"I41","v":""}]
[null,null,null,{"$f":"CU15","v":0},{"$f":"CV15","v":0},"Y10",null,10,{"$f":"IF(AND(D29=0,E29=0),\"\",IF(D29>E29,B28,B30))","v":""},null,null,null,null,null,null,null,null,null,null,null,null,35,null,null,null,null,null,null,null,null,null,null,null,null,null,null,null,null,null,null,null,null,null,null,null,null,null,null,null,null,null,null,null,null,null,null,null,null,null,null,null,null,null,null,null,null,null,null,null,null,null,null,null,null,null,null,null,null,null,null,null,24,null,null,null,null,{"$f":"I44","v":""},{"$f":"I47","v":""}]
[20,{"$f":"IF(#REF!=2,'ERKEK ELEME'!#REF!,IF(#REF!=3,'ERKEK ELEME'!#REF!,IF(#REF!=4,'ERKEK ELEME'!#REF!,IF(#REF!=5,'ERKEK ELEME'!#REF!))))","v":{"$error":"#REF!"}},null,null,null,null,null,null,null,null,null,null,null,null,null,null,null,null,null,null,null,null,null,null,null,null,null,null,null,null,null,null,null,null,null,null,null,null,null,null,null,null,null,null,null,null,null,null,null,null,null,null,null,null,null,null,null,null,null,null,null,null,null,null,null,null,null,null,null,null,null,null,null,null,null,null,null,null,null,null,null,25,null,null,null,null,{"$f":"I51","v":""},{"$f":"I53","v":""}]
[21,{"$f":"IF(#REF!=2,'ERKEK ELEME'!#REF!,IF(#REF!=3,'ERKEK ELEME'!#REF!,IF(#REF!=4,'ERKEK ELEME'!#REF!,IF(#REF!=5,'ERKEK ELEME'!#REF!))))","v":{"$error":"#REF!"}},null,null,null,null,null,null,null,null,null,null,null,null,null,null,null,{"$f":"CU40","v":0},{"$f":"CV40","v":0},"Y27",null,null,null,null,null,null,null,null,null,null,null,null,null,null,null,null,null,null,null,null,null,null,null,null,null,null,null,null,null,null,null,null,null,null,null,null,null,null,null,null,null,null,null,null,null,null,null,null,null,null,null,null,null,null,null,null,null,null,null,null,null,26,null,null,null,null,{"$f":"I55","v":""},{"$f":"I57","v":""}]
[null,null,null,{"$f":"CU16","v":0},{"$f":"CV16","v":0},"Y11",null,11,{"$f":"IF(AND(D32=0,E32=0),\"\",IF(D32>E32,B31,B33))","v":""},null,null,null,null,null,null,null,null,null,null,null,null,null,null,null,null,null,null,null,null,{"$f":"IF(AND(R31=0,S31=0),\"\",IF(R31>S31,P28,P33))","v":""},null,null,null,null,null,null,null,null,null,null,null,null,null,null,null,null,null,null,null,null,null,null,null,null,null,null,null,null,null,null,null,null,null,null,null,null,null,null,null,null,null,null,null,null,null,null,null,null,null,null,null,27,null,null,null,null,{"$f":"I59","v":""},{"$f":"I61","v":""}]
[22,{"$f":"IF(#REF!=2,'ERKEK ELEME'!#REF!,IF(#REF!=3,'ERKEK ELEME'!#REF!,IF(#REF!=4,'ERKEK ELEME'!#REF!,IF(#REF!=5,'ERKEK ELEME'!#REF!))))","v":{"$error":"#REF!"}},null,null,null,null,null,null,null,null,null,null,null,null,22,{"$f":"IF(AND(K34=0,L34=0),\"\",IF(K34>L34,I32,I35))","v":""},null,null,null,null,null,null,null,null,null,null,null,null,null,null,null,null,null,null,null,50,null,null,null,null,null,null,null,null,null,null,null,null,null,null,null,null,null,null,null,null,null,null,null,null,null,null,null,null,null,null,null,null,null,null,null,null,null,null,null,null,null,null,null,null,null,28,null,null,null,null,{"$f":"I63","v":""},{"$f":"I65","v":""}]
[23,{"$f":"IF(#REF!=2,'ERKEK ELEME'!#REF!,IF(#REF!=3,'ERKEK ELEME'!#REF!,IF(#REF!=4,'ERKEK ELEME'!#REF!,IF(#REF!=5,'ERKEK ELEME'!#REF!))))","v":{"$error":"#REF!"}},null,null,null,null,null,null,null,null,{"$f":"CU27","v":0},{"$f":"CV27","v":0},"Y22",null,null,null,null,null,null,null,null,null,null,null,null,null,null,null,null,null,null,null,null,null,null,null,null,null,null,null,null,null,null,null,null,null,null,null,null,null,null,null,null,null,null,null,null,null,null,null,null,null,null,null,null,null,null,null,null,null,null,null,null,null,null,null,null,null,null,null,null,29,null,null,null,null,{"$f":"I67","v":""},{"$f":"I69","v":""}]
[null,null,null,{"$f":"CU17","v":0},{"$f":"CV17","v":0},"Y12",null,12,{"$f":"IF(AND(D35=0,E35=0),\"\",IF(D35>E35,B34,B36))","v":""},null,null,null,null,null,null,null,null,null,null,null,null,null,null,null,null,null,null,null,null,null,null,null,null,null,null,null,null,null,null,null,null,null,null,null,null,null,null,null,null,null,null,null,null,null,null,null,null,null,null,null,null,null,null,null,null,null,null,null,null,null,null,null,null,null,null,null,null,null,null,null,null,30,null,null,null,null,{"$f":"I71","v":""},{"$f":"I73","v":""}]
[24,{"$f":"IF(#REF!=2,'ERKEK ELEME'!#REF!,IF(#REF!=3,'ERKEK ELEME'!#REF!,IF(#REF!=4,'ERKEK ELEME'!#REF!,IF(#REF!=5,'ERKEK ELEME'!#REF!))))","v":{"$error":"#REF!"}},null,null,null,null,null,null,null,null,null,null,null,null,null,null,null,null,null,null,null,null,null,null,null,null,null,null,null,null,null,null,null,null,null,null,null,null,null,null,null,null,null,null,null,null,null,null,null,null,null,null,null,null,null,null,null,null,null,null,null,null,null,null,null,null,null,null,null,null,null,null,null,null,null,null,null,null,null,null,null,31,null,null,null,null,{"$f":"I75","v":""},{"$f":"I77","v":""}]
[25,{"$f":"IF(#REF!=2,'ERKEK ELEME'!#REF!,IF(#REF!=3,'ERKEK ELEME'!#REF!,IF(#REF!=4,'ERKEK ELEME'!#REF!,IF(#REF!=5,'ERKEK ELEME'!#REF!))))","v":{"$error":"#REF!"}},null,null,null,null,null,null,null,null,null,null,null,null,null,null,null,null,null,null,null,null,null,null,null,null,null,null,null,null,null,null,null,null,null,null,null,null,null,null,null,null,null,null,null,null,null,null,null,null,null,null,null,null,null,null,null,null,null,null,null,null,null,null,null,null,null,null,null,null,null,null,null,null,null,null,null,null,null,null,null,32,null,null,null,null,{"$f":"I79","v":""},{"$f":"I81","v":""}]
[null,null,null,{"$f":"CU18","v":0},{"$f":"CV18","v":0},"Y13",null,13,{"$f":"IF(AND(D38=0,E38=0),\"\",IF(D38>E38,B37,B39))","v":""},null,null,null,null,null,null,null,null,null,null,null,null,null,null,null,null,null,null,null,null,null,null,{"$f":"CU55","v":0},{"$f":"CV55","v":0},"Y30",null,null,null,null,null,null,null,null,null,null,null,null,null,null,null,null,{"$f":"IF(AND(AF38=0,AG38=0),\"\",IF(AF38>AG38,AD32,AD43))","v":""},null,null,null,null,null,null,null,null,null,null,null,null,null,null,null,null,null,null,null,null,null,null,null,null,null,null,null,null,null,null,33,null,null,null,null,{"$f":"P4","v":""},{"$f":"P9","v":""}]
[26,{"$f":"IF(#REF!=2,'ERKEK ELEME'!#REF!,IF(#REF!=3,'ERKEK ELEME'!#REF!,IF(#REF!=4,'ERKEK ELEME'!#REF!,IF(#REF!=5,'ERKEK ELEME'!#REF!))))","v":{"$error":"#REF!"}},null,null,null,null,null,null,null,null,null,null,null,null,23,null,null,null,null,null,null,null,null,null,null,null,null,null,null,null,null,null,null,null,null,null,null,null,null,null,null,null,null,null,null,null,null,null,null,null,null,null,null,null,null,null,null,null,null,null,null,null,null,null,null,null,{"$f":"CU77","v":0},{"$f":"CV77","v":0},"Y32",null,null,{"$f":"IF(AND(BO39=0,BP39=0),\"\",IF(BO39>BP39,BM25,BM55))","v":""},null,null,null,null,null,null,"1.",null,null,34,null,null,null,null,{"$f":"P16","v":""},{"$f":"P21","v":""}]
[27,{"$f":"IF(#REF!=2,'ERKEK ELEME'!#REF!,IF(#REF!=3,'ERKEK ELEME'!#REF!,IF(#REF!=4,'ERKEK ELEME'!#REF!,IF(#REF!=5,'ERKEK ELEME'!#REF!))))","v":{"$error":"#REF!"}},null,null,null,null,null,null,null,null,{"$f":"CU28","v":0},{"$f":"CV28","v":0},"Y23",null,null,{"$f":"IF(AND(K40=0,L40=0),\"\",IF(K40>L40,I38,I41))","v":""},null,null,null,null,null,null,null,null,null,null,null,null,null,null,null,null,null,null,null,null,null,null,null,null,null,null,null,null,null,null,null,null,null,null,null,null,null,null,null,null,null,null,null,null,null,null,null,null,null,null,null,null,null,null,null,null,null,null,null,null,null,null,null,null,null,35,null,null,null,null,{"$f":"P28","v":""},{"$f":"P33","v":""}]
[null,null,null,{"$f":"CU19","v":0},{"$f":"CV19","v":0},"Y14",null,14,{"$f":"IF(AND(D41=0,E41=0),\"\",IF(D41>E41,B40,B42))","v":""},null,null,null,null,null,null,null,null,null,null,null,null,36,null,null,null,null,null,null,null,null,null,null,null,null,null,null,null,null,null,null,null,null,null,null,null,null,null,null,null,null,null,null,null,null,null,null,null,null,null,null,null,null,null,null,null,null,null,null,null,null,null,null,null,null,null,null,null,null,null,null,null,36,null,null,null,null,{"$f":"P40","v":""},{"$f":"P45","v":""}]
[28,{"$f":"IF(#REF!=2,'ERKEK ELEME'!#REF!,IF(#REF!=3,'ERKEK ELEME'!#REF!,IF(#REF!=4,'ERKEK ELEME'!#REF!,IF(#REF!=5,'ERKEK ELEME'!#REF!))))","v":{"$error":"#REF!"}},null,null,null,null,null,null,null,null,null,null,null,null,null,null,null,null,null,null,null,null,null,null,null,null,null,null,null,null,null,null,null,null,null,null,null,null,null,null,null,null,null,null,null,null,null,null,null,null,null,null,null,null,null,null,null,null,null,null,null,null,null,null,null,null,null,null,null,null,null,null,null,null,null,null,null,null,null,null,null,37,null,null,null,null,{"$f":"P50","v":""},{"$f":"P52","v":""}]
[29,{"$f":"IF(#REF!=2,'ERKEK ELEME'!#REF!,IF(#REF!=3,'ERKEK ELEME'!#REF!,IF(#REF!=4,'ERKEK ELEME'!#REF!,IF(#REF!=5,'ERKEK ELEME'!#REF!))))","v":{"$error":"#REF!"}},null,null,null,null,null,null,null,null,null,null,null,null,null,null,null,{"$f":"CU41","v":0},{"$f":"CV41","v":0},"Y28",null,null,null,null,null,null,null,null,null,{"$f":"IF(AND(R43=0,S43=0),\"\",IF(R43>S43,P40,P45))","v":""},null,null,null,null,null,null,null,null,null,null,null,null,null,null,null,null,null,null,null,null,null,null,null,null,null,null,null,null,null,null,null,null,null,null,null,null,null,null,null,null,null,null,null,null,null,null,null,null,null,null,null,38,null,null,null,null,{"$f":"P54","v":""},{"$f":"P56","v":""}]
[null,null,null,{"$f":"CU20","v":0},{"$f":"CV20","v":0},"Y15",null,15,{"$f":"IF(AND(D44=0,E44=0),\"\",IF(D44>E44,B43,B45))","v":""},null,null,null,null,null,null,null,null,null,null,null,null,null,null,null,null,null,null,null,null,null,null,null,null,null,null,null,null,null,null,null,null,null,null,null,null,null,null,null,null,null,null,null,null,null,null,null,null,null,null,null,null,null,null,null,null,null,null,null,null,null,null,null,null,null,null,null,null,null,null,null,null,39,null,null,null,null,{"$f":"P58","v":""},{"$f":"P60","v":""}]
[30,{"$f":"IF(#REF!=2,'ERKEK ELEME'!#REF!,IF(#REF!=3,'ERKEK ELEME'!#REF!,IF(#REF!=4,'ERKEK ELEME'!#REF!,IF(#REF!=5,'ERKEK ELEME'!#REF!))))","v":{"$error":"#REF!"}},null,null,null,null,null,null,null,null,null,null,null,null,24,{"$f":"IF(AND(K46=0,L46=0),\"\",IF(K46>L46,I44,I47))","v":""},null,null,null,null,null,null,null,null,null,null,null,null,null,null,null,null,null,null,null,null,null,null,null,null,null,null,null,null,null,null,null,null,null,null,null,null,null,null,null,null,null,null,null,null,null,null,null,null,null,null,null,null,null,null,null,null,null,null,null,null,null,null,null,null,null,40,null,null,null,null,{"$f":"P62","v":""},{"$f":"P64","v":""}]
[31,{"$f":"IF(#REF!=2,'ERKEK ELEME'!#REF!,IF(#REF!=3,'ERKEK ELEME'!#REF!,IF(#REF!=4,'ERKEK ELEME'!#REF!,IF(#REF!=5,'ERKEK ELEME'!#REF!))))","v":{"$error":"#REF!"}},null,null,null,null,null,null,null,null,{"$f":"CU29","v":0},{"$f":"CV29","v":0},"Y24",null,null,null,null,null,null,null,null,null,null,null,null,null,null,null,null,null,null,null,null,null,null,null,null,null,null,null,null,null,null,null,null,null,null,null,null,null,null,null,null,null,null,null,null,null,null,null,null,null,null,null,null,null,null,null,null,null,null,null,null,null,null,null,null,null,null,null,null,41,null,null,null,null,{"$f":"P66","v":""},{"$f":"P68","v":""}]
[null,null,null,{"$f":"CU21","v":0},{"$f":"CV21","v":0},"Y16",null,16,{"$f":"IF(AND(D47=0,E47=0),\"\",IF(D47>E47,B46,B48))","v":""},null,null,null,null,null,null,null,null,null,null,null,null,null,null,null,null,null,null,null,null,null,null,null,null,null,null,null,null,null,null,null,null,null,null,null,null,null,null,null,null,null,null,null,null,null,null,null,null,null,null,null,null,null,null,null,null,null,null,null,null,null,null,null,null,null,null,null,null,null,null,null,null,42,null,null,null,null,{"$f":"P70","v":""},{"$f":"P72","v":""}]
[32,{"$f":"IF(#REF!=2,'ERKEK ELEME'!#REF!,IF(#REF!=3,'ERKEK ELEME'!#REF!,IF(#REF!=4,'ERKEK ELEME'!#REF!,IF(#REF!=5,'ERKEK ELEME'!#REF!))))","v":{"$error":"#REF!"}},null,null,null,null,null,null,null,null,null,null,null,null,null,null,null,null,null,null,null,null,null,null,null,null,null,null,null,null,null,null,null,null,null,null,null,null,null,null,null,null,null,null,null,null,null,null,null,null,null,null,null,null,null,null,null,null,null,null,null,null,null,null,null,null,null,null,null,null,null,null,null,null,null,null,null,null,null,null,null,43,null,null,null,null,{"$f":"P74","v":""},{"$f":"P76","v":""}]
[null,null,null,null,null,null,null,null,null,null,null,null,null,null,null,null,null,null,null,null,null,null,null,null,null,null,null,null,"Y25",{"$f":"IF(AND(R7=0,S7=0),\"\",IF(R7<S7,P4,P9))","v":""},null,null,null,null,null,null,null,null,null,null,null,null,"Y30",{"$f":"IF(AND(AF38=0,AG38=0),\"\",IF(AF38<AG38,AD32,AD43))","v":""},null,null,null,null,null,null,null,null,null,null,null,null,"Y31",{"$f":"IF(AND(BA25=0,BB25=0),\"\",IF(BA25<BB25,AY13,AY38))","v":""},null,null,null,null,null,null,null,null,null,null,null,null,null,null,null,null,null,null,null,null,null,null,null,44,null,null,null,null,{"$f":"P78","v":""},{"$f":"P80","v":""}]
[null,null,null,null,null,null,null,null,null,null,null,null,null,null,"Y24",{"$f":"IF(AND(K46=0,L46=0),\"\",IF(K46<L46,I44,I47))","v":""},null,null,null,null,null,null,null,null,null,null,null,null,null,null,null,null,null,null,null,51,null,null,null,null,null,null,null,null,null,null,null,null,null,63,null,null,null,null,null,null,null,null,null,null,null,null,null,71,null,null,null,null,null,null,null,null,null,null,null,null,null,null,null,null,null,45,null,null,null,null,{"$f":"W51","v":""},{"$f":"W55","v":""}]
[null,null,null,null,null,null,null,"Y1",{"$f":"IF(AND(D2=0,E2=0),\"\",IF(D2<E2,B1,B3))","v":""},null,null,null,null,null,null,null,null,{"$f":"CU42","v":0},{"$f":"CV42","v":0},"YE",null,37,{"$f":"IF(AND(R51=0,S51=0),\"\",IF(R51>S51,P50,P52))","v":""},null,null,null,null,null,null,null,null,{"$f":"CU56","v":0},{"$f":"CV56","v":0},"Y37",null,null,{"$f":"IF(AND(AF51=0,AG51=0),\"\",IF(AF51>AG51,AD49,AD53))","v":""},null,null,null,null,null,null,null,null,null,null,null,null,null,null,null,null,null,null,null,null,null,null,null,null,null,null,null,null,null,null,null,null,null,null,null,null,null,null,null,null,null,null,null,null,46,null,null,null,null,{"$f":"W59","v":""},{"$f":"W63","v":""}]
[null,null,null,null,null,null,null,null,null,null,{"$f":"CU30","v":0},{"$f":"CV30","v":0},"Y.Elenir",null,25,{"$f":"IF(AND(K52=0,L52=0),\"\",IF(K52>L52,I51,I53))","v":""},null,null,null,null,null,null,null,null,null,null,null,null,45,null,null,null,null,null,null,null,null,null,null,null,null,null,57,null,null,null,null,null,null,null,{"$f":"IF(AND(AT53=0,AU53=0),\"\",IF(AT53>AU53,AR49,AR55))","v":""},null,null,null,null,null,null,null,null,null,null,null,null,null,null,null,null,null,null,null,null,null,null,null,null,null,null,null,null,null,null,47,null,null,null,null,{"$f":"W67","v":""},{"$f":"W71","v":""}]
[null,null,null,null,null,null,null,"Y2",{"$f":"IF(AND(D5=0,E5=0),\"\",IF(D5<E5,B4,B6))","v":""},null,null,null,null,null,null,null,null,null,null,null,null,null,null,null,null,{"$f":"CU50","v":0},{"$f":"CV50","v":0},"Y33",null,{"$f":"IF(AND(Z53=0,AA53=0),\"\",IF(Z53>AA53,W51,W55))","v":""},null,null,null,null,null,null,null,null,null,null,null,null,null,null,null,{"$f":"CU68","v":0},{"$f":"CV68","v":0},"Y43",null,null,null,null,null,null,null,null,69,null,null,null,null,null,null,null,null,null,null,null,null,null,null,null,null,null,null,null,null,null,null,null,null,48,null,null,null,null,{"$f":"W75","v":""},{"$f":"W79","v":""}]
[null,null,null,null,null,null,null,null,null,null,null,null,null,null,"Y23",{"$f":"IF(AND(K40=0,L40=0),\"\",IF(K40<L40,I38,I41))","v":""},null,null,null,null,null,null,null,null,null,null,null,null,null,null,null,null,null,null,null,null,null,null,null,null,null,null,null,null,null,null,null,null,null,null,null,null,null,null,null,null,null,null,null,null,null,null,null,null,null,null,null,null,null,null,null,null,null,null,null,null,null,null,null,null,null,49,null,null,null,null,{"$f":"AD7","v":""},{"$f":"AD18","v":""}]
[null,null,null,null,null,null,null,"Y3",{"$f":"IF(AND(D8=0,E8=0),\"\",IF(D8<E8,B7,B9))","v":""},null,null,null,null,null,null,null,null,{"$f":"CU43","v":0},{"$f":"CV43","v":0},"YE",null,38,{"$f":"IF(AND(R55=0,S55=0),\"\",IF(R55>S55,P54,P56))","v":""},null,null,null,null,null,null,null,null,null,null,null,null,null,null,null,null,null,null,null,null,{"$f":"IF(AND(AM56=0,AN56=0),\"\",IF(AM56>AN56,AK51,AK59))","v":""},null,null,null,null,null,null,null,null,null,null,null,null,null,null,null,null,{"$f":"CU76","v":0},{"$f":"CV76","v":0},"Y46",null,{"$f":"IF(AND(BI55=0,BJ55=0),\"\",IF(BI55>BJ55,BF49,BF61))","v":""},null,null,null,null,null,null,null,null,null,null,null,null,null,null,null,null,50,null,null,null,null,{"$f":"AD32","v":""},{"$f":"AD43","v":""}]
[null,null,null,null,null,null,null,null,null,null,{"$f":"CU31","v":0},{"$f":"CV31","v":0},"YE",null,26,{"$f":"IF(AND(K56=0,L56=0),\"\",IF(K56>L56,I55,I57))","v":""},null,null,null,null,null,null,null,null,null,null,null,null,null,null,null,null,null,null,null,null,null,null,{"$f":"CU62","v":0},{"$f":"CV62","v":0},"Y41",null,null,null,null,null,null,null,null,null,null,null,null,null,null,null,null,null,null,null,null,null,null,null,null,null,null,null,null,null,null,null,null,null,null,null,null,null,null,null,null,51,null,null,null,null,{"$f":"AD49","v":""},{"$f":"AD53","v":""}]
[null,null,null,null,null,null,null,"Y4",{"$f":"IF(AND(D11=0,E11=0),\"\",IF(D11<E11,B10,B12))","v":""},null,null,null,null,null,null,null,null,null,null,null,null,null,null,null,null,null,null,null,"Y26",{"$f":"IF(AND(R19=0,S19=0),\"\",IF(R19<S19,P16,P21))","v":""},null,null,null,null,null,null,null,null,null,null,null,null,null,null,null,null,null,null,null,null,null,null,null,null,null,null,null,null,null,null,null,null,null,null,null,null,null,null,null,null,"Y32",{"$f":"IF(AND(BO39=0,BP39=0),\"\",IF(BO39<BP39,BM25,BM55))","v":""},null,null,null,null,null,null,"2.",null,null,52,null,null,null,null,{"$f":"AD57","v":""},{"$f":"AD61","v":""}]
[null,null,null,null,null,null,null,null,null,null,null,null,null,null,"Y22",{"$f":"IF(AND(K34=0,L34=0),\"\",IF(K34<L34,I32,I35))","v":""},null,null,null,null,null,null,null,null,null,null,null,null,null,null,null,null,null,null,null,52,null,null,null,null,null,null,null,null,null,null,null,null,null,null,null,null,null,null,null,null,null,null,null,null,null,null,null,null,null,null,null,null,null,null,null,null,null,null,null,null,null,null,null,null,null,53,null,null,null,null,{"$f":"AD65","v":""},{"$f":"AD69","v":""}]
[null,null,null,null,null,null,null,"Y5",{"$f":"IF(AND(D14=0,E14=0),\"\",IF(D14<E14,B13,B15))","v":""},null,null,null,null,null,null,null,null,{"$f":"CU44","v":0},{"$f":"CV44","v":0},"YE",null,39,{"$f":"IF(AND(R59=0,S59=0),\"\",IF(R59>S59,P58,P60))","v":""},null,null,null,null,null,null,null,null,{"$f":"CU57","v":0},{"$f":"CV57","v":0},"Y38",null,null,{"$f":"IF(AND(AF59=0,AG59=0),\"\",IF(AF59>AG59,AD57,AD61))","v":""},null,null,null,null,null,null,null,null,null,null,null,null,null,null,null,null,null,null,null,null,null,null,null,null,null,null,null,null,null,null,null,null,null,null,null,null,null,null,null,null,null,null,null,null,54,null,null,null,null,{"$f":"AD73","v":""},{"$f":"AD77","v":""}]
[null,null,null,null,null,null,null,null,null,null,{"$f":"CU32","v":0},{"$f":"CV32","v":0},"YE",null,27,{"$f":"IF(AND(K60=0,L60=0),\"\",IF(K60>L60,I59,I61))","v":""},null,null,null,null,null,null,null,null,null,null,null,null,46,null,null,null,null,null,null,null,null,null,null,null,null,null,null,null,null,null,null,null,null,null,null,null,null,null,null,null,null,null,null,null,null,null,null,null,null,null,null,null,null,null,null,null,null,null,null,null,null,null,null,null,null,55,null,null,null,null,{"$f":"AD89","v":""},{"$f":"AD91","v":""}]
[null,null,null,null,null,null,null,"Y6",{"$f":"IF(AND(D17=0,E17=0),\"\",IF(D17<E17,B16,B18))","v":""},null,null,null,null,null,null,null,null,null,null,null,null,null,null,null,null,{"$f":"CU51","v":0},{"$f":"CV51","v":0},"Y34",null,{"$f":"IF(AND(Z61=0,AA61=0),\"\",IF(Z61>AA61,W59,W63))","v":""},null,null,null,null,null,null,null,null,null,null,null,null,null,null,null,null,null,null,null,null,null,null,{"$f":"CU74","v":0},{"$f":"CV74","v":0},"Y45",null,null,{"$f":"IF(AND(BA61=0,BB61=0),\"\",IF(BA61>BB61,AY52,AY69))","v":""},null,null,null,null,null,null,null,null,null,null,null,null,null,null,null,null,null,null,null,null,null,null,null,56,null,null,null,null,{"$f":"AD92","v":""},{"$f":"AD94","v":""}]
[null,null,null,null,null,null,null,null,null,null,null,null,null,null,"Y21",{"$f":"IF(AND(K28=0,L28=0),\"\",IF(K28<L28,I26,I29))","v":""},null,null,null,null,null,null,null,null,null,null,null,null,null,null,null,null,null,null,null,null,null,null,null,null,null,null,null,null,null,null,null,null,null,null,null,null,null,null,null,null,null,null,null,null,null,null,null,null,null,null,null,null,null,null,null,null,null,null,null,null,null,null,null,null,null,57,null,null,null,null,{"$f":"AK51","v":""},{"$f":"AK59","v":""}]
[null,null,null,null,null,null,null,"Y7",{"$f":"IF(AND(D20=0,E20=0),\"\",IF(D20<E20,B19,B21))","v":""},null,null,null,null,null,null,null,null,{"$f":"CU45","v":0},{"$f":"CV45","v":0},"YE",null,40,{"$f":"IF(AND(R63=0,S63=0),\"\",IF(R63>S63,P62,P64))","v":""},null,null,null,null,null,null,null,null,null,null,null,null,null,null,null,null,null,null,null,null,null,null,null,null,null,null,null,null,null,null,null,null,null,null,null,null,null,null,null,null,"Y46",{"$f":"IF(AND(BI55=0,BJ55=0),\"\",IF(BI55<BJ55,BF49,BF61))","v":""},null,null,null,null,null,null,"3.",null,null,null,null,null,null,null,null,null,58,null,null,null,null,{"$f":"AK67","v":""},{"$f":"AK75","v":""}]
[null,null,null,null,null,null,null,null,null,null,{"$f":"CU33","v":0},{"$f":"CV33","v":0},"YE",null,28,{"$f":"IF(AND(K64=0,L64=0),\"\",IF(K64>L64,I63,I65))","v":""},null,null,null,null,null,null,null,null,null,null,null,null,null,null,null,null,null,null,null,null,null,null,null,null,null,null,null,null,null,null,null,null,null,null,null,null,null,null,null,null,null,null,null,null,null,null,null,null,null,null,null,null,null,null,null,null,null,null,null,null,null,null,null,null,null,59,null,null,null,null,{"$f":"AK81","v":""},{"$f":"AK83","v":""}]
[null,null,null,null,null,null,null,"Y8",{"$f":"IF(AND(D23=0,E23=0),\"\",IF(D23<E23,B22,B24))","v":""},null,null,null,null,null,null,null,null,null,null,null,null,null,null,null,null,null,null,null,"Y27",{"$f":"IF(AND(R31=0,S31=0),\"\",IF(R31<S31,P28,P33))","v":""},null,null,null,null,null,null,null,null,null,null,null,null,"Y29",{"$f":"IF(AND(AF13=0,AG13=0),\"\",IF(AF13<AG13,AD7,AD18))","v":""},null,null,null,null,null,null,null,null,null,null,null,null,null,null,null,null,null,null,null,null,null,null,null,null,null,null,null,null,null,null,null,null,null,null,null,null,null,60,null,null,null,null,{"$f":"AK84","v":""},{"$f":"AK86","v":""}]
[null,null,null,null,null,null,null,null,null,null,null,null,null,null,"Y20",{"$f":"IF(AND(K22=0,L22=0),\"\",IF(K22<L22,I20,I23))","v":""},null,null,null,null,null,null,null,null,null,null,null,null,null,null,null,null,null,null,null,53,null,null,null,null,null,null,null,null,null,null,null,null,null,64,null,null,null,null,null,null,null,null,null,null,null,null,null,null,null,null,null,null,null,null,null,null,null,null,null,null,null,null,null,null,null,61,null,null,null,null,{"$f":"AK90","v":""},{"$f":"AK93","v":""}]
[null,null,null,null,null,null,null,"Y9",{"$f":"IF(AND(D26=0,E26=0),\"\",IF(D26<E26,B25,B27))","v":""},null,null,null,null,null,null,null,null,{"$f":"CU46","v":0},{"$f":"CV46","v":0},"YE",null,41,{"$f":"IF(AND(R67=0,S67=0),\"\",IF(R67>S67,P66,P68))","v":""},null,null,null,null,null,null,null,null,{"$f":"CU58","v":0},{"$f":"CV58","v":0},"Y39",null,null,{"$f":"IF(AND(AF67=0,AG67=0),\"\",IF(AF67>AG67,AD65,AD69))","v":""},null,null,null,null,null,null,null,null,null,null,null,null,null,null,null,null,null,null,null,null,null,null,null,null,null,null,null,null,null,null,null,null,null,null,null,null,null,null,null,null,null,null,null,null,62,null,null,null,null,{"$f":"AK95","v":""},{"$f":"AK97","v":""}]
[null,null,null,null,null,null,null,null,null,null,{"$f":"CU34","v":0},{"$f":"CV34","v":0},"YE",null,29,{"$f":"IF(AND(K68=0,L68=0),\"\",IF(K68>L68,I67,I69))","v":""},null,null,null,null,null,null,null,null,null,null,null,null,47,null,null,null,null,null,null,null,null,null,null,null,null,null,null,null,null,null,null,null,null,null,null,null,null,null,null,null,null,null,null,null,null,null,null,null,null,null,null,null,null,null,null,null,null,null,null,null,null,null,null,null,null,63,null,null,null,null,{"$f":"AR49","v":""},{"$f":"AR55","v":""}]
[null,null,null,null,null,null,null,"Y10",{"$f":"IF(AND(D29=0,E29=0),\"\",IF(D29<E29,B28,B30))","v":""},null,null,null,null,null,null,null,null,null,null,null,null,null,null,null,null,{"$f":"CU52","v":0},{"$f":"CV52","v":0},"Y35",null,{"$f":"IF(AND(Z69=0,AA69=0),\"\",IF(Z69>AA69,W67,W71))","v":""},null,null,null,null,null,null,null,null,null,null,null,null,58,null,null,{"$f":"CU69","v":0},{"$f":"CV69","v":0},"Y44",null,null,{"$f":"IF(AND(AT69=0,AU69=0),\"\",IF(AT69>AU69,AR65,AR72))","v":""},null,null,null,null,null,null,null,null,null,null,null,null,null,null,null,null,null,null,null,null,null,null,null,null,null,null,null,null,null,null,64,null,null,null,null,{"$f":"AR65","v":""},{"$f":"AR72","v":""}]
[null,null,null,null,null,null,null,null,null,null,null,null,null,null,"Y19",{"$f":"IF(AND(K16=0,L16=0),\"\",IF(K16<L16,I14,I17))","v":""},null,null,null,null,null,null,null,null,null,null,null,null,null,null,null,null,null,null,null,null,null,null,null,null,null,null,null,null,null,null,null,null,null,null,null,null,null,null,null,null,null,null,null,null,null,null,null,null,null,null,null,null,null,null,null,null,null,null,null,null,null,null,null,null,null,65,null,null,null,null,{"$f":"AR78","v":""},{"$f":"AR80","v":""}]
[null,null,null,null,null,null,null,"Y11",{"$f":"IF(AND(D32=0,E32=0),\"\",IF(D32<E32,B31,B33))","v":""},null,null,null,null,null,null,null,null,{"$f":"CU47","v":0},{"$f":"CV47","v":0},"YE",null,42,{"$f":"IF(AND(R71=0,S71=0),\"\",IF(R71>S71,P70,P72))","v":""},null,null,null,null,null,null,null,null,null,null,null,null,null,null,null,null,null,null,null,null,null,null,null,null,null,null,null,null,null,null,null,null,null,"Y45",{"$f":"IF(AND(BA61=0,BB61=0),\"\",IF(BA61<BB61,AY52,AY69))","v":""},null,null,null,null,null,null,"4.",null,null,null,null,null,null,null,null,null,null,null,null,null,null,null,null,66,null,null,null,null,{"$f":"AR82","v":""},{"$f":"AR85","v":""}]
[null,null,null,null,null,null,null,null,null,null,{"$f":"CU35","v":0},{"$f":"CV35","v":0},"YE",null,30,{"$f":"IF(AND(K72=0,L72=0),\"\",IF(K72>L72,I71,I73))","v":""},null,null,null,null,null,null,null,null,null,null,null,null,null,null,null,null,null,null,null,null,null,null,{"$f":"CU63","v":0},{"$f":"CV63","v":0},"Y42",null,null,{"$f":"IF(AND(AM72=0,AN72=0),\"\",IF(AM72>AN72,AK67,AK75))","v":""},null,null,null,null,null,null,null,null,null,null,null,null,null,null,null,null,null,null,null,null,null,null,null,null,null,null,null,null,null,null,null,null,null,null,null,null,null,67,null,null,null,null,{"$f":"AR87","v":""},{"$f":"AR89","v":""}]
[null,null,null,null,null,null,null,"Y12",{"$f":"IF(AND(D35=0,E35=0),\"\",IF(D35<E35,B34,B36))","v":""},null,null,null,null,null,null,null,null,null,null,null,null,null,null,null,null,null,null,null,"Y28",{"$f":"IF(AND(R43=0,S43=0),\"\",IF(R43<S43,P40,P45))","v":""},null,null,null,null,null,null,null,null,null,null,null,null,null,null,null,null,null,null,null,null,null,null,null,null,null,null,null,null,null,null,null,null,null,null,null,null,null,null,null,null,null,null,null,null,null,null,null,null,null,null,null,68,null,null,null,null,{"$f":"AY13","v":""},{"$f":"AY38","v":""}]
[null,null,null,null,null,null,null,null,null,null,null,null,null,null,"Y18",{"$f":"IF(AND(K10=0,L10=0),\"\",IF(K10<L10,I8,I11))","v":""},null,null,null,null,null,null,null,null,null,null,null,null,null,null,null,null,null,null,null,54,null,null,null,null,null,null,null,null,null,null,null,null,null,"Y43",{"$f":"IF(AND(AT53=0,AU53=0),\"\",IF(AT53<AU53,AR49,AR55))","v":""},null,null,null,null,null,null,null,null,null,null,null,null,null,null,null,null,null,null,null,null,null,null,null,null,null,null,null,null,null,null,69,null,null,null,null,{"$f":"AY52","v":""},{"$f":"AY69","v":""}]
[null,null,null,null,null,null,null,"Y13",{"$f":"IF(AND(D38=0,E38=0),\"\",IF(D38<E38,B37,B39))","v":""},null,null,null,null,null,null,null,null,{"$f":"CU48","v":0},{"$f":"CV48","v":0},"YE",null,43,{"$f":"IF(AND(R75=0,S75=0),\"\",IF(R75>S75,P74,P76))","v":""},null,null,null,null,null,null,null,null,{"$f":"CU59","v":0},{"$f":"CV59","v":0},"Y40",null,null,{"$f":"IF(AND(AF75=0,AG75=0),\"\",IF(AF75>AG75,AD73,AD77))","v":""},null,null,null,null,null,null,null,null,null,null,null,null,null,null,null,{"$f":"CU75","v":0},{"$f":"CV75","v":0},"Y56",null,70,{"$f":"IF(AND(BA75=0,BB75=0),\"\",IF(BA75>BB75,AY74,AY76))","v":""},null,null,null,null,null,null,"5.",null,null,null,null,null,null,null,null,null,null,null,null,null,null,null,null,70,null,null,null,null,{"$f":"AY74","v":""},{"$f":"AY76","v":""}]
[null,null,null,null,null,null,null,null,null,null,{"$f":"CU36","v":0},{"$f":"CV36","v":0},"YE",null,31,{"$f":"IF(AND(K76=0,L76=0),\"\",IF(K76>L76,I75,I77))","v":""},null,null,null,null,null,null,null,null,null,null,null,null,48,null,null,null,null,null,null,null,null,null,null,null,null,null,null,null,null,null,null,null,null,"Y44",{"$f":"IF(AND(AT69=0,AU69=0),\"\",IF(AT69<AU69,AR65,AR72))","v":""},null,null,null,null,null,null,null,null,null,null,null,null,null,null,null,null,null,null,null,null,null,null,null,null,null,null,null,null,null,null,71,null,null,null,null,{"$f":"BF49","v":""},{"$f":"BF61","v":""}]
[null,null,null,null,null,null,null,"Y14",{"$f":"IF(AND(D41=0,E41=0),\"\",IF(D41<E41,B40,B42))","v":""},null,null,null,null,null,null,null,null,null,null,null,null,null,null,null,null,{"$f":"CU53","v":0},{"$f":"CV53","v":0},"Y36",null,{"$f":"IF(AND(Z77=0,AA77=0),\"\",IF(Z77>AA77,W75,W79))","v":""},null,null,null,null,null,null,null,null,null,null,null,null,null,null,null,null,null,null,null,null,null,null,null,null,null,null,"Y56",{"$f":"IF(AND(BA75=0,BB75=0),\"\",IF(BA75<BB75,AY74,AY76))","v":""},null,null,null,null,null,null,"6.",null,null,null,null,null,null,null,null,null,null,null,null,null,null,null,null,72,null,null,null,null,{"$f":"BM25","v":""},{"$f":"BM55","v":""}]
[null,null,null,null,null,null,null,null,null,null,null,null,null,null,"Y17",{"$f":"IF(AND(K4=0,L4=0),\"\",IF(K4<L4,I2,I5))","v":""},null,null,null,null,null,null,null,null,null,null,null,null,null,null,null,null,null,null,null,null,null,null,null,null,null,null,"Y41",{"$f":"IF(AND(AM56=0,AN56=0),\"\",IF(AM56<AN56,AK51,AK59))","v":""}]
[null,null,null,null,null,null,null,"Y15",{"$f":"IF(AND(D44=0,E44=0),\"\",IF(D44<E44,B43,B45))","v":""},null,null,null,null,null,null,null,null,{"$f":"CU49","v":0},{"$f":"CV49","v":0},"YE",null,44,{"$f":"IF(AND(R79=0,S79=0),\"\",IF(R79>S79,P78,P80))","v":""},null,null,null,null,null,null,null,null,null,null,null,null,null,null,null,null,null,null,null,null,null,null,{"$f":"CU70","v":0},{"$f":"CV70","v":0},"Y53",null,65,{"$f":"IF(AND(AT79=0,AU79=0),\"\",IF(AT79>AU79,AR78,AR80))","v":""},null,null,null,null,null,null,"7."]
[null,null,null,null,null,null,null,null,null,null,{"$f":"CU37","v":0},{"$f":"CV37","v":0},"YE",null,32,{"$f":"IF(AND(K80=0,L80=0),\"\",IF(K80>L80,I79,I81))","v":""},null,null,null,null,null,null,null,null,null,null,null,null,null,null,null,null,null,null,null,null,null,null,null,null,null,null,"Y42",{"$f":"IF(AND(AM72=0,AN72=0),\"\",IF(AM72<AN72,AK67,AK75))","v":""}]
[null,null,null,null,null,null,null,"Y16",{"$f":"IF(AND(D47=0,E47=0),\"\",IF(D47<E47,B46,B48))","v":""},null,null,null,null,null,null,null,null,null,null,null,null,null,null,null,null,null,null,null,null,null,null,null,null,null,null,"Y37",{"$f":"IF(AND(AF51=0,AG51=0),\"\",IF(AF51<AG51,AD49,AD53))","v":""},null,null,null,null,null,null,null,null,null,null,null,null,"Y53",{"$f":"IF(AND(AT79=0,AU79=0),\"\",IF(AT79<AU79,AR78,AR80))","v":""},null,null,null,null,null,null,"8."]
[null,null,null,null,null,null,null,null,null,null,null,null,null,null,null,null,null,null,null,null,null,null,null,null,null,null,null,null,null,null,null,null,null,null,null,null,null,null,{"$f":"CU64","v":0},{"$f":"CV64","v":0},"Y49",null,59,{"$f":"IF(AND(AM82=0,AN82=0),\"\",IF(AM82>AN82,AK81,AK83))","v":""}]
[null,null,null,null,null,null,null,null,null,null,null,null,null,null,null,null,null,null,null,null,null,null,null,null,null,null,null,null,null,null,null,null,null,null,null,"Y38",{"$f":"IF(AND(AF59=0,AG59=0),\"\",IF(AF59<AG59,AD57,AD61))","v":""},null,null,null,null,null,null,null,null,null,null,null,null,66]
[null,null,null,null,null,null,null,null,null,null,null,null,null,null,null,null,null,null,null,null,null,null,null,null,null,null,null,null,null,null,null,null,null,null,null,"Y39",{"$f":"IF(AND(AF67=0,AG67=0),\"\",IF(AF67<AG67,AD65,AD69))","v":""},null,null,null,null,null,null,null,null,{"$f":"CU71","v":0},{"$f":"CV71","v":0},"Y54",null,null,{"$f":"IF(AND(AT84=0,AU84=0),\"\",IF(AT84>AU84,AR82,AR85))","v":""},null,null,null,null,null,null,"9."]
[null,null,null,null,null,null,null,null,null,null,null,null,null,null,null,null,null,null,null,null,null,null,null,null,null,null,null,null,null,null,null,null,null,null,null,null,null,null,{"$f":"CU65","v":0},{"$f":"CV65","v":0},"Y50",null,60,{"$f":"IF(AND(AM85=0,AN85=0),\"\",IF(AM85>AN85,AK84,AK86))","v":""}]
[null,null,null,null,null,null,null,null,null,null,null,null,null,null,null,null,null,null,null,null,null,null,null,null,null,null,null,null,null,null,null,null,null,null,null,"Y40",{"$f":"IF(AND(AF75=0,AG75=0),\"\",IF(AF75<AG75,AD73,AD77))","v":""},null,null,null,null,null,null,null,null,null,null,null,null,"Y54",{"$f":"IF(AND(AT84=0,AU84=0),\"\",IF(AT84<AU84,AR82,AR85))","v":""},null,null,null,null,null,null,"10."]
[null,null,null,null,null,null,null,null,null,null,null,null,null,null,null,null,null,null,null,null,null,null,null,null,null,null,null,null,null,null,null,null,null,null,null,null,null,null,null,null,null,null,"Y49",{"$f":"IF(AND(AM82=0,AN82=0),\"\",IF(AM82<AN82,AK81,AK83))","v":""}]
[null,null,null,null,null,null,null,null,null,null,null,null,null,null,null,null,null,null,null,null,null,null,null,null,null,null,null,null,null,null,null,null,null,null,null,null,null,null,null,null,null,null,null,null,null,{"$f":"CU72","v":0},{"$f":"CV72","v":0},"Y55",null,67,{"$f":"IF(AND(AT88=0,AU88=0),\"\",IF(AT88>AU88,AR87,AR89))","v":""},null,null,null,null,null,null,"11."]
[null,null,null,null,null,null,null,null,null,null,null,null,null,null,null,null,null,null,null,null,null,null,null,null,null,null,null,null,"Y33",{"$f":"IF(AND(Z53=0,AA53=0),\"\",IF(Z53<AA53,W51,W55))","v":""},null,null,null,null,null,null,null,null,null,null,null,null,"Y50",{"$f":"IF(AND(AM85=0,AN85=0),\"\",IF(AM85<AN85,AK84,AK86))","v":""}]
[null,null,null,null,null,null,null,null,null,null,null,null,null,null,null,null,null,null,null,null,null,null,null,null,null,null,null,null,null,null,null,{"$f":"CU60","v":0},{"$f":"CV60","v":0},"Y47",null,55,{"$f":"IF(AND(AF90=0,AG90=0),\"\",IF(AF90>AG90,AD89,AD91))","v":""},null,null,null,null,null,null,null,null,null,null,null,null,"Y55",{"$f":"IF(AND(AT88=0,AU88=0),\"\",IF(AT88<AU88,AR87,AR89))","v":""},null,null,null,null,null,null,"12."]
[null,null,null,null,null,null,null,null,null,null,null,null,null,null,null,null,null,null,null,null,null,null,null,null,null,null,null,null,"Y34",{"$f":"IF(AND(Z61=0,AA61=0),\"\",IF(Z61<AA61,W59,W63))","v":""},null,null,null,null,null,null,null,null,null,null,null,null,61]
[null,null,null,null,null,null,null,null,null,null,null,null,null,null,null,null,null,null,null,null,null,null,null,null,null,null,null,null,"Y35",{"$f":"IF(AND(Z69=0,AA69=0),\"\",IF(Z69<AA69,W67,W71))","v":""},null,null,null,null,null,null,null,null,{"$f":"CU66","v":0},{"$f":"CV66","v":0},"Y51",null,null,{"$f":"IF(AND(AM92=0,AN92=0),\"\",IF(AM92>AN92,AK90,AK93))","v":""},null,null,null,null,null,null,"13."]
[null,null,null,null,null,null,null,null,null,null,null,null,null,null,null,null,null,null,null,null,null,null,null,null,null,null,null,null,null,null,null,{"$f":"CU61","v":0},{"$f":"CV61","v":0},"Y48",null,56,{"$f":"IF(AND(AF93=0,AG93=0),\"\",IF(AF93>AG93,AD92,AD94))","v":""}]
[null,null,null,null,null,null,null,null,null,null,null,null,null,null,null,null,null,null,null,null,null,null,null,null,null,null,null,null,"Y36",{"$f":"IF(AND(Z77=0,AA77=0),\"\",IF(Z77<AA77,W75,W79))","v":""},null,null,null,null,null,null,null,null,null,null,null,null,"Y51",{"$f":"IF(AND(AM92=0,AN92=0),\"\",IF(AM92<AN92,AK90,AK93))","v":""},null,null,null,null,null,null,"14."]
[null,null,null,null,null,null,null,null,null,null,null,null,null,null,null,null,null,null,null,null,null,null,null,null,null,null,null,null,null,null,null,null,null,null,null,"Y47",{"$f":"IF(AND(AF90=0,AG90=0),\"\",IF(AF90<AG90,AD89,AD91))","v":""}]
[null,null,null,null,null,null,null,null,null,null,null,null,null,null,null,null,null,null,null,null,null,null,null,null,null,null,null,null,null,null,null,null,null,null,null,null,null,null,{"$f":"CU67","v":0},{"$f":"CV67","v":0},"Y52",null,62,{"$f":"IF(AND(AM96=0,AN96=0),\"\",IF(AM96>AN96,AK95,AK97))","v":""},null,null,null,null,null,null,"15."]
[null,null,null,null,null,null,null,null,null,null,null,null,null,null,null,null,null,null,null,null,null,null,null,null,null,null,null,null,null,null,null,null,null,null,null,"Y48",{"$f":"IF(AND(AF93=0,AG93=0),\"\",IF(AF93<AG93,AD92,AD94))","v":""}]
[null,null,null,null,null,null,null,null,null,null,null,null,null,null,null,null,null,null,null,null,null,null,null,null,null,null,null,null,null,null,null,null,null,null,null,null,null,null,null,null,null,null,"Y52",{"$f":"IF(AND(AM96=0,AN96=0),\"\",IF(AM96<AN96,AK95,AK97))","v":""},null,null,null,null,null,null,"16."]

{"sheet":"32DE(16)","index":5,"n_rows":84,"n_cols":105,"rows_kept":84,"cut":false,"hidden":true,"merged":[[39,36,39,42],[59,22,59,28],[0,24,2,43],[3,24,4,43],[82,29,82,35],[83,36,83,42],[45,29,45,35],[46,36,46,42],[48,22,48,28],[51,36,51,42],[53,29,53,35],[54,36,54,42],[61,29,61,35],[47,29,47,35],[48,36,48,42],[49,29,49,35],[50,22,50,28],[81,36,81,42],[79,36,79,42],[78,29,78,35],[79,22,79,28],[80,29,80,35],[77,22,77,28],[75,22,75,28],[76,36,76,42],[73,22,73,28],[73,36,73,42],[74,29,74,35],[69,15,69,21],[70,29,70,35],[71,36,71,42],[66,15,66,21],[66,29,66,35],[67,15,67,21],[67,36,67,42],[56,36,56,42],[57,29,57,35],[54,22,54,28],[55,29,55,35],[68,22,68,28],[72,29,72,35],[52,22,52,28],[45,1,45,7],[46,8,46,14],[47,1,47,7],[64,15,64,21],[65,22,65,28],[63,15,63,21],[64,36,64,42],[60,15,60,21],[61,15,61,21],[62,22,62,28],[58,36,58,42],[58,15,58,21],[40,8,40,14],[41,1,41,7],[42,1,42,7],[42,22,42,28],[43,8,43,14],[44,1,44,7],[44,15,44,21],[36,1,36,7],[37,8,37,14],[37,29,37,35],[38,1,38,7],[39,1,39,7],[39,15,39,21],[31,22,31,28],[32,1,32,7],[32,15,32,21],[33,1,33,7],[34,8,34,14],[35,1,35,7],[27,1,27,7],[27,15,27,21],[28,8,28,14],[29,1,29,7],[30,1,30,7],[31,8,31,14],[22,8,22,14],[23,1,23,7],[24,1,24,7],[24,36,24,42],[25,8,25,14],[26,1,26,7],[18,1,18,7],[19,8,19,14],[20,1,20,7],[20,15,20,21],[21,1,21,7],[14,1,14,7],[15,1,15,7],[15,15,15,21],[16,8,16,14],[17,1,17,7],[17,22,17,28],[9,1,9,7],[10,8,10,14],[11,1,11,7],[12,1,12,7],[12,29,12,35],[13,8,13,14],[5,1,5,7],[6,1,6,7],[6,22,6,28],[7,8,7,14],[8,1,8,7],[8,15,8,21],[4,88,4,89],[4,90,4,91],[4,92,4,93],[4,94,4,95],[4,96,4,97],[4,98,4,99],[0,1,0,7],[1,8,1,14],[2,1,2,7],[3,1,3,7],[3,15,3,21],[4,8,4,14]]}
[1,{"$f":"IF(#REF!=2,'ERKEK ELEME'!#REF!,IF(#REF!=3,'ERKEK ELEME'!#REF!,IF(#REF!=4,'ERKEK ELEME'!#REF!,IF(#REF!=5,'ERKEK ELEME'!#REF!))))","v":{"$error":"#REF!"}},null,null,null,null,null,null,null,null,null,null,null,null,null,null,null,null,null,null,null,null,null,null,{"$f":"+KATILIM!A1","v":"TÜRKİYE MASA TENİSİ FEDERASYONU\nYILDIZLAR KUZEYBATI BÖLGE YARIŞMALARI"},null,null,null,null,null,null,null,null,null,null,null,null,null,null,null,null,null,null,null,null,null,null,null,null,null,null,null,null,null,null,null,null,null,null,null,null,null,null,null,null,null,null,null,null,null,null,null,null,null,null,null,null,null,null,null,null,null,null,null,null,null,null,null,null,null,null,null,null,null,null,null,null,null,null,null,null,null,null,"1st Round",1]
[null,null,null,{"$f":"CU6","v":0},{"$f":"CV6","v":0},null,null,1,{"$f":"IF(AND(D2=0,E2=0),\"\",IF(D2>E2,B1,B3))","v":""},null,null,null,null,null,null,null,null,null,null,null,null,null,null,null,null,null,null,null,null,null,null,null,null,null,null,null,null,null,null,null,null,null,null,null,null,null,null,null,null,null,null,null,null,null,null,null,null,null,null,null,null,null,null,null,null,null,null,null,null,null,null,null,null,null,null,null,null,null,null,null,null,null,null,null,null,null,null,null,null,null,null,null,null,null,null,null,null,null,null,null,null,null,null,"2sn Round"]
[2,{"$f":"IF(#REF!=2,'ERKEK ELEME'!#REF!,IF(#REF!=3,'ERKEK ELEME'!#REF!,IF(#REF!=4,'ERKEK ELEME'!#REF!,IF(#REF!=5,'ERKEK ELEME'!#REF!))))","v":{"$error":"#REF!"}},null,null,null,null,null,null,null,null,null,null,null,null,17,null,null,null,null,null,null,null,null,null,null,null,null,null,null,null,null,null,null,null,null,null,null,null,null,null,null,null,null,null,null,null,null,null,null,null,null,null,null,null,null,null,null,null,null,null,null,null,null,null,null,null,null,null,null,null,null,null,null,null,null,null,null,null,null,null,null,null,null,null,null,null,null,null,null,null,null,null,null,null,null,null,null,null,null,null,null,null,null,"3th Round"]
[3,{"$f":"IF(#REF!=2,'ERKEK ELEME'!#REF!,IF(#REF!=3,'ERKEK ELEME'!#REF!,IF(#REF!=4,'ERKEK ELEME'!#REF!,IF(#REF!=5,'ERKEK ELEME'!#REF!))))","v":{"$error":"#REF!"}},null,null,null,null,null,null,null,null,{"$f":"CU22","v":0},{"$f":"CV22","v":0},"Y-1",null,null,{"$f":"IF(AND(K4=0,L4=0),\"\",IF(K4>L4,I2,I5))","v":""},null,null,null,null,null,null,null,null,{"$f":"KATILIM!AC2&\" \"&KATILIM!AE3","v":"ERKEK TAKIM  [01-02 Mart 2025 BALIKESİR] [ Ana Tablo ]"},null,null,null,null,null,null,null,null,null,null,null,null,null,null,null,null,null,null,null,null,null,null,null,null,null,null,null,null,null,null,null,null,null,null,null,null,null,null,null,null,null,null,null,null,null,null,null,null,null,null,null,null,null,null,null,null,null,null,null,null,null,null,null,null,null,null,null,null,null,null,null,null,null,null,null,null,null,null,"4th Round"]
[null,null,null,{"$f":"CU7","v":0},{"$f":"CV7","v":0},null,null,2,{"$f":"IF(AND(D5=0,E5=0),\"\",IF(D5>E5,B4,B6))","v":""},null,null,null,null,null,null,null,null,null,null,null,null,25,null,null,null,null,null,null,null,null,null,null,null,null,null,null,null,null,null,null,null,null,null,null,null,null,null,null,null,null,null,null,null,null,null,null,null,null,null,null,null,null,null,null,null,null,null,null,null,null,null,null,null,null,null,null,null,null,null,null,null,"#","Date","Time","Table","Competition","Player A","Player B","Set1",null,"Set2",null,"Set3",null,"Set4",null,"Set5",null,"Result",null,null,null,null,"5th Round"]
[4,{"$f":"IF(#REF!=2,'ERKEK ELEME'!#REF!,IF(#REF!=3,'ERKEK ELEME'!#REF!,IF(#REF!=4,'ERKEK ELEME'!#REF!,IF(#REF!=5,'ERKEK ELEME'!#REF!))))","v":{"$error":"#REF!"}},null,null,null,null,null,null,null,null,null,null,null,null,null,null,null,null,null,null,null,null,null,null,null,null,null,null,null,null,null,null,null,null,null,null,null,null,null,null,null,null,null,null,null,null,null,null,null,null,null,null,null,null,null,null,null,null,null,null,null,null,null,null,null,null,null,null,null,null,null,null,null,null,null,null,null,null,null,null,null,1,null,null,null,null,{"$f":"B1","v":{"$error":"#REF!"}},{"$f":"B3","v":{"$error":"#REF!"}},null,null,null,null,null,null,null,null,null,null,null,null,null,null,null,"6th Round"]
[5,{"$f":"IF(#REF!=2,'ERKEK ELEME'!#REF!,IF(#REF!=3,'ERKEK ELEME'!#REF!,IF(#REF!=4,'ERKEK ELEME'!#REF!,IF(#REF!=5,'ERKEK ELEME'!#REF!))))","v":{"$error":"#REF!"}},null,null,null,null,null,null,null,null,null,null,null,null,null,null,null,{"$f":"CU30","v":0},{"$f":"CV30","v":0},"Y-9",null,null,{"$f":"IF(AND(R7=0,S7=0),\"\",IF(R7>S7,P4,P9))","v":""},null,null,null,null,null,null,null,null,null,null,null,null,null,null,null,null,null,null,null,null,null,null,null,null,null,null,null,null,null,null,null,null,null,null,null,null,null,null,null,null,null,null,null,null,null,null,null,null,null,null,null,null,null,null,null,null,null,null,2,null,null,null,null,{"$f":"B4","v":{"$error":"#REF!"}},{"$f":"B6","v":{"$error":"#REF!"}},null,null,null,null,null,null,null,null,null,null,null,null,null,null,null,"7th Round"]
[null,null,null,{"$f":"CU8","v":0},{"$f":"CV8","v":0},null,null,3,{"$f":"IF(AND(D8=0,E8=0),\"\",IF(D8>E8,B7,B9))","v":""},null,null,null,null,null,null,null,null,null,null,null,null,null,null,null,null,null,null,null,33,null,null,null,null,null,null,null,null,null,null,null,null,null,null,null,null,null,null,null,null,null,null,null,null,null,null,null,null,null,null,null,null,null,null,null,null,null,null,null,null,null,null,null,null,null,null,null,null,null,null,null,null,3,null,null,null,null,{"$f":"B7","v":{"$error":"#REF!"}},{"$f":"B9","v":{"$error":"#REF!"}},null,null,null,null,null,null,null,null,null,null,null,null,null,null,null,"8th Round"]
[6,{"$f":"IF(#REF!=2,'ERKEK ELEME'!#REF!,IF(#REF!=3,'ERKEK ELEME'!#REF!,IF(#REF!=4,'ERKEK ELEME'!#REF!,IF(#REF!=5,'ERKEK ELEME'!#REF!))))","v":{"$error":"#REF!"}},null,null,null,null,null,null,null,null,null,null,null,null,18,{"$f":"IF(AND(K10=0,L10=0),\"\",IF(K10>L10,I8,I11))","v":""},null,null,null,null,null,null,null,null,null,null,null,null,null,null,null,null,null,null,null,null,null,null,null,null,null,null,null,null,null,null,null,null,null,null,null,null,null,null,null,null,null,null,null,null,null,null,null,null,null,null,null,null,null,null,null,null,null,null,null,null,null,null,null,null,null,4,null,null,null,null,{"$f":"B10","v":{"$error":"#REF!"}},{"$f":"B12","v":{"$error":"#REF!"}},null,null,null,null,null,null,null,null,null,null,null,null,null,null,null,"9th Round"]
[7,{"$f":"IF(#REF!=2,'ERKEK ELEME'!#REF!,IF(#REF!=3,'ERKEK ELEME'!#REF!,IF(#REF!=4,'ERKEK ELEME'!#REF!,IF(#REF!=5,'ERKEK ELEME'!#REF!))))","v":{"$error":"#REF!"}},null,null,null,null,null,null,null,null,{"$f":"CU23","v":0},{"$f":"CV23","v":0},"Y-2",null,null,null,null,null,null,null,null,null,null,null,null,null,null,null,null,null,null,null,null,null,null,null,null,null,null,null,null,null,null,null,null,null,null,null,null,null,null,null,null,null,null,null,null,null,null,null,null,null,null,null,null,null,null,null,null,null,null,null,null,null,null,null,null,null,null,null,null,5,null,null,null,null,{"$f":"B13","v":{"$error":"#REF!"}},{"$f":"B15","v":{"$error":"#REF!"}},null,null,null,null,null,null,null,null,null,null,null,null,null,null,null,"10th Round"]
[null,null,null,{"$f":"CU9","v":0},{"$f":"CV9","v":0},null,null,4,{"$f":"IF(AND(D11=0,E11=0),\"\",IF(D11>E11,B10,B12))","v":""},null,null,null,null,null,null,null,null,null,null,null,null,null,null,null,null,null,null,null,null,null,null,null,null,null,null,null,null,null,null,null,null,null,null,null,null,null,null,null,null,null,null,null,null,null,null,null,null,null,null,null,null,null,null,null,null,null,null,null,null,null,null,null,null,null,null,null,null,null,null,null,null,6,null,null,null,null,{"$f":"B16","v":{"$error":"#REF!"}},{"$f":"B18","v":{"$error":"#REF!"}}]
[8,{"$f":"IF(#REF!=2,'ERKEK ELEME'!#REF!,IF(#REF!=3,'ERKEK ELEME'!#REF!,IF(#REF!=4,'ERKEK ELEME'!#REF!,IF(#REF!=5,'ERKEK ELEME'!#REF!))))","v":{"$error":"#REF!"}},null,null,null,null,null,null,null,null,null,null,null,null,null,null,null,null,null,null,null,null,null,null,null,null,null,null,null,null,null,null,null,null,null,null,null,null,null,null,null,null,null,null,null,null,null,null,null,null,null,null,null,null,null,null,null,null,null,null,null,null,null,null,null,null,null,null,null,null,null,null,null,null,null,null,null,null,null,null,null,7,null,null,null,null,{"$f":"B19","v":{"$error":"#REF!"}},{"$f":"B21","v":{"$error":"#REF!"}}]
[9,{"$f":"IF(#REF!=2,'ERKEK ELEME'!#REF!,IF(#REF!=3,'ERKEK ELEME'!#REF!,IF(#REF!=4,'ERKEK ELEME'!#REF!,IF(#REF!=5,'ERKEK ELEME'!#REF!))))","v":{"$error":"#REF!"}},null,null,null,null,null,null,null,null,null,null,null,null,null,null,null,null,null,null,null,null,null,null,{"$f":"CU38","v":0},{"$f":"CV38","v":0},"Y-17",null,null,{"$f":"IF(AND(Y13=0,Z13=0),\"\",IF(Y13>Z13,W7,W18))","v":""},null,null,null,null,null,null,null,null,null,null,null,null,null,null,null,null,null,null,null,null,null,null,null,null,null,null,null,null,null,null,null,null,null,null,null,null,null,null,null,null,null,null,null,null,null,null,null,null,null,null,null,8,null,null,null,null,{"$f":"B22","v":{"$error":"#REF!"}},{"$f":"B24","v":{"$error":"#REF!"}}]
[null,null,null,{"$f":"CU10","v":0},{"$f":"CV10","v":0},null,null,5,{"$f":"IF(AND(D14=0,E14=0),\"\",IF(D14>E14,B13,B15))","v":""},null,null,null,null,null,null,null,null,null,null,null,null,null,null,null,null,null,null,null,null,null,null,null,null,null,null,41,null,null,null,null,null,null,null,null,null,null,null,null,null,null,null,null,null,null,null,null,null,null,null,null,null,null,null,null,null,null,null,null,null,null,null,null,null,null,null,null,null,null,null,null,null,9,null,null,null,null,{"$f":"B25","v":{"$error":"#REF!"}},{"$f":"B27","v":{"$error":"#REF!"}}]
[10,{"$f":"IF(#REF!=2,'ERKEK ELEME'!#REF!,IF(#REF!=3,'ERKEK ELEME'!#REF!,IF(#REF!=4,'ERKEK ELEME'!#REF!,IF(#REF!=5,'ERKEK ELEME'!#REF!))))","v":{"$error":"#REF!"}},null,null,null,null,null,null,null,null,null,null,null,null,19,null,null,null,null,null,null,null,null,null,null,null,null,null,null,null,null,null,null,null,null,null,null,null,null,null,null,null,null,null,null,null,null,null,null,null,null,null,null,null,null,null,null,null,null,null,null,null,null,null,null,null,null,null,null,null,null,null,null,null,null,null,null,null,null,null,null,10,null,null,null,null,{"$f":"B28","v":{"$error":"#REF!"}},{"$f":"B30","v":{"$error":"#REF!"}}]
[11,{"$f":"IF(#REF!=2,'ERKEK ELEME'!#REF!,IF(#REF!=3,'ERKEK ELEME'!#REF!,IF(#REF!=4,'ERKEK ELEME'!#REF!,IF(#REF!=5,'ERKEK ELEME'!#REF!))))","v":{"$error":"#REF!"}},null,null,null,null,null,null,null,null,{"$f":"CU24","v":0},{"$f":"CV24","v":0},"Y-3",null,null,{"$f":"IF(AND(K16=0,L16=0),\"\",IF(K16>L16,I14,I17))","v":""},null,null,null,null,null,null,null,null,null,null,null,null,null,null,null,null,null,null,null,null,null,null,null,null,null,null,null,null,null,null,null,null,null,null,null,null,null,null,null,null,null,null,null,null,null,null,null,null,null,null,null,null,null,null,null,null,null,null,null,null,null,null,null,null,null,11,null,null,null,null,{"$f":"B31","v":{"$error":"#REF!"}},{"$f":"B33","v":{"$error":"#REF!"}}]
[null,null,null,{"$f":"CU11","v":0},{"$f":"CV11","v":0},null,null,6,{"$f":"IF(AND(D17=0,E17=0),\"\",IF(D17>E17,B16,B18))","v":""},null,null,null,null,null,null,null,null,null,null,null,null,26,null,null,null,null,null,null,null,null,null,null,null,null,null,null,null,null,null,null,null,null,null,null,null,null,null,null,null,null,null,null,null,null,null,null,null,null,null,null,null,null,null,null,null,null,null,null,null,null,null,null,null,null,null,null,null,null,null,null,null,12,null,null,null,null,{"$f":"B34","v":{"$error":"#REF!"}},{"$f":"B36","v":{"$error":"#REF!"}}]
[12,{"$f":"IF(#REF!=2,'ERKEK ELEME'!#REF!,IF(#REF!=3,'ERKEK ELEME'!#REF!,IF(#REF!=4,'ERKEK ELEME'!#REF!,IF(#REF!=5,'ERKEK ELEME'!#REF!))))","v":{"$error":"#REF!"}},null,null,null,null,null,null,null,null,null,null,null,null,null,null,null,null,null,null,null,null,{"$f":"IF(AND(R19=0,S19=0),\"\",IF(R19>S19,P16,P21))","v":""},null,null,null,null,null,null,null,null,null,null,null,null,null,null,null,null,null,null,null,null,null,null,null,null,null,null,null,null,null,null,null,null,null,null,null,null,null,null,null,null,null,null,null,null,null,null,null,null,null,null,null,null,null,null,null,null,null,null,13,null,null,null,null,{"$f":"B37","v":{"$error":"#REF!"}},{"$f":"B39","v":{"$error":"#REF!"}}]
[13,{"$f":"IF(#REF!=2,'ERKEK ELEME'!#REF!,IF(#REF!=3,'ERKEK ELEME'!#REF!,IF(#REF!=4,'ERKEK ELEME'!#REF!,IF(#REF!=5,'ERKEK ELEME'!#REF!))))","v":{"$error":"#REF!"}},null,null,null,null,null,null,null,null,null,null,null,null,null,null,null,{"$f":"CU31","v":0},{"$f":"CV31","v":0},"Y-10",null,null,null,null,null,null,null,null,null,null,null,null,null,null,null,null,null,null,null,null,null,null,null,null,null,null,null,null,null,null,null,null,null,null,null,null,null,null,null,null,null,null,null,null,null,null,null,null,null,null,null,null,null,null,null,null,null,null,null,null,null,14,null,null,null,null,{"$f":"B40","v":{"$error":"#REF!"}},{"$f":"B42","v":{"$error":"#REF!"}}]
[null,null,null,{"$f":"CU12","v":0},{"$f":"CV12","v":0},null,null,7,{"$f":"IF(AND(D20=0,E20=0),\"\",IF(D20>E20,B19,B21))","v":""},null,null,null,null,null,null,null,null,null,null,null,null,null,null,null,null,null,null,null,null,null,null,null,null,null,null,null,null,null,null,null,null,null,null,null,null,null,null,null,null,null,null,null,null,null,null,null,null,null,null,null,null,null,null,null,null,null,null,null,null,null,null,null,null,null,null,null,null,null,null,null,null,15,null,null,null,null,{"$f":"B43","v":{"$error":"#REF!"}},{"$f":"B45","v":{"$error":"#REF!"}}]
[14,{"$f":"IF(#REF!=2,'ERKEK ELEME'!#REF!,IF(#REF!=3,'ERKEK ELEME'!#REF!,IF(#REF!=4,'ERKEK ELEME'!#REF!,IF(#REF!=5,'ERKEK ELEME'!#REF!))))","v":{"$error":"#REF!"}},null,null,null,null,null,null,null,null,null,null,null,null,20,{"$f":"IF(AND(K22=0,L22=0),\"\",IF(K22>L22,I20,I23))","v":""},null,null,null,null,null,null,null,null,null,null,null,null,null,null,null,null,null,null,null,null,null,null,null,null,null,null,null,null,null,null,null,null,null,null,null,null,null,null,null,null,null,null,null,null,null,null,null,null,null,null,null,null,null,null,null,null,null,null,null,null,null,null,null,null,null,16,null,null,null,null,{"$f":"B46","v":{"$error":"#REF!"}},{"$f":"B48","v":{"$error":"#REF!"}}]
[15,{"$f":"IF(#REF!=2,'ERKEK ELEME'!#REF!,IF(#REF!=3,'ERKEK ELEME'!#REF!,IF(#REF!=4,'ERKEK ELEME'!#REF!,IF(#REF!=5,'ERKEK ELEME'!#REF!))))","v":{"$error":"#REF!"}},null,null,null,null,null,null,null,null,{"$f":"CU25","v":0},{"$f":"CV25","v":0},"Y-4",null,null,null,null,null,null,null,null,null,null,null,null,null,null,null,null,null,null,null,null,null,null,null,null,null,null,null,null,null,null,null,null,null,null,null,null,null,null,null,null,null,null,null,null,null,null,null,null,null,null,null,null,null,null,null,null,null,null,null,null,null,null,null,null,null,null,null,null,17,null,null,null,null,{"$f":"I2","v":""},{"$f":"I5","v":""}]
[null,null,null,{"$f":"CU13","v":0},{"$f":"CV13","v":0},null,null,8,{"$f":"IF(AND(D23=0,E23=0),\"\",IF(D23>E23,B22,B24))","v":""},null,null,null,null,null,null,null,null,null,null,null,null,null,null,null,null,null,null,null,null,null,null,null,null,null,null,null,null,null,null,null,null,null,null,null,null,null,null,null,null,null,null,null,null,null,null,null,null,null,null,null,null,null,null,null,null,null,null,null,null,null,null,null,null,null,null,null,null,null,null,null,null,18,null,null,null,null,{"$f":"I8","v":""},{"$f":"I11","v":""}]
[16,{"$f":"IF(#REF!=2,'ERKEK ELEME'!#REF!,IF(#REF!=3,'ERKEK ELEME'!#REF!,IF(#REF!=4,'ERKEK ELEME'!#REF!,IF(#REF!=5,'ERKEK ELEME'!#REF!))))","v":{"$error":"#REF!"}},null,null,null,null,null,null,null,null,null,null,null,null,null,null,null,null,null,null,null,null,null,null,null,null,null,null,null,null,null,null,null,null,null,null,null,null,null,null,null,null,null,null,null,null,null,null,null,null,null,null,null,null,null,null,null,null,null,null,null,null,null,null,null,null,null,null,null,null,null,null,null,null,null,null,null,null,null,null,null,19,null,null,null,null,{"$f":"I14","v":""},{"$f":"I17","v":""}]
[17,{"$f":"IF(#REF!=2,'ERKEK ELEME'!#REF!,IF(#REF!=3,'ERKEK ELEME'!#REF!,IF(#REF!=4,'ERKEK ELEME'!#REF!,IF(#REF!=5,'ERKEK ELEME'!#REF!))))","v":{"$error":"#REF!"}},null,null,null,null,null,null,null,null,null,null,null,null,null,{"$f":"IF(AND(K22=0,L22=0),\"\",IF(K22<L22,I20,I23))","v":""},null,null,null,null,null,null,null,null,null,null,null,null,null,null,null,{"$f":"CU46","v":0},{"$f":"CV46","v":0},"Y-25",null,null,{"$f":"IF(AND(AF25=0,AG25=0),\"\",IF(AF25>AG25,AD13,AD38))","v":""},null,null,null,null,null,null,"1.",null,null,null,null,null,null,null,null,null,null,null,null,null,null,null,null,null,null,null,null,null,null,null,null,null,null,null,null,null,null,null,null,null,null,null,null,null,20,null,null,null,null,{"$f":"I20","v":""},{"$f":"I23","v":""}]
[null,null,null,{"$f":"CU14","v":0},{"$f":"CV14","v":0},null,null,9,{"$f":"IF(AND(D26=0,E26=0),\"\",IF(D26>E26,B25,B27))","v":""},null,null,null,null,null,null,null,null,null,null,null,null,null,null,null,null,null,null,null,null,null,null,null,null,null,null,null,null,null,null,null,null,null,null,null,null,null,null,null,null,null,null,null,null,null,null,null,null,null,null,null,null,null,null,null,null,null,null,null,null,null,null,null,null,null,null,null,null,null,null,null,null,21,null,null,null,null,{"$f":"I26","v":""},{"$f":"I29","v":""}]
[18,{"$f":"IF(#REF!=2,'ERKEK ELEME'!#REF!,IF(#REF!=3,'ERKEK ELEME'!#REF!,IF(#REF!=4,'ERKEK ELEME'!#REF!,IF(#REF!=5,'ERKEK ELEME'!#REF!))))","v":{"$error":"#REF!"}},null,null,null,null,null,null,null,null,null,null,null,null,21,null,null,null,null,null,null,null,null,null,null,null,null,null,null,null,null,null,null,null,null,null,null,null,null,null,null,null,null,null,null,null,null,null,null,null,null,null,null,null,null,null,null,null,null,null,null,null,null,null,null,null,null,null,null,null,null,null,null,null,null,null,null,null,null,null,null,22,null,null,null,null,{"$f":"I32","v":""},{"$f":"I35","v":""}]
[19,{"$f":"IF(#REF!=2,'ERKEK ELEME'!#REF!,IF(#REF!=3,'ERKEK ELEME'!#REF!,IF(#REF!=4,'ERKEK ELEME'!#REF!,IF(#REF!=5,'ERKEK ELEME'!#REF!))))","v":{"$error":"#REF!"}},null,null,null,null,null,null,null,null,{"$f":"CU26","v":0},{"$f":"CV26","v":0},"Y-5",null,null,{"$f":"IF(AND(K28=0,L28=0),\"\",IF(K28>L28,I26,I29))","v":""},null,null,null,null,null,null,null,null,null,null,null,null,null,null,null,null,null,null,null,null,null,null,null,null,null,null,null,null,null,null,null,null,null,null,null,null,null,null,null,null,null,null,null,null,null,null,null,null,null,null,null,null,null,null,null,null,null,null,null,null,null,null,null,null,null,23,null,null,null,null,{"$f":"I38","v":""},{"$f":"I41","v":""}]
[null,null,null,{"$f":"CU15","v":0},{"$f":"CV15","v":0},null,null,10,{"$f":"IF(AND(D29=0,E29=0),\"\",IF(D29>E29,B28,B30))","v":""},null,null,null,null,null,null,null,null,null,null,null,null,27,null,null,null,null,null,null,null,null,null,null,null,null,null,null,null,null,null,null,null,null,null,null,null,null,null,null,null,null,null,null,null,null,null,null,null,null,null,null,null,null,null,null,null,null,null,null,null,null,null,null,null,null,null,null,null,null,null,null,null,24,null,null,null,null,{"$f":"I44","v":""},{"$f":"I47","v":""}]
[20,{"$f":"IF(#REF!=2,'ERKEK ELEME'!#REF!,IF(#REF!=3,'ERKEK ELEME'!#REF!,IF(#REF!=4,'ERKEK ELEME'!#REF!,IF(#REF!=5,'ERKEK ELEME'!#REF!))))","v":{"$error":"#REF!"}},null,null,null,null,null,null,null,null,null,null,null,null,null,null,null,null,null,null,null,null,null,null,null,null,null,null,null,null,null,null,null,null,null,null,null,null,null,null,null,null,null,null,null,null,null,null,null,null,null,null,null,null,null,null,null,null,null,null,null,null,null,null,null,null,null,null,null,null,null,null,null,null,null,null,null,null,null,null,null,25,null,null,null,null,{"$f":"P4","v":""},{"$f":"P9","v":""}]
[21,{"$f":"IF(#REF!=2,'ERKEK ELEME'!#REF!,IF(#REF!=3,'ERKEK ELEME'!#REF!,IF(#REF!=4,'ERKEK ELEME'!#REF!,IF(#REF!=5,'ERKEK ELEME'!#REF!))))","v":{"$error":"#REF!"}},null,null,null,null,null,null,null,null,null,null,null,null,null,null,null,{"$f":"CU32","v":0},{"$f":"CV32","v":0},"Y-11",null,null,null,null,null,null,null,null,null,null,null,null,null,null,null,null,null,null,null,null,null,null,null,null,null,null,null,null,null,null,null,null,null,null,null,null,null,null,null,null,null,null,null,null,null,null,null,null,null,null,null,null,null,null,null,null,null,null,null,null,null,26,null,null,null,null,{"$f":"P16","v":""},{"$f":"P21","v":""}]
[null,null,null,{"$f":"CU16","v":0},{"$f":"CV16","v":0},null,null,11,{"$f":"IF(AND(D32=0,E32=0),\"\",IF(D32>E32,B31,B33))","v":""},null,null,null,null,null,null,null,null,null,null,null,null,null,{"$f":"IF(AND(R31=0,S31=0),\"\",IF(R31>S31,P28,P33))","v":""},null,null,null,null,null,null,null,null,null,null,null,null,null,null,null,null,null,null,null,null,null,null,null,null,null,null,null,null,null,null,null,null,null,null,null,null,null,null,null,null,null,null,null,null,null,null,null,null,null,null,null,null,null,null,null,null,null,null,27,null,null,null,null,{"$f":"P28","v":""},{"$f":"P33","v":""}]
[22,{"$f":"IF(#REF!=2,'ERKEK ELEME'!#REF!,IF(#REF!=3,'ERKEK ELEME'!#REF!,IF(#REF!=4,'ERKEK ELEME'!#REF!,IF(#REF!=5,'ERKEK ELEME'!#REF!))))","v":{"$error":"#REF!"}},null,null,null,null,null,null,null,null,null,null,null,null,22,{"$f":"IF(AND(K34=0,L34=0),\"\",IF(K34>L34,I32,I35))","v":""},null,null,null,null,null,null,null,null,null,null,null,null,34,null,null,null,null,null,null,null,null,null,null,null,null,null,null,null,null,null,null,null,null,null,null,null,null,null,null,null,null,null,null,null,null,null,null,null,null,null,null,null,null,null,null,null,null,null,null,null,null,null,null,null,null,28,null,null,null,null,{"$f":"P40","v":""},{"$f":"P45","v":""}]
[23,{"$f":"IF(#REF!=2,'ERKEK ELEME'!#REF!,IF(#REF!=3,'ERKEK ELEME'!#REF!,IF(#REF!=4,'ERKEK ELEME'!#REF!,IF(#REF!=5,'ERKEK ELEME'!#REF!))))","v":{"$error":"#REF!"}},null,null,null,null,null,null,null,null,{"$f":"CU27","v":0},{"$f":"CV27","v":0},"Y-6",null,null,null,null,null,null,null,null,null,null,null,null,null,null,null,null,null,null,null,null,null,null,null,null,null,null,null,null,null,null,null,null,null,null,null,null,null,null,null,null,null,null,null,null,null,null,null,null,null,null,null,null,null,null,null,null,null,null,null,null,null,null,null,null,null,null,null,null,29,null,null,null,null,{"$f":"P59","v":""},{"$f":"P61","v":""}]
[null,null,null,{"$f":"CU17","v":0},{"$f":"CV17","v":0},null,null,12,{"$f":"IF(AND(D35=0,E35=0),\"\",IF(D35>E35,B34,B36))","v":""},null,null,null,null,null,null,null,null,null,null,null,null,null,null,null,null,null,null,null,null,null,null,null,null,null,null,null,null,null,null,null,null,null,null,null,null,null,null,null,null,null,null,null,null,null,null,null,null,null,null,null,null,null,null,null,null,null,null,null,null,null,null,null,null,null,null,null,null,null,null,null,null,30,null,null,null,null,{"$f":"P62","v":""},{"$f":"P64","v":""}]
[24,{"$f":"IF(#REF!=2,'ERKEK ELEME'!#REF!,IF(#REF!=3,'ERKEK ELEME'!#REF!,IF(#REF!=4,'ERKEK ELEME'!#REF!,IF(#REF!=5,'ERKEK ELEME'!#REF!))))","v":{"$error":"#REF!"}},null,null,null,null,null,null,null,null,null,null,null,null,null,null,null,null,null,null,null,null,null,null,null,null,null,null,null,null,null,null,null,null,null,null,null,null,null,null,null,null,null,null,null,null,null,null,null,null,null,null,null,null,null,null,null,null,null,null,null,null,null,null,null,null,null,null,null,null,null,null,null,null,null,null,null,null,null,null,null,31,null,null,null,null,{"$f":"P65","v":""},{"$f":"P67","v":""}]
[25,{"$f":"IF(#REF!=2,'ERKEK ELEME'!#REF!,IF(#REF!=3,'ERKEK ELEME'!#REF!,IF(#REF!=4,'ERKEK ELEME'!#REF!,IF(#REF!=5,'ERKEK ELEME'!#REF!))))","v":{"$error":"#REF!"}},null,null,null,null,null,null,null,null,null,null,null,null,null,null,null,null,null,null,null,null,null,null,null,null,null,null,null,null,null,null,null,null,null,null,null,null,null,null,null,null,null,null,null,null,null,null,null,null,null,null,null,null,null,null,null,null,null,null,null,null,null,null,null,null,null,null,null,null,null,null,null,null,null,null,null,null,null,null,null,32,null,null,null,null,{"$f":"P68","v":""},{"$f":"P70","v":""}]
[null,null,null,{"$f":"CU18","v":0},{"$f":"CV18","v":0},null,null,13,{"$f":"IF(AND(D38=0,E38=0),\"\",IF(D38>E38,B37,B39))","v":""},null,null,null,null,null,null,null,null,null,null,null,null,null,null,null,{"$f":"CU39","v":0},{"$f":"CV39","v":0},"Y-18",null,null,{"$f":"IF(AND(Y38=0,Z38=0),\"\",IF(Y38>Z38,W32,W43))","v":""},null,null,null,null,null,null,null,null,null,null,null,null,null,null,null,null,null,null,null,null,null,null,null,null,null,null,null,null,null,null,null,null,null,null,null,null,null,null,null,null,null,null,null,null,null,null,null,null,null,null,null,33,null,null,null,null,{"$f":"W7","v":""},{"$f":"W18","v":""}]
[26,{"$f":"IF(#REF!=2,'ERKEK ELEME'!#REF!,IF(#REF!=3,'ERKEK ELEME'!#REF!,IF(#REF!=4,'ERKEK ELEME'!#REF!,IF(#REF!=5,'ERKEK ELEME'!#REF!))))","v":{"$error":"#REF!"}},null,null,null,null,null,null,null,null,null,null,null,null,23,null,null,null,null,null,null,null,null,null,null,null,null,null,null,null,null,null,null,null,null,null,null,null,null,null,null,null,null,null,null,null,null,null,null,null,null,null,null,null,null,null,null,null,null,null,null,null,null,null,null,null,null,null,null,null,null,null,null,null,null,null,null,null,null,null,null,34,null,null,null,null,{"$f":"W32","v":""},{"$f":"W43","v":""}]
[27,{"$f":"IF(#REF!=2,'ERKEK ELEME'!#REF!,IF(#REF!=3,'ERKEK ELEME'!#REF!,IF(#REF!=4,'ERKEK ELEME'!#REF!,IF(#REF!=5,'ERKEK ELEME'!#REF!))))","v":{"$error":"#REF!"}},null,null,null,null,null,null,null,null,{"$f":"CU28","v":0},{"$f":"CV28","v":0},"Y-7",null,null,{"$f":"IF(AND(K40=0,L40=0),\"\",IF(K40>L40,I38,I41))","v":""},null,null,null,null,null,null,null,null,null,null,null,null,null,null,null,null,null,null,null,25,{"$f":"IF(AND(AF25=0,AG25=0),\"\",IF(AF25<AG25,AD13,AD38))","v":""},null,null,null,null,null,null,"2.",null,null,null,null,null,null,null,null,null,null,null,null,null,null,null,null,null,null,null,null,null,null,null,null,null,null,null,null,null,null,null,null,null,null,null,null,null,35,null,null,null,null,{"$f":"W49","v":""},{"$f":"W51","v":""}]
[null,null,null,{"$f":"CU19","v":0},{"$f":"CV19","v":0},null,null,14,{"$f":"IF(AND(D41=0,E41=0),\"\",IF(D41>E41,B40,B42))","v":""},null,null,null,null,null,null,null,null,null,null,null,null,28,null,null,null,null,null,null,null,null,null,null,null,null,null,null,null,null,null,null,null,null,null,null,null,null,null,null,null,null,null,null,null,null,null,null,null,null,null,null,null,null,null,null,null,null,null,null,null,null,null,null,null,null,null,null,null,null,null,null,null,36,null,null,null,null,{"$f":"W53","v":""},{"$f":"W55","v":""}]
[28,{"$f":"IF(#REF!=2,'ERKEK ELEME'!#REF!,IF(#REF!=3,'ERKEK ELEME'!#REF!,IF(#REF!=4,'ERKEK ELEME'!#REF!,IF(#REF!=5,'ERKEK ELEME'!#REF!))))","v":{"$error":"#REF!"}},null,null,null,null,null,null,null,null,null,null,null,null,null,null,null,null,null,null,null,null,null,null,null,null,null,null,null,null,null,null,null,null,null,null,null,null,null,null,null,null,null,null,null,null,null,null,null,null,null,null,null,null,null,null,null,null,null,null,null,null,null,null,null,null,null,null,null,null,null,null,null,null,null,null,null,null,null,null,null,37,null,null,null,null,{"$f":"W60","v":""},{"$f":"W63","v":""}]
[29,{"$f":"IF(#REF!=2,'ERKEK ELEME'!#REF!,IF(#REF!=3,'ERKEK ELEME'!#REF!,IF(#REF!=4,'ERKEK ELEME'!#REF!,IF(#REF!=5,'ERKEK ELEME'!#REF!))))","v":{"$error":"#REF!"}},null,null,null,null,null,null,null,null,null,null,null,null,null,null,null,{"$f":"CU33","v":0},{"$f":"CV33","v":0},"Y-12",null,null,{"$f":"IF(AND(R43=0,S43=0),\"\",IF(R43>S43,P40,P45))","v":""},null,null,null,null,null,null,null,null,null,null,null,null,null,null,null,null,null,null,null,null,null,null,null,null,null,null,null,null,null,null,null,null,null,null,null,null,null,null,null,null,null,null,null,null,null,null,null,null,null,null,null,null,null,null,null,null,null,null,38,null,null,null,null,{"$f":"W66","v":""},{"$f":"W69","v":""}]
[null,null,null,{"$f":"CU20","v":0},{"$f":"CV20","v":0},null,null,15,{"$f":"IF(AND(D44=0,E44=0),\"\",IF(D44>E44,B43,B45))","v":""},null,null,null,null,null,null,null,null,null,null,null,null,null,null,null,null,null,null,null,null,null,null,null,null,null,null,null,null,null,null,null,null,null,null,null,null,null,null,null,null,null,null,null,null,null,null,null,null,null,null,null,null,null,null,null,null,null,null,null,null,null,null,null,null,null,null,null,null,null,null,null,null,39,null,null,null,null,{"$f":"W74","v":""},{"$f":"W76","v":""}]
[30,{"$f":"IF(#REF!=2,'ERKEK ELEME'!#REF!,IF(#REF!=3,'ERKEK ELEME'!#REF!,IF(#REF!=4,'ERKEK ELEME'!#REF!,IF(#REF!=5,'ERKEK ELEME'!#REF!))))","v":{"$error":"#REF!"}},null,null,null,null,null,null,null,null,null,null,null,null,24,{"$f":"IF(AND(K46=0,L46=0),\"\",IF(K46>L46,I44,I47))","v":""},null,null,null,null,null,null,null,null,null,null,null,null,null,null,null,null,null,null,null,null,null,null,null,null,null,null,null,null,null,null,null,null,null,null,null,null,null,null,null,null,null,null,null,null,null,null,null,null,null,null,null,null,null,null,null,null,null,null,null,null,null,null,null,null,null,40,null,null,null,null,{"$f":"W78","v":""},{"$f":"W80","v":""}]
[31,{"$f":"IF(#REF!=2,'ERKEK ELEME'!#REF!,IF(#REF!=3,'ERKEK ELEME'!#REF!,IF(#REF!=4,'ERKEK ELEME'!#REF!,IF(#REF!=5,'ERKEK ELEME'!#REF!))))","v":{"$error":"#REF!"}},null,null,null,null,null,null,null,null,{"$f":"CU29","v":0},{"$f":"CV29","v":0},"Y-8",null,null,null,null,null,null,null,null,null,null,null,null,null,null,null,17,{"$f":"IF(AND(Y13=0,Z13=0),\"\",IF(Y13<Z13,W7,W18))","v":""},null,null,null,null,null,null,null,null,null,null,null,null,null,null,null,null,null,null,null,null,null,null,null,null,null,null,null,null,null,null,null,null,null,null,null,null,null,null,null,null,null,null,null,null,null,null,null,null,null,null,null,41,null,null,null,null,{"$f":"AD13","v":""},{"$f":"AD38","v":""}]
[null,null,null,{"$f":"CU21","v":0},{"$f":"CV21","v":0},null,null,16,{"$f":"IF(AND(D47=0,E47=0),\"\",IF(D47>E47,B46,B48))","v":""},null,null,null,null,null,null,null,null,null,null,null,null,null,null,null,null,null,null,null,null,null,null,{"$f":"CU47","v":0},{"$f":"+CV47","v":0},"Y-26",null,42,{"$f":"IF(AND(AF47=0,AG47=0),\"\",IF(AF47>AG47,AD46,AD48))","v":""},null,null,null,null,null,null,"3.",null,null,null,null,null,null,null,null,null,null,null,null,null,null,null,null,null,null,null,null,null,null,null,null,null,null,null,null,null,null,null,null,null,null,null,null,null,42,null,null,null,null,{"$f":"AD46","v":""},{"$f":"AD48","v":""}]
[32,{"$f":"IF(#REF!=2,'ERKEK ELEME'!#REF!,IF(#REF!=3,'ERKEK ELEME'!#REF!,IF(#REF!=4,'ERKEK ELEME'!#REF!,IF(#REF!=5,'ERKEK ELEME'!#REF!))))","v":{"$error":"#REF!"}},null,null,null,null,null,null,null,null,null,null,null,null,null,null,null,null,null,null,null,null,null,null,null,null,null,null,18,{"$f":"IF(AND(Y38=0,Z38=0),\"\",IF(Y38<Z38,W32,W43))","v":""},null,null,null,null,null,null,null,null,null,null,null,null,null,null,null,null,null,null,null,null,null,null,null,null,null,null,null,null,null,null,null,null,null,null,null,null,null,null,null,null,null,null,null,null,null,null,null,null,null,null,null,43,null,null,null,null,{"$f":"AD50","v":""},{"$f":"AD54","v":""}]
[null,null,null,null,null,null,null,null,null,null,null,null,null,null,null,null,null,null,null,null,null,9,{"$f":"IF(AND(R7=0,S7=0),\"\",IF(R7<S7,P4,P9))","v":""},null,null,null,null,null,null,null,null,null,null,null,null,26,{"$f":"IF(AND(AF47=0,AG47=0),\"\",IF(AF47<AG47,AD46,AD48))","v":""},null,null,null,null,null,null,"4.",null,null,null,null,null,null,null,null,null,null,null,null,null,null,null,null,null,null,null,null,null,null,null,null,null,null,null,null,null,null,null,null,null,null,null,null,null,44,null,null,null,null,{"$f":"AD56","v":""},{"$f":"AD58","v":""}]
[null,null,null,null,null,null,null,null,null,null,null,null,null,null,null,null,null,null,null,null,null,null,null,null,{"$f":"CU40","v":0},{"$f":"+CV40","v":0},"Y-19",null,35,{"$f":"IF(AND(Y50=0,Z50=0),\"\",IF(Y50>Z50,W49,W51))","v":""},null,null,null,null,null,null,null,null,null,null,null,null,null,null,null,null,null,null,null,null,null,null,null,null,null,null,null,null,null,null,null,null,null,null,null,null,null,null,null,null,null,null,null,null,null,null,null,null,null,null,null,45,null,null,null,null,{"$f":"AD62","v":""},{"$f":"AD67","v":""}]
[null,null,null,null,null,null,null,null,null,null,null,null,null,null,null,null,null,null,null,null,null,10,{"$f":"IF(AND(R19=0,S19=0),\"\",IF(R19<S19,P16,P21))","v":""},null,null,null,null,null,null,null,null,null,null,null,null,43,null,null,null,null,null,null,null,null,null,null,null,null,null,null,null,null,null,null,null,null,null,null,null,null,null,null,null,null,null,null,null,null,null,null,null,null,null,null,null,null,null,null,null,null,null,46,null,null,null,null,{"$f":"AD71","v":""},{"$f":"AD73","v":""}]
[null,null,null,null,null,null,null,null,null,null,null,null,null,null,null,null,null,null,null,null,null,null,null,null,null,null,null,null,null,null,null,{"$f":"CU48","v":0},{"$f":"+CV48","v":0},"Y-27",null,null,{"$f":"IF(AND(AF52=0,AG52=0),\"\",IF(AF52>AG52,AD50,AD54))","v":""},null,null,null,null,null,null,"5.",null,null,null,null,null,null,null,null,null,null,null,null,null,null,null,null,null,null,null,null,null,null,null,null,null,null,null,null,null,null,null,null,null,null,null,null,null,47,null,null,null,null,{"$f":"AD75","v":""},{"$f":"AD79","v":""}]
[null,null,null,null,null,null,null,null,null,null,null,null,null,null,null,null,null,null,null,null,null,11,{"$f":"IF(AND(R31=0,S31=0),\"\",IF(R31<S31,P28,P33))","v":""},null,null,null,null,null,null,null,null,null,null,null,null,null,null,null,null,null,null,null,null,null,null,null,null,null,null,null,null,null,null,null,null,null,null,null,null,null,null,null,null,null,null,null,null,null,null,null,null,null,null,null,null,null,null,null,null,null,null,48,null,null,null,null,{"$f":"AD81","v":""},{"$f":"AD83","v":""}]
[null,null,null,null,null,null,null,null,null,null,null,null,null,null,null,null,null,null,null,null,null,null,null,null,{"$f":"CU41","v":0},{"$f":"+CV41","v":0},"Y-20",null,36,{"$f":"IF(AND(Y54=0,Z54=0),\"\",IF(Y54>Z54,W53,W55))","v":""}]
[null,null,null,null,null,null,null,null,null,null,null,null,null,null,null,null,null,null,null,null,null,12,{"$f":"IF(AND(R43=0,S43=0),\"\",IF(R43<S43,P40,P45))","v":""},null,null,null,null,null,null,null,null,null,null,null,null,27,{"$f":"IF(AND(AF52=0,AG52=0),\"\",IF(AF52<AG52,AD50,AD54))","v":""},null,null,null,null,null,null,"6."]
[null,null,null,null,null,null,null,null,null,null,null,null,null,null,null,null,null,null,null,null,null,null,null,null,null,null,null,null,19,{"$f":"IF(AND(Y50=0,Z50=0),\"\",IF(Y50<Z50,W49,W51))","v":""}]
[null,null,null,null,null,null,null,null,null,null,null,null,null,null,null,null,null,null,null,null,null,null,null,null,null,null,null,null,null,null,null,{"$f":"CU49","v":0},{"$f":"+CV49","v":0},"Y-28",null,44,{"$f":"IF(AND(AF57=0,AG57=0),\"\",IF(AF57>AG57,AD56,AD58))","v":""},null,null,null,null,null,null,"7."]
[null,null,null,null,null,null,null,null,null,null,null,null,null,null,null,null,null,null,null,null,null,null,null,null,null,null,null,null,20,{"$f":"IF(AND(Y54=0,Z54=0),\"\",IF(Y54<Z54,W53,W55))","v":""}]
[null,null,null,null,null,null,null,null,null,null,null,null,null,null,1,{"$f":"IF(AND(K4=0,L4=0),\"\",IF(K4<L4,I2,I5))","v":""},null,null,null,null,null,null,null,null,null,null,null,null,null,null,null,null,null,null,null,28,{"$f":"IF(AND(AF57=0,AG57=0),\"\",IF(AF57<AG57,AD56,AD58))","v":""},null,null,null,null,null,null,"8."]
[null,null,null,null,null,null,null,null,null,null,null,null,null,null,null,null,null,{"$f":"CU34","v":0},{"$f":"CV34","v":0},"Y-13",null,29,{"$f":"IF(AND(R60=0,S60=0),\"\",IF(R60>S60,P59,P61))","v":""}]
[null,null,null,null,null,null,null,null,null,null,null,null,null,null,2,{"$f":"IF(AND(K10=0,L10=0),\"\",IF(K10<L10,I8,I11))","v":""},null,null,null,null,null,null,null,null,null,null,null,null,37]
[null,null,null,null,null,null,null,null,null,null,null,null,null,null,3,{"$f":"IF(AND(K16=0,L16=0),\"\",IF(K16<L16,I14,I17))","v":""},null,null,null,null,null,null,null,null,{"$f":"CU42","v":0},{"$f":"CV42","v":0},"Y-21",null,null,{"$f":"IF(AND(Y62=0,Z62=0),\"\",IF(Y62>Z62,W60,W63))","v":""}]
[null,null,null,null,null,null,null,null,null,null,null,null,null,null,null,null,null,{"$f":"CU35","v":0},{"$f":"CV35","v":0},"Y-14",null,30,{"$f":"IF(AND(R63=0,S63=0),\"\",IF(R63>S63,P62,P64))","v":""},null,null,null,null,null,null,null,null,null,null,null,null,45]
[null,null,null,null,null,null,null,null,null,null,null,null,null,null,4,{"$f":"IF(AND(K22=0,L22=0),\"\",IF(K22<L22,I20,I23))","v":""}]
[null,null,null,null,null,null,null,null,null,null,null,null,null,null,5,{"$f":"IF(AND(K28=0,L28=0),\"\",IF(K28<L28,I26,I29))","v":""},null,null,null,null,null,null,null,null,null,null,null,null,null,null,null,{"$f":"CU50","v":0},{"$f":"+CV50","v":0},"Y-29",null,null,{"$f":"IF(AND(AF65=0,AG65=0),\"\",IF(AF65>AG65,AD62,AD67))","v":""},null,null,null,null,null,null,"9."]
[null,null,null,null,null,null,null,null,null,null,null,null,null,null,null,null,null,{"$f":"CU36","v":0},{"$f":"CV36","v":0},"Y-15",null,31,{"$f":"IF(AND(R66=0,S66=0),\"\",IF(R66>S66,P65,P67))","v":""}]
[null,null,null,null,null,null,null,null,null,null,null,null,null,null,6,{"$f":"IF(AND(K34=0,L34=0),\"\",IF(K34<L34,I32,I35))","v":""},null,null,null,null,null,null,null,null,null,null,null,null,38,{"$f":"IF(AND(Y68=0,Z68=0),\"\",IF(Y68>Z68,W66,W69))","v":""}]
[null,null,null,null,null,null,null,null,null,null,null,null,null,null,7,{"$f":"IF(AND(K40=0,L40=0),\"\",IF(K40<L40,I38,I41))","v":""},null,null,null,null,null,null,null,null,{"$f":"CU43","v":0},{"$f":"CV43","v":0},"Y-22",null,null,null,null,null,null,null,null,29,{"$f":"IF(AND(AF65=0,AG65=0),\"\",IF(AF65<AG65,AD62,AD67))","v":""},null,null,null,null,null,null,"10."]
[null,null,null,null,null,null,null,null,null,null,null,null,null,null,null,null,null,{"$f":"CU37","v":0},{"$f":"CV37","v":0},"Y-16",null,32,{"$f":"IF(AND(R69=0,S69=0),\"\",IF(R69>S69,P68,P70))","v":""}]
[null,null,null,null,null,null,null,null,null,null,null,null,null,null,8,{"$f":"IF(AND(K46=0,L46=0),\"\",IF(K46<L46,I44,I47))","v":""}]
[null,null,null,null,null,null,null,null,null,null,null,null,null,null,null,null,null,null,null,null,null,null,null,null,null,null,null,null,21,{"$f":"IF(AND(Y62=0,Z62=0),\"\",IF(Y62<Z62,W60,W63))","v":""}]
[null,null,null,null,null,null,null,null,null,null,null,null,null,null,null,null,null,null,null,null,null,null,null,null,null,null,null,null,null,null,null,{"$f":"CU51","v":0},{"$f":"+CV51","v":0},"Y-30",null,46,{"$f":"IF(AND(AF72=0,AG72=0),\"\",IF(AF72>AG72,AD71,AD73))","v":""},null,null,null,null,null,null,"11."]
[null,null,null,null,null,null,null,null,null,null,null,null,null,null,null,null,null,null,null,null,null,null,null,null,null,null,null,null,22,{"$f":"IF(AND(Y68=0,Z68=0),\"\",IF(Y68<Z68,W66,W69))","v":""}]
[null,null,null,null,null,null,null,null,null,null,null,null,null,null,null,null,null,null,null,null,null,13,{"$f":"IF(AND(R60=0,S60=0),\"\",IF(R60<S60,P59,P61))","v":""},null,null,null,null,null,null,null,null,null,null,null,null,30,{"$f":"IF(AND(AF72=0,AG72=0),\"\",IF(AF72<AG72,AD71,AD73))","v":""},null,null,null,null,null,null,"12."]
[null,null,null,null,null,null,null,null,null,null,null,null,null,null,null,null,null,null,null,null,null,null,null,null,{"$f":"CU44","v":0},{"$f":"+CV44","v":0},"Y-23",null,39,{"$f":"IF(AND(Y75=0,Z75=0),\"\",IF(Y75>Z75,W74,W76))","v":""}]
[null,null,null,null,null,null,null,null,null,null,null,null,null,null,null,null,null,null,null,null,null,14,{"$f":"IF(AND(R63=0,S63=0),\"\",IF(R63<S63,P62,P64))","v":""},null,null,null,null,null,null,null,null,null,null,null,null,47]
[null,null,null,null,null,null,null,null,null,null,null,null,null,null,null,null,null,null,null,null,null,null,null,null,null,null,null,null,null,null,null,{"$f":"CU52","v":0},{"$f":"+CV52","v":0},"Y-31",null,null,{"$f":"IF(AND(AF77=0,AG77=0),\"\",IF(AF77>AG77,AD75,AD79))","v":""},null,null,null,null,null,null,"13."]
[null,null,null,null,null,null,null,null,null,null,null,null,null,null,null,null,null,null,null,null,null,15,{"$f":"IF(AND(R66=0,S66=0),\"\",IF(R66<S66,P65,P67))","v":""}]
[null,null,null,null,null,null,null,null,null,null,null,null,null,null,null,null,null,null,null,null,null,null,null,null,{"$f":"CU45","v":0},{"$f":"+CV45","v":0},"Y-24",null,40,{"$f":"IF(AND(Y79=0,Z79=0),\"\",IF(Y79>Z79,W78,W80))","v":""}]
[null,null,null,null,null,null,null,null,null,null,null,null,null,null,null,null,null,null,null,null,null,16,{"$f":"IF(AND(R69=0,S69=0),\"\",IF(R69<S69,P68,P70))","v":""},null,null,null,null,null,null,null,null,null,null,null,null,31,{"$f":"IF(AND(AF77=0,AG77=0),\"\",IF(AF77<AG77,AD75,AD79))","v":""},null,null,null,null,null,null,"14."]
[null,null,null,null,null,null,null,null,null,null,null,null,null,null,null,null,null,null,null,null,null,null,null,null,null,null,null,null,23,{"$f":"IF(AND(Y75=0,Z75=0),\"\",IF(Y75<Z75,W74,W76))","v":""}]
[null,null,null,null,null,null,null,null,null,null,null,null,null,null,null,null,null,null,null,null,null,null,null,null,null,null,null,null,null,null,null,{"$f":"CU53","v":0},{"$f":"+CV53","v":0},"Y-32",null,48,{"$f":"IF(AND(AF82=0,AG82=0),\"\",IF(AF82>AG82,AD81,AD83))","v":""},null,null,null,null,null,null,"15."]
[null,null,null,null,null,null,null,null,null,null,null,null,null,null,null,null,null,null,null,null,null,null,null,null,null,null,null,null,24,{"$f":"IF(AND(Y79=0,Z79=0),\"\",IF(Y79<Z79,W78,W80))","v":""}]
[null,null,null,null,null,null,null,null,null,null,null,null,null,null,null,null,null,null,null,null,null,null,null,null,null,null,null,null,null,null,null,null,null,null,null,32,{"$f":"IF(AND(AF82=0,AG82=0),\"\",IF(AF82<AG82,AD81,AD83))","v":""},null,null,null,null,null,null,"16"]

{"sheet":"16","index":6,"n_rows":63,"n_cols":1217,"rows_kept":63,"cut":false,"hidden":true,"merged":[[61,22,61,28],[62,29,62,35],[56,15,56,21],[57,22,57,28],[58,15,58,21],[58,29,58,35],[59,22,59,28],[60,29,60,35],[55,29,55,35],[46,8,46,14],[46,29,46,35],[47,15,47,21],[48,8,48,14],[49,22,49,28],[50,29,50,35],[51,22,51,28],[52,15,52,21],[52,29,52,35],[53,22,53,28],[54,15,54,21],[45,8,45,14],[45,22,45,28],[36,29,36,35],[37,8,37,14],[38,15,38,21],[39,8,39,14],[40,8,40,14],[40,22,40,28],[41,15,41,21],[42,8,42,14],[43,8,43,14],[43,29,43,35],[44,15,44,21],[35,22,35,28],[26,15,26,21],[26,29,26,35],[27,22,27,28],[28,15,28,21],[29,29,29,35],[30,15,30,21],[31,22,31,28],[32,15,32,21],[32,29,32,35],[33,22,33,28],[34,29,34,35],[25,22,25,28],[18,1,18,7],[18,22,18,28],[18,29,18,35],[19,8,19,14],[20,1,20,7],[20,15,20,21],[21,1,21,7],[22,8,22,14],[23,1,23,7],[23,22,23,28],[24,29,24,35],[17,22,17,28],[9,1,9,7],[10,8,10,14],[11,1,11,7],[12,1,12,7],[14,1,14,7],[15,1,15,7],[15,15,15,21],[16,8,16,14],[17,1,17,7],[12,29,12,35],[13,8,13,14],[5,1,5,7],[6,1,6,7],[6,22,6,28],[7,8,7,14],[8,1,8,7],[8,15,8,21],[1,81,1,82],[1,83,1,84],[1,85,1,86],[2,1,2,7],[3,1,3,7],[3,15,3,21],[3,23,4,36],[4,8,4,14],[1,79,1,80],[0,1,0,7],[0,23,2,36],[1,8,1,14],[1,75,1,76],[1,77,1,78]]}
[1,{"$f":"IF(#REF!=2,'ERKEK ELEME'!#REF!,IF(#REF!=3,'ERKEK ELEME'!#REF!,IF(#REF!=4,'ERKEK ELEME'!#REF!,IF(#REF!=5,'ERKEK ELEME'!#REF!,IF(#REF!=6,'ERKEK ELEME'!#REF!)))))","v":{"$error":"#REF!"}},null,null,null,null,null,null,null,null,null,null,null,null,null,null,null,null,null,null,null,null,null,{"$f":"KATILIM!AC1","v":"TÜRKİYE MASA TENİSİ FEDERASYONU\nYILDIZLAR KUZEYBATI BÖLGE YARIŞMALARI"},null,null,null,null,null,null,null,null,null,null,null,null,null,null,null,null,null,null,null,null,null,null,null,null,null,null,null,null,null,null,null,null,null,null,null,null,null,null,null,null,null,null,null,null,null,null,null,null,null,null,null,null,null,null,null,null,null,null,null,null,null,null,null,null,null,null,null,null,null,null,null,null,null,null,null,null,null,null,null,"1st Round",1]
[null,null,null,{"$f":"CH3","v":0},{"$f":"CI3","v":0},"Y1",null,1,{"$f":"IF(AND(D2=0,E2=0),\"\",IF(D2>E2,B1,B3))","v":""},null,null,null,null,null,null,null,null,null,null,null,null,null,null,null,null,null,null,null,null,null,null,null,null,null,null,null,null,null,null,null,null,null,null,null,null,null,null,null,null,null,null,null,null,null,null,null,null,null,null,null,null,null,null,null,null,null,null,null,"#","Date","Time","Table","Competition","Player A","Player B","Set1",null,"Set2",null,"Set3",null,"Set4",null,"Set5",null,"Result",null,null,null,null,null,null,null,null,null,null,null,null,null,null,null,null,null,"2sn Round"]
[2,{"$f":"IF(#REF!=2,'ERKEK ELEME'!#REF!,IF(#REF!=3,'ERKEK ELEME'!#REF!,IF(#REF!=4,'ERKEK ELEME'!#REF!,IF(#REF!=5,'ERKEK ELEME'!#REF!,IF(#REF!=6,'ERKEK ELEME'!#REF!)))))","v":{"$error":"#REF!"}},null,null,null,null,null,null,null,null,null,null,null,null,9,null,null,null,null,null,null,null,null,null,null,null,null,null,null,null,null,null,null,null,null,null,null,null,null,null,null,null,null,null,null,null,null,null,null,null,null,null,null,null,null,null,null,null,null,null,null,null,null,null,null,null,null,null,1,null,null,null,null,{"$f":"B1","v":{"$error":"#REF!"}},{"$f":"B3","v":{"$error":"#REF!"}},null,null,null,null,null,null,null,null,null,null,null,null,null,null,null,null,null,null,null,null,null,null,null,null,null,null,null,null,"3th Round"]
[3,{"$f":"IF(#REF!=2,'ERKEK ELEME'!#REF!,IF(#REF!=3,'ERKEK ELEME'!#REF!,IF(#REF!=4,'ERKEK ELEME'!#REF!,IF(#REF!=5,'ERKEK ELEME'!#REF!,IF(#REF!=6,'ERKEK ELEME'!#REF!)))))","v":{"$error":"#REF!"}},null,null,null,null,null,null,null,null,{"$f":"CH11","v":0},{"$f":"CI11","v":0},"Y-A",null,null,{"$f":"IF(AND(K4=0,L4=0),\"\",IF(K4>L4,I2,I5))","v":""},null,null,null,null,null,null,null,{"$f":"KATILIM!AC2&\" \"&KATILIM!AE3","v":"ERKEK TAKIM  [01-02 Mart 2025 BALIKESİR] [ Ana Tablo ]"},null,null,null,null,null,null,null,null,null,null,null,null,null,null,null,null,null,null,null,null,null,null,null,null,null,null,null,null,null,null,null,null,null,null,null,null,null,null,null,null,null,null,null,null,2,null,null,null,null,{"$f":"B4","v":{"$error":"#REF!"}},{"$f":"B6","v":{"$error":"#REF!"}},null,null,null,null,null,null,null,null,null,null,null,null,null,null,null,null,null,null,null,null,null,null,null,null,null,null,null,null,"4th Round"]
[null,null,null,{"$f":"CH4","v":0},{"$f":"CI4","v":0},"Y2",null,2,{"$f":"IF(AND(D5=0,E5=0),\"\",IF(D5>E5,B4,B6))","v":""},null,null,null,null,null,null,null,null,null,null,null,null,17,null,null,null,null,null,null,null,null,null,null,null,null,null,null,null,null,null,null,null,null,null,null,null,null,null,null,null,null,null,null,null,null,null,null,null,null,null,null,null,null,null,null,null,null,null,null,3,null,null,null,null,{"$f":"B7","v":{"$error":"#REF!"}},{"$f":"B9","v":{"$error":"#REF!"}}]
[4,{"$f":"IF(#REF!=2,'ERKEK ELEME'!#REF!,IF(#REF!=3,'ERKEK ELEME'!#REF!,IF(#REF!=4,'ERKEK ELEME'!#REF!,IF(#REF!=5,'ERKEK ELEME'!#REF!,IF(#REF!=6,'ERKEK ELEME'!#REF!)))))","v":{"$error":"#REF!"}},null,null,null,null,null,null,null,null,null,null,null,null,null,null,null,null,null,null,null,null,null,null,null,null,null,null,null,null,null,null,null,null,null,null,null,null,null,null,null,null,null,null,null,null,null,null,null,null,null,null,null,null,null,null,null,null,null,null,null,null,null,null,null,null,null,null,4,null,null,null,null,{"$f":"B10","v":{"$error":"#REF!"}},{"$f":"B12","v":{"$error":"#REF!"}}]
[5,{"$f":"IF(#REF!=2,'ERKEK ELEME'!#REF!,IF(#REF!=3,'ERKEK ELEME'!#REF!,IF(#REF!=4,'ERKEK ELEME'!#REF!,IF(#REF!=5,'ERKEK ELEME'!#REF!,IF(#REF!=6,'ERKEK ELEME'!#REF!)))))","v":{"$error":"#REF!"}},null,null,null,null,null,null,null,null,null,null,null,null,null,null,null,{"$f":"CH19","v":0},{"$f":"CI19","v":0},"Y-E",null,null,{"$f":"IF(AND(R7=0,S7=0),\"\",IF(R7>S7,P4,P9))","v":""},null,null,null,null,null,null,null,null,null,null,null,null,null,null,null,null,null,null,null,null,null,null,null,null,null,null,null,null,null,null,null,null,null,null,null,null,null,null,null,null,null,null,null,null,null,5,null,null,null,null,{"$f":"B13","v":{"$error":"#REF!"}},{"$f":"B15","v":{"$error":"#REF!"}}]
[null,null,null,{"$f":"CH5","v":0},{"$f":"CI5","v":0},"Y3",null,3,{"$f":"IF(AND(D8=0,E8=0),\"\",IF(D8>E8,B7,B9))","v":""},null,null,null,null,null,null,null,null,null,null,null,null,null,null,null,null,null,null,null,25,null,null,null,null,null,null,null,null,null,null,null,null,null,null,null,null,null,null,null,null,null,null,null,null,null,null,null,null,null,null,null,null,null,null,null,null,null,null,null,6,null,null,null,null,{"$f":"B16","v":{"$error":"#REF!"}},{"$f":"B18","v":{"$error":"#REF!"}}]
[6,{"$f":"IF(#REF!=2,'ERKEK ELEME'!#REF!,IF(#REF!=3,'ERKEK ELEME'!#REF!,IF(#REF!=4,'ERKEK ELEME'!#REF!,IF(#REF!=5,'ERKEK ELEME'!#REF!,IF(#REF!=6,'ERKEK ELEME'!#REF!)))))","v":{"$error":"#REF!"}},null,null,null,null,null,null,null,null,null,null,null,null,10,{"$f":"IF(AND(K10=0,L10=0),\"\",IF(K10>L10,I8,I11))","v":""},null,null,null,null,null,null,null,null,null,null,null,null,null,null,null,null,null,null,null,null,null,null,null,null,null,null,null,null,null,null,null,null,null,null,null,null,null,null,null,null,null,null,null,null,null,null,null,null,null,null,null,null,7,null,null,null,null,{"$f":"B19","v":{"$error":"#REF!"}},{"$f":"B21","v":{"$error":"#REF!"}}]
[7,{"$f":"IF(#REF!=2,'ERKEK ELEME'!#REF!,IF(#REF!=3,'ERKEK ELEME'!#REF!,IF(#REF!=4,'ERKEK ELEME'!#REF!,IF(#REF!=5,'ERKEK ELEME'!#REF!,IF(#REF!=6,'ERKEK ELEME'!#REF!)))))","v":{"$error":"#REF!"}},null,null,null,null,null,null,null,null,{"$f":"CH12","v":0},{"$f":"CI12","v":0},"Y-B",null,null,null,null,null,null,null,null,null,null,null,null,null,null,null,null,null,null,null,null,null,null,null,null,null,null,null,null,null,null,null,null,null,null,null,null,null,null,null,null,null,null,null,null,null,null,null,null,null,null,null,null,null,null,null,8,null,null,null,null,{"$f":"B22","v":{"$error":"#REF!"}},{"$f":"B24","v":{"$error":"#REF!"}}]
[null,null,null,{"$f":"CH6","v":0},{"$f":"CI6","v":0},"Y4",null,4,{"$f":"IF(AND(D11=0,E11=0),\"\",IF(D11>E11,B10,B12))","v":""},null,null,null,null,null,null,null,null,null,null,null,null,null,null,null,null,null,null,null,null,null,null,null,null,null,null,null,null,null,null,null,null,null,null,null,null,null,null,null,null,null,null,null,null,null,null,null,null,null,null,null,null,null,null,null,null,null,null,null,9,null,null,null,null,{"$f":"I2","v":""},{"$f":"I5","v":""}]
[8,{"$f":"IF(#REF!=2,'ERKEK ELEME'!#REF!,IF(#REF!=3,'ERKEK ELEME'!#REF!,IF(#REF!=4,'ERKEK ELEME'!#REF!,IF(#REF!=5,'ERKEK ELEME'!#REF!,IF(#REF!=6,'ERKEK ELEME'!#REF!)))))","v":{"$error":"#REF!"}},null,null,null,null,null,null,null,null,null,null,null,null,null,null,null,null,null,null,null,null,null,null,null,null,null,null,null,null,null,null,null,null,null,null,null,null,null,null,null,null,null,null,null,null,null,null,null,null,null,null,null,null,null,null,null,null,null,null,null,null,null,null,null,null,null,null,10,null,null,null,null,{"$f":"I8","v":""},{"$f":"I11","v":""}]
[9,{"$f":"IF(#REF!=2,'ERKEK ELEME'!#REF!,IF(#REF!=3,'ERKEK ELEME'!#REF!,IF(#REF!=4,'ERKEK ELEME'!#REF!,IF(#REF!=5,'ERKEK ELEME'!#REF!,IF(#REF!=6,'ERKEK ELEME'!#REF!)))))","v":{"$error":"#REF!"}},null,null,null,null,null,null,null,null,null,null,null,null,null,null,null,null,null,null,null,null,null,null,{"$f":"CH27","v":0},{"$f":"+CI27","v":0},"Y-I",null,null,{"$f":"IF(AND(Y13=0,Z13=0),\"\",IF(Y13>Z13,W7,W18))","v":""},null,null,null,null,null,null,"1.",null,null,null,null,null,null,null,null,null,null,null,null,null,null,null,null,null,null,null,null,null,null,null,null,null,null,null,null,null,null,null,11,null,null,null,null,{"$f":"I14","v":""},{"$f":"I17","v":""}]
[null,null,null,{"$f":"CH7","v":0},{"$f":"CI7","v":0},"Y5",null,5,{"$f":"IF(AND(D14=0,E14=0),\"\",IF(D14>E14,B13,B15))","v":""},null,null,null,null,null,null,null,null,null,null,null,null,null,null,null,null,null,null,null,null,null,null,null,null,null,null,null,null,null,null,null,null,null,null,null,null,null,null,null,null,null,null,null,null,null,null,null,null,null,null,null,null,null,null,null,null,null,null,null,12,null,null,null,null,{"$f":"I20","v":""},{"$f":"I23","v":""}]
[10,{"$f":"IF(#REF!=2,'ERKEK ELEME'!#REF!,IF(#REF!=3,'ERKEK ELEME'!#REF!,IF(#REF!=4,'ERKEK ELEME'!#REF!,IF(#REF!=5,'ERKEK ELEME'!#REF!,IF(#REF!=6,'ERKEK ELEME'!#REF!)))))","v":{"$error":"#REF!"}},null,null,null,null,null,null,null,null,null,null,null,null,11,null,null,null,null,null,null,null,null,null,null,null,null,null,null,null,null,null,null,null,null,null,null,null,null,null,null,null,null,null,null,null,null,null,null,null,null,null,null,null,null,null,null,null,null,null,null,null,null,null,null,null,null,null,13,null,null,null,null,{"$f":"+I38","v":""},{"$f":"+I40","v":""}]
[11,{"$f":"IF(#REF!=2,'ERKEK ELEME'!#REF!,IF(#REF!=3,'ERKEK ELEME'!#REF!,IF(#REF!=4,'ERKEK ELEME'!#REF!,IF(#REF!=5,'ERKEK ELEME'!#REF!,IF(#REF!=6,'ERKEK ELEME'!#REF!)))))","v":{"$error":"#REF!"}},null,null,null,null,null,null,null,null,{"$f":"CH13","v":0},{"$f":"CI13","v":0},"Y-C",null,null,{"$f":"IF(AND(K16=0,L16=0),\"\",IF(K16>L16,I14,I17))","v":""},null,null,null,null,null,null,null,null,null,null,null,null,null,null,null,null,null,null,null,null,null,null,null,null,null,null,null,null,null,null,null,null,null,null,null,null,null,null,null,null,null,null,null,null,null,null,null,null,null,null,null,null,14,null,null,null,null,{"$f":"+I41","v":""},{"$f":"+I43","v":""}]
[null,null,null,{"$f":"CH8","v":0},{"$f":"CI8","v":0},"Y6",null,6,{"$f":"IF(AND(D17=0,E17=0),\"\",IF(D17>E17,B16,B18))","v":""},null,null,null,null,null,null,null,null,null,null,null,null,18,null,null,null,null,null,null,null,null,null,null,null,null,null,null,null,null,null,null,null,null,null,null,null,null,null,null,null,null,null,null,null,null,null,null,null,null,null,null,null,null,null,null,null,null,null,null,15,null,null,null,null,{"$f":"+I44","v":""},{"$f":"+I46","v":""}]
[12,{"$f":"IF(#REF!=2,'ERKEK ELEME'!#REF!,IF(#REF!=3,'ERKEK ELEME'!#REF!,IF(#REF!=4,'ERKEK ELEME'!#REF!,IF(#REF!=5,'ERKEK ELEME'!#REF!,IF(#REF!=6,'ERKEK ELEME'!#REF!)))))","v":{"$error":"#REF!"}},null,null,null,null,null,null,null,null,null,null,null,null,null,null,null,null,null,null,null,null,{"$f":"IF(AND(R19=0,S19=0),\"\",IF(R19>S19,P16,P21))","v":""},null,null,null,null,null,null,null,null,null,null,null,null,null,null,null,null,null,null,null,null,null,null,null,null,null,null,null,null,null,null,null,null,null,null,null,null,null,null,null,null,null,null,null,null,null,16,null,null,null,null,{"$f":"+I49","v":""},{"$f":"+I49","v":""}]
[13,{"$f":"IF(#REF!=2,'ERKEK ELEME'!#REF!,IF(#REF!=3,'ERKEK ELEME'!#REF!,IF(#REF!=4,'ERKEK ELEME'!#REF!,IF(#REF!=5,'ERKEK ELEME'!#REF!,IF(#REF!=6,'ERKEK ELEME'!#REF!)))))","v":{"$error":"#REF!"}},null,null,null,null,null,null,null,null,null,null,null,null,null,null,null,{"$f":"CH20","v":0},{"$f":"CI20","v":0},"Y-F",null,null,null,null,null,null,null,null,null,{"$f":"IF(AND(Y13=0,Z13=0),\"\",IF(Y13<Z13,W7,W18))","v":""},null,null,null,null,null,null,"2.",null,null,null,null,null,null,null,null,null,null,null,null,null,null,null,null,null,null,null,null,null,null,null,null,null,null,null,null,null,null,null,17,null,null,null,null,{"$f":"P4","v":""},{"$f":"P9","v":""}]
[null,null,null,{"$f":"CH9","v":0},{"$f":"CI9","v":0},"Y7",null,7,{"$f":"IF(AND(D20=0,E20=0),\"\",IF(D20>E20,B19,B21))","v":""},null,null,null,null,null,null,null,null,null,null,null,null,null,null,null,null,null,null,null,null,null,null,null,null,null,null,null,null,null,null,null,null,null,null,null,null,null,null,null,null,null,null,null,null,null,null,null,null,null,null,null,null,null,null,null,null,null,null,null,18,null,null,null,null,{"$f":"P16","v":""},{"$f":"P21","v":""}]
[14,{"$f":"IF(#REF!=2,'ERKEK ELEME'!#REF!,IF(#REF!=3,'ERKEK ELEME'!#REF!,IF(#REF!=4,'ERKEK ELEME'!#REF!,IF(#REF!=5,'ERKEK ELEME'!#REF!,IF(#REF!=6,'ERKEK ELEME'!#REF!)))))","v":{"$error":"#REF!"}},null,null,null,null,null,null,null,null,null,null,null,null,12,{"$f":"IF(AND(K22=0,L22=0),\"\",IF(K22>L22,I20,I23))","v":""},null,null,null,null,null,null,null,null,null,null,null,null,null,null,null,null,null,null,null,null,null,null,null,null,null,null,null,null,null,null,null,null,null,null,null,null,null,null,null,null,null,null,null,null,null,null,null,null,null,null,null,null,19,null,null,null,null,{"$f":"P27","v":""},{"$f":"P29","v":""}]
[15,{"$f":"IF(#REF!=2,'ERKEK ELEME'!#REF!,IF(#REF!=3,'ERKEK ELEME'!#REF!,IF(#REF!=4,'ERKEK ELEME'!#REF!,IF(#REF!=5,'ERKEK ELEME'!#REF!,IF(#REF!=6,'ERKEK ELEME'!#REF!)))))","v":{"$error":"#REF!"}},null,null,null,null,null,null,null,null,{"$f":"CH14","v":0},{"$f":"CI14","v":0},"Y-D",null,null,null,null,null,null,null,null,null,null,null,null,null,null,null,null,null,null,null,null,null,null,null,null,null,null,null,null,null,null,null,null,null,null,null,null,null,null,null,null,null,null,null,null,null,null,null,null,null,null,null,null,null,null,null,20,null,null,null,null,{"$f":"P31","v":""},{"$f":"P33","v":""}]
[null,null,null,{"$f":"CH10","v":0},{"$f":"CI10","v":0},"Y8",null,8,{"$f":"IF(AND(D23=0,E23=0),\"\",IF(D23>E23,B22,B24))","v":""},null,null,null,null,null,null,null,null,null,null,null,null,null,null,null,null,null,null,null,null,null,null,null,null,null,null,null,null,null,null,null,null,null,null,null,null,null,null,null,null,null,null,null,null,null,null,null,null,null,null,null,null,null,null,null,null,null,null,null,21,null,null,null,null,{"$f":"P39","v":""},{"$f":"P42","v":""}]
[16,{"$f":"IF(#REF!=2,'ERKEK ELEME'!#REF!,IF(#REF!=3,'ERKEK ELEME'!#REF!,IF(#REF!=4,'ERKEK ELEME'!#REF!,IF(#REF!=5,'ERKEK ELEME'!#REF!,IF(#REF!=6,'ERKEK ELEME'!#REF!)))))","v":{"$error":"#REF!"}},null,null,null,null,null,null,null,null,null,null,null,null,null,null,null,null,null,null,null,"E",{"$f":"IF(AND(R7=0,S7=0),\"\",IF(R7<S7,P4,P9))","v":""},null,null,null,null,null,null,null,null,null,null,null,null,null,null,null,null,null,null,null,null,null,null,null,null,null,null,null,null,null,null,null,null,null,null,null,null,null,null,null,null,null,null,null,null,null,22,null,null,null,null,{"$f":"P45","v":""},{"$f":"P48","v":""}]
[null,null,null,null,null,null,null,null,null,null,null,null,null,null,null,null,null,null,null,null,null,null,null,null,{"$f":"CH28","v":0},{"$f":"+CI28","v":0},"Y-J",null,26,{"$f":"IF(AND(Y25=0,Z25=0),\"\",IF(Y25>Z25,W24,W26))","v":""},null,null,null,null,null,null,"3.",null,null,null,null,null,null,null,null,null,null,null,null,null,null,null,null,null,null,null,null,null,null,null,null,null,null,null,null,null,null,null,23,null,null,null,null,{"$f":"P53","v":""},{"$f":"P55","v":""},null,null,null,null,null,null,null,null,null,null,null,null,null,null,null,null,null,null,null,null,null,null,null,null,null,null,null,null,null,null,null,null,null,null,null,null,null,null,null,null,null,null,null,null,null,null,null,null,null,null,null,null,null,null,null,null,null,null,null,null,null,null,null,null,null,null,null,null,null,null,null,null,null,null,null,null,null,null,null,null,null,null,null,null,null,null,null,null,null,null,null,null,null,null,null,null,null,null,null,null,null,null,null,null,null,null,null,null,null,null,null,null,null,null,null,null,null,null,null,null,null,null,null,null,null,null,null,null,null,null,null,null,null,null,null,null,null,null,null,null,null,null,null,null,null,null,null,null,null,null,null,null,null,null,null,null,null,null,null,null,null,null,null,null,null,null,null,null,null,null,null,null,null,null,null,null,null,null,null,null,null,null,null,null,null,null,null,null,null,null,null,null,null,null,null,null,null,null,null,null,null,null,null,null,null,null,null,null,null,null,null,null,null,null,null,null,null,null,null,null,null,null,null,null,null,null,null,null,null,null,null,null,null,null,null,null,null,null,null,null,null,null,null,null,null,null,null,null,null,null,null,null,null,null,null,null,null,null,null,null,null,null,null,null,null,null,null,null,null,null,null,null,null,null,null,null,null,null,null,null,null,null,null,null,null,null,null,null,null,null,null,null,null,null,null,null,null,null,null,null,null,null,null,null,null,null,null,null,null,null,null,null,null,null,null,null,null,null,null,null,null,null,null,null,null,null,null,null,null,null,null,null,null,null,null,null,null,null,null,null,null,null,null,null,null,null,null,null,null,null,null,null,null,null,null,null,null,null,null,null,null,null,null,null,null,null,null,null,null,null,null,null,null,null,null,null,null,null,null,null,null,null,null,null,null,null,null,null,null,null,null,null,null,null,null,null,null,null,null,null,null,null,null,null,null,null,null,null,null,null,null,null,null,null,null,null,null,null,null,null,null,null,null,null,null,null,null,null,null,null,null,null,null,null,null,null,null,null,null,null,null,null,null,null,null,null,null,null,null,null,null,null,null,null,null,null,null,null,null,null,null,null,null,null,null,null,null,null,null,null,null,null,null,null,null,null,null,null,null,null,null,null,null,null,null,null,null,null,null,null,null,null,null,null,null,null,null,null,null,null,null,null,null,null,null,null,null,null,null,null,null,null,null,null,null,null,null,null,null,null,null,null,null,null,null,null,null,null,null,null,null,null,null,null,null,null,null,null,null,null,null,null,null,null,null,null,null,null,null,null,null,null,null,null,null,null,null,null,null,null,null,null,null,null,null,null,null,null,null,null,null,null,null,null,null,null,null,null,null,null,null,null,null,null,null,null,null,null,null,null,null,null,null,null,null,null,null,null,null,null,null,null,null,null,null,null,null,null,null,null,null,null,null,null,null,null,null,null,null,null,null,null,null,null,null,null,null,null,null,null,null,null,null,null,null,null,null,null,null,null,null,null,null,null,null,null,null,null,null,null,null,null,null,null,null,null,null,null,null,null,null,null,null,null,null,null,null,null,null,null,null,null,null,null,null,null,null,null,null,null,null,null,null,null,null,null,null,null,null,null,null,null,null,null,null,null,null,null,null,null,null,null,null,null,null,null,null,null,null,null,null,null,null,null,null,null,null,null,null,null,null,null,null,null,null,null,null,null,null,null,null,null,null,null,null,null,null,null,null,null,null,null,null,null,null,null,null,null,null,null,null,null,null,null,null,null,null,null,null,null,null,null,null,null,null,null,null,null,null,null,null,null,null,null,null,null,null,null,null,null,null,null,null,null,null,null,null,null,null,null,null,null,null,null,null,null,null,null,null,null,null,null,null,null,null,null,null,null,null,null,null,null,null,null,null,null,null,null,null,null,null,null,null,null,null,null,null,null,null,null,null,null,null,null,null,null,null,null,null,null,null,null,null,null,null,null,null,null,null,null,null,null,null,null,null,null,null,null,null,null,null,null,null,null,null,null,null,null,null,null,null,null,null,null,null,null,null,null,null,null,null,null,null,null,null,null,null,null,null,null,null,null,null,null,null,null,null,null,null,null,null,null,null,null,null,null,null,null,null,null,null,null,null,null,null,null,null,null,null,null,null,null,null,null,null,null,null,null,null,null,null,null,null,null,null,null,null,null,null,null,null,null,null,null,null,null,null,null,null,null,null,null,null,null,null,null,null,null,null,null,null,null,null,null,null,null,null,null,null,null,null,null,null,null,null,null,null,null,null,null,null,null,null,null,null,null,null,null,null,null,null,null,null,null,null,null,null,null,null,null,null,null,null,null,null,null,null,null,null,null,null,null,null,null,null,null,null,null,null,null,null,null,null,null,null,null,null,null,null,null,null,null,null,null,null,null,null,null,null,null,null,null,null,null,null,null,null,null,null,null,null,null,null,null,null,null,null,null,null,null,null,null,null,null,null,null,null,null,null,null,null,null,null,null,null,null,null,null,null,null,null,null,null,null,null,null,null,null,null,null,null,null,null,null,null,null,null,null,null,null,null,null,null,null,null,null,null,null,null,null,null,null,null,null,null,null,null,null,null,null,null,null,null,null,null,null,null,null,null,null,null,null,null,null,null,null,null,null,null,null,null,0]
[null,null,null,null,null,null,null,null,null,null,null,null,null,null,null,null,null,null,null,null,null,"F",{"$f":"IF(AND(R19=0,S19=0),\"\",IF(R19<S19,P16,P21))","v":""},null,null,null,null,null,null,null,null,null,null,null,null,null,null,null,null,null,null,null,null,null,null,null,null,null,null,null,null,null,null,null,null,null,null,null,null,null,null,null,null,null,null,null,null,null,24,null,null,null,null,{"$f":"P57","v":""},{"$f":"P59","v":""}]
[null,null,null,null,null,null,null,null,null,null,null,null,null,null,"A",{"$f":"IF(AND(K4=0,L4=0),\"\",IF(K4<L4,I2,I5))","v":""},null,null,null,null,null,null,null,null,null,null,null,null,"J",{"$f":"IF(AND(Y25=0,Z25=0),\"\",IF(Y25<Z25,W24,W26))","v":""},null,null,null,null,null,null,"4.",null,null,null,null,null,null,null,null,null,null,null,null,null,null,null,null,null,null,null,null,null,null,null,null,null,null,null,null,null,null,null,25,null,null,null,null,{"$f":"W7","v":""},{"$f":"W18","v":""}]
[null,null,null,null,null,null,null,null,null,null,null,null,null,null,null,null,null,{"$f":"CH21","v":0},{"$f":"+CI21","v":0},"Y-G",null,19,{"$f":"IF(AND(R28=0,S28=0),\"\",IF(R28>S28,P27,P29))","v":""},null,null,null,null,null,null,null,null,null,null,null,null,null,null,null,null,null,null,null,null,null,null,null,null,null,null,null,null,null,null,null,null,null,null,null,null,null,null,null,null,null,null,null,null,null,26,null,null,null,null,{"$f":"W24","v":""},{"$f":"W26","v":""}]
[null,null,null,null,null,null,null,null,null,null,null,null,null,null,"B",{"$f":"IF(AND(K10=0,L10=0),\"\",IF(K10<L10,I8,I11))","v":""},null,null,null,null,null,null,null,null,null,null,null,null,27,null,null,null,null,null,null,null,null,null,null,null,null,null,null,null,null,null,null,null,null,null,null,null,null,null,null,null,null,null,null,null,null,null,null,null,null,null,null,null,27,null,null,null,null,{"$f":"W28","v":""},{"$f":"W32","v":""}]
[null,null,null,null,null,null,null,null,null,null,null,null,null,null,null,null,null,null,null,null,null,null,null,null,{"$f":"CH29","v":0},{"$f":"+CI29","v":0},"Y-K",null,null,{"$f":"IF(AND(Y30=0,Z30=0),\"\",IF(Y30>Z30,W28,W32))","v":""},null,null,null,null,null,null,"5.",null,null,null,null,null,null,null,null,null,null,null,null,null,null,null,null,null,null,null,null,null,null,null,null,null,null,null,null,null,null,null,28,null,null,null,null,{"$f":"W34","v":""},{"$f":"W36","v":""}]
[null,null,null,null,null,null,null,null,null,null,null,null,null,null,"C",{"$f":"IF(AND(K16=0,L16=0),\"\",IF(K16<L16,I14,I17))","v":""},null,null,null,null,null,null,null,null,null,null,null,null,null,null,null,null,null,null,null,null,null,null,null,null,null,null,null,null,null,null,null,null,null,null,null,null,null,null,null,null,null,null,null,null,null,null,null,null,null,null,null,null,29,null,null,null,null,{"$f":"W41","v":""},{"$f":"W46","v":""}]
[null,null,null,null,null,null,null,null,null,null,null,null,null,null,null,null,null,{"$f":"CH22","v":0},{"$f":"+CI22","v":0},"Y-H",null,20,{"$f":"IF(AND(R32=0,S32=0),\"\",IF(R32>S32,P31,P33))","v":""},null,null,null,null,null,null,null,null,null,null,null,null,null,null,null,null,null,null,null,null,null,null,null,null,null,null,null,null,null,null,null,null,null,null,null,null,null,null,null,null,null,null,null,null,null,30,null,null,null,null,{"$f":"W50","v":""},{"$f":"W52","v":""}]
[null,null,null,null,null,null,null,null,null,null,null,null,null,null,"D",{"$f":"IF(AND(K22=0,L22=0),\"\",IF(K22<L22,I20,I23))","v":""},null,null,null,null,null,null,null,null,null,null,null,null,"K",{"$f":"IF(AND(Y30=0,Z30=0),\"\",IF(Y30<Z30,W28,W32))","v":""},null,null,null,null,null,null,"6.",null,null,null,null,null,null,null,null,null,null,null,null,null,null,null,null,null,null,null,null,null,null,null,null,null,null,null,null,null,null,null,31,null,null,null,null,{"$f":"W54","v":""},{"$f":"W58","v":""}]
[null,null,null,null,null,null,null,null,null,null,null,null,null,null,null,null,null,null,null,null,null,"G",{"$f":"IF(AND(R28=0,S28=0),\"\",IF(R28<S28,P27,P29))","v":""},null,null,null,null,null,null,null,null,null,null,null,null,null,null,null,null,null,null,null,null,null,null,null,null,null,null,null,null,null,null,null,null,null,null,null,null,null,null,null,null,null,null,null,null,null,32,null,null,null,null,{"$f":"W60","v":""},{"$f":"W62","v":""}]
[null,null,null,null,null,null,null,null,null,null,null,null,null,null,null,null,null,null,null,null,null,null,null,null,{"$f":"CH30","v":0},{"$f":"+CI30","v":0},"Y-L",null,28,{"$f":"IF(AND(Y35=0,Z35=0),\"\",IF(Y35>Z35,W34,W36))","v":""},null,null,null,null,null,null,"7."]
[null,null,null,null,null,null,null,null,null,null,null,null,null,null,null,null,null,null,null,null,null,"H",{"$f":"IF(AND(R32=0,S32=0),\"\",IF(R32<S32,P31,P33))","v":""}]
[null,null,null,null,null,null,null,null,null,null,null,null,null,null,null,null,null,null,null,null,null,null,null,null,null,null,null,null,"L",{"$f":"IF(AND(Y35=0,Z35=0),\"\",IF(Y35<Z35,W34,W36))","v":""},null,null,null,null,null,null,"8."]
[null,null,null,null,null,null,null,"Y1",{"$f":"IF(AND(D2=0,E2=0),\"\",IF(D2<E2,B1,B3))","v":""}]
[null,null,null,null,null,null,null,null,null,null,{"$f":"CH15","v":0},{"$f":"CI15","v":0},"Y9",null,13,{"$f":"IF(AND(K39=0,L39=0),\"\",IF(K39>L39,I38,I40))","v":""}]
[null,null,null,null,null,null,null,"Y2",{"$f":"IF(AND(D5=0,E5=0),\"\",IF(D5<E5,B4,B6))","v":""},null,null,null,null,null,null,null,null,null,null,null,null,21]
[null,null,null,null,null,null,null,"Y3",{"$f":"IF(AND(D8=0,E8=0),\"\",IF(D8<E8,B7,B9))","v":""},null,null,null,null,null,null,null,null,{"$f":"CH23","v":0},{"$f":"CI23","v":0},"Y13",null,null,{"$f":"IF(AND(R41=0,S41=0),\"\",IF(R41>S41,P39,P42))","v":""}]
[null,null,null,null,null,null,null,null,null,null,{"$f":"CH16","v":0},{"$f":"CI16","v":0},"Y10",null,14,{"$f":"IF(AND(K42=0,L42=0),\"\",IF(K42>L42,I41,I43))","v":""},null,null,null,null,null,null,null,null,null,null,null,null,29]
[null,null,null,null,null,null,null,"Y4",{"$f":"IF(AND(D11=0,E11=0),\"\",IF(D11<E11,B10,B12))","v":""}]
[null,null,null,null,null,null,null,"Y5",{"$f":"IF(AND(D14=0,E14=0),\"\",IF(D14<E14,B13,B15))","v":""},null,null,null,null,null,null,null,null,null,null,null,null,null,null,null,{"$f":"CH31","v":0},{"$f":"CI31","v":0},"Y17",null,null,{"$f":"IF(AND(Y44=0,Z44=0),\"\",IF(Y44>Z44,W41,W46))","v":""},null,null,null,null,null,null,"9."]
[null,null,null,null,null,null,null,null,null,null,{"$f":"CH17","v":0},{"$f":"CI17","v":0},"Y11",null,15,{"$f":"IF(AND(K45=0,L45=0),\"\",IF(K45>L45,I44,I46))","v":""}]
[null,null,null,null,null,null,null,"Y6",{"$f":"IF(AND(D17=0,E17=0),\"\",IF(D17<E17,B16,B18))","v":""},null,null,null,null,null,null,null,null,null,null,null,null,22,{"$f":"IF(AND(R47=0,S47=0),\"\",IF(R47>S47,P45,P48))","v":""}]
[null,null,null,null,null,null,null,"Y7",{"$f":"IF(AND(D20=0,E20=0),\"\",IF(D20<E20,B19,B21))","v":""},null,null,null,null,null,null,null,null,{"$f":"CH24","v":0},{"$f":"CI24","v":0},"Y14",null,null,null,null,null,null,null,null,"Y17",{"$f":"IF(AND(Y44=0,Z44=0),\"\",IF(Y44<Z44,W41,W46))","v":""},null,null,null,null,null,null,"10."]
[null,null,null,null,null,null,null,null,null,null,{"$f":"CH18","v":0},{"$f":"CI18","v":0},"Y12",null,16,{"$f":"IF(AND(K48=0,L48=0),\"\",IF(K48>L48,I47,I49))","v":""}]
[null,null,null,null,null,null,null,"Y8",{"$f":"IF(AND(D23=0,E23=0),\"\",IF(D23<E23,B22,B24))","v":""}]
[null,null,null,null,null,null,null,null,null,null,null,null,null,null,null,null,null,null,null,null,null,"E",{"$f":"IF(AND(R41=0,S41=0),\"\",IF(R41<S41,P39,P42))","v":""}]
[null,null,null,null,null,null,null,null,null,null,null,null,null,null,null,null,null,null,null,null,null,null,null,null,{"$f":"CH32","v":0},{"$f":"+CI32","v":0},"Y18",null,30,{"$f":"IF(AND(Y51=0,Z51=0),\"\",IF(Y51>Z51,W50,W52))","v":""},null,null,null,null,null,null,"11."]
[null,null,null,null,null,null,null,null,null,null,null,null,null,null,null,null,null,null,null,null,null,"F",{"$f":"IF(AND(R47=0,S47=0),\"\",IF(R47<S47,P45,P48))","v":""}]
[null,null,null,null,null,null,null,null,null,null,null,null,null,null,"Y1",{"$f":"IF(AND(K39=0,L39=0),\"\",IF(K39<L39,I38,I40))","v":""},null,null,null,null,null,null,null,null,null,null,null,null,"Y18",{"$f":"IF(AND(Y51=0,Z51=0),\"\",IF(Y51<Z51,W50,W52))","v":""},null,null,null,null,null,null,"12."]
[null,null,null,null,null,null,null,null,null,null,null,null,null,null,null,null,null,{"$f":"CH25","v":0},{"$f":"+CI25","v":0},"Y15",null,23,{"$f":"IF(AND(R54=0,S54=0),\"\",IF(R54>S54,P53,P55))","v":""}]
[null,null,null,null,null,null,null,null,null,null,null,null,null,null,"Y2",{"$f":"IF(AND(K42=0,L42=0),\"\",IF(K42<L42,I41,I43))","v":""},null,null,null,null,null,null,null,null,null,null,null,null,31]
[null,null,null,null,null,null,null,null,null,null,null,null,null,null,null,null,null,null,null,null,null,null,null,null,{"$f":"CH33","v":0},{"$f":"+CI33","v":0},"Y19",null,null,{"$f":"IF(AND(Y56=0,Z56=0),\"\",IF(Y56>Z56,W54,W58))","v":""},null,null,null,null,null,null,"13."]
[null,null,null,null,null,null,null,null,null,null,null,null,null,null,"Y3",{"$f":"IF(AND(K45=0,L45=0),\"\",IF(K45<L45,I44,I46))","v":""}]
[null,null,null,null,null,null,null,null,null,null,null,null,null,null,null,null,null,{"$f":"CH26","v":0},{"$f":"+CI26","v":0},"Y16",null,24,{"$f":"IF(AND(R58=0,S58=0),\"\",IF(R58>S58,P57,P59))","v":""}]
[null,null,null,null,null,null,null,null,null,null,null,null,null,null,"Y4",{"$f":"IF(AND(K48=0,L48=0),\"\",IF(K48<L48,I47,I49))","v":""},null,null,null,null,null,null,null,null,null,null,null,null,"Y19",{"$f":"IF(AND(Y56=0,Z56=0),\"\",IF(Y56<Z56,W54,W58))","v":""},null,null,null,null,null,null,"14."]
[null,null,null,null,null,null,null,null,null,null,null,null,null,null,null,null,null,null,null,null,null,"Y15",{"$f":"IF(AND(R54=0,S54=0),\"\",IF(R54<S54,P53,P55))","v":""}]
[null,null,null,null,null,null,null,null,null,null,null,null,null,null,null,null,null,null,null,null,null,null,null,null,{"$f":"CH34","v":0},{"$f":"+CI34","v":0},"Y20",null,32,{"$f":"IF(AND(Y61=0,Z61=0),\"\",IF(Y61>Z61,W60,W62))","v":""},null,null,null,null,null,null,"15."]
[null,null,null,null,null,null,null,null,null,null,null,null,null,null,null,null,null,null,null,null,null,"Y16",{"$f":"IF(AND(R58=0,S58=0),\"\",IF(R58<S58,P57,P59))","v":""}]
[null,null,null,null,null,null,null,null,null,null,null,null,null,null,null,null,null,null,null,null,null,null,null,null,null,null,null,null,"Y20",{"$f":"IF(AND(Y61=0,Z61=0),\"\",IF(Y61<Z61,W60,W62))","v":""},null,null,null,null,null,null,"16"]

{"sheet":"16DE","index":7,"n_rows":63,"n_cols":1217,"rows_kept":63,"cut":false,"hidden":true,"merged":[[8,1,8,7],[8,15,8,21],[9,1,9,7],[10,8,10,14],[11,1,11,7],[7,8,7,14],[0,1,0,7],[0,24,2,46],[1,8,1,14],[2,1,2,7],[3,1,3,7],[3,15,3,21],[4,8,4,14],[5,1,5,7],[6,1,6,7],[6,22,6,28],[3,24,4,46],[19,8,19,14],[19,43,19,49],[12,50,12,56],[13,8,13,14],[14,1,14,7],[15,1,15,7],[15,15,15,21],[16,8,16,14],[12,1,12,7],[17,1,17,7],[17,22,17,28],[18,1,18,7],[18,22,18,28],[20,1,20,7],[20,15,20,21],[21,1,21,7],[22,8,22,14],[23,1,23,7],[23,29,23,35],[24,15,24,21],[24,50,24,56],[25,8,25,14],[25,22,25,28],[25,36,25,42],[30,15,30,21],[30,50,30,55],[31,8,31,14],[31,29,31,35],[32,15,32,21],[26,15,26,21],[27,8,27,14],[27,29,27,35],[28,15,28,21],[29,8,29,14],[29,22,29,28],[38,15,38,21],[38,36,38,42],[33,8,33,14],[33,22,33,28],[33,36,33,42],[34,15,34,21],[36,15,36,21],[36,36,36,42],[37,8,37,14],[37,22,37,28],[35,8,35,14],[35,29,35,35],[39,8,39,14],[39,43,39,49],[40,29,40,35],[41,36,41,42],[42,29,42,35],[43,22,43,28],[43,36,43,42],[44,29,44,35],[45,22,45,28],[62,29,62,35],[54,15,54,21],[55,29,55,35],[56,15,56,21],[57,22,57,28],[58,15,58,21],[58,29,58,35],[50,29,50,35],[51,36,51,42],[52,15,52,21],[52,29,52,35],[53,22,53,28],[53,36,53,42],[1,85,1,86],[1,75,1,76],[1,77,1,78],[1,79,1,80],[1,81,1,82],[1,83,1,84],[59,22,59,28],[60,29,60,35],[61,22,61,28],[37,43,37,49],[49,22,49,28],[49,36,49,42],[46,36,46,42],[47,22,47,28],[48,29,48,35],[34,43,34,49],[29,43,29,49],[18,57,18,63],[25,57,25,63]]}
[1,{"$f":"IF(#REF!=2,'ERKEK ELEME'!#REF!,IF(#REF!=3,'ERKEK ELEME'!#REF!,IF(#REF!=4,'ERKEK ELEME'!#REF!,IF(#REF!=5,'ERKEK ELEME'!#REF!,IF(#REF!=6,'ERKEK ELEME'!#REF!)))))","v":{"$error":"#REF!"}},null,null,null,null,null,null,null,null,null,null,null,null,null,null,null,null,null,null,null,null,null,null,{"$f":"KATILIM!AC1","v":"TÜRKİYE MASA TENİSİ FEDERASYONU\nYILDIZLAR KUZEYBATI BÖLGE YARIŞMALARI"},null,null,null,null,null,null,null,null,null,null,null,null,null,null,null,null,null,null,null,null,null,null,null,null,null,null,null,null,null,null,null,null,null,null,null,null,null,null,null,null,null,null,null,null,null,null,null,null,null,null,null,null,null,null,null,null,null,null,null,null,null,null,null,null,null,null,null,null,null,null,null,null,null,null,null,null,null,null,"1st Round",1]
[null,null,null,{"$f":"CH3","v":0},{"$f":"CI3","v":0},"Y1",null,1,{"$f":"IF(AND(D2=0,E2=0),\"\",IF(D2>E2,B1,B3))","v":""},null,null,null,null,null,null,null,null,null,null,null,null,null,null,null,null,null,null,null,null,null,null,null,null,null,null,null,null,null,null,null,null,null,null,null,null,null,null,null,null,null,null,null,null,null,null,null,null,null,null,null,null,null,null,null,null,null,null,null,"#","Date","Time","Table","Competition","Player A","Player B","Set1",null,"Set2",null,"Set3",null,"Set4",null,"Set5",null,"Result",null,null,null,null,null,null,null,null,null,null,null,null,null,null,null,null,null,"2sn Round"]
[2,{"$f":"IF(#REF!=2,'ERKEK ELEME'!#REF!,IF(#REF!=3,'ERKEK ELEME'!#REF!,IF(#REF!=4,'ERKEK ELEME'!#REF!,IF(#REF!=5,'ERKEK ELEME'!#REF!,IF(#REF!=6,'ERKEK ELEME'!#REF!)))))","v":{"$error":"#REF!"}},null,null,null,null,null,null,null,null,null,null,null,null,9,null,null,null,null,null,null,null,null,null,null,null,null,null,null,null,null,null,null,null,null,null,null,null,null,null,null,null,null,null,null,null,null,null,null,null,null,null,null,null,null,null,null,null,null,null,null,null,null,null,null,null,null,null,1,null,null,null,null,{"$f":"B1","v":{"$error":"#REF!"}},{"$f":"B3","v":{"$error":"#REF!"}},null,null,null,null,null,null,null,null,null,null,null,null,null,null,null,null,null,null,null,null,null,null,null,null,null,null,null,null,"3th Round"]
[3,{"$f":"IF(#REF!=2,'ERKEK ELEME'!#REF!,IF(#REF!=3,'ERKEK ELEME'!#REF!,IF(#REF!=4,'ERKEK ELEME'!#REF!,IF(#REF!=5,'ERKEK ELEME'!#REF!,IF(#REF!=6,'ERKEK ELEME'!#REF!)))))","v":{"$error":"#REF!"}},null,null,null,null,null,null,null,null,{"$f":"CH11","v":0},{"$f":"CI11","v":0},"Y9",null,null,{"$f":"IF(AND(K4=0,L4=0),\"\",IF(K4>L4,I2,I5))","v":""},null,null,null,null,null,null,null,null,{"$f":"KATILIM!AC2&\" \"&KATILIM!AE3","v":"ERKEK TAKIM  [01-02 Mart 2025 BALIKESİR] [ Ana Tablo ]"},null,null,null,null,null,null,null,null,null,null,null,null,null,null,null,null,null,null,null,null,null,null,null,null,null,null,null,null,null,null,null,null,null,null,null,null,null,null,null,null,null,null,null,2,null,null,null,null,{"$f":"B4","v":{"$error":"#REF!"}},{"$f":"B6","v":{"$error":"#REF!"}},null,null,null,null,null,null,null,null,null,null,null,null,null,null,null,null,null,null,null,null,null,null,null,null,null,null,null,null,"4th Round"]
[null,null,null,{"$f":"CH4","v":0},{"$f":"CI4","v":0},"Y2",null,2,{"$f":"IF(AND(D5=0,E5=0),\"\",IF(D5>E5,B4,B6))","v":""},null,null,null,null,null,null,null,null,null,null,null,null,17,null,null,null,null,null,null,null,null,null,null,null,null,null,null,null,null,null,null,null,null,null,null,null,null,null,null,null,null,null,null,null,null,null,null,null,null,null,null,null,null,null,null,null,null,null,null,3,null,null,null,null,{"$f":"B7","v":{"$error":"#REF!"}},{"$f":"B9","v":{"$error":"#REF!"}},null,null,null,null,null,null,null,null,null,null,null,null,null,null,null,null,null,null,null,null,null,null,null,null,null,null,null,null,"5th Round"]
[4,{"$f":"IF(#REF!=2,'ERKEK ELEME'!#REF!,IF(#REF!=3,'ERKEK ELEME'!#REF!,IF(#REF!=4,'ERKEK ELEME'!#REF!,IF(#REF!=5,'ERKEK ELEME'!#REF!,IF(#REF!=6,'ERKEK ELEME'!#REF!)))))","v":{"$error":"#REF!"}},null,null,null,null,null,null,null,null,null,null,null,null,null,null,null,null,null,null,null,null,null,null,null,null,null,null,null,null,null,null,null,null,null,null,null,null,null,null,null,null,null,null,null,null,null,null,null,null,null,null,null,null,null,null,null,null,null,null,null,null,null,null,null,null,null,null,4,null,null,null,null,{"$f":"B10","v":{"$error":"#REF!"}},{"$f":"B12","v":{"$error":"#REF!"}},null,null,null,null,null,null,null,null,null,null,null,null,null,null,null,null,null,null,null,null,null,null,null,null,null,null,null,null,"6th Round"]
[5,{"$f":"IF(#REF!=2,'ERKEK ELEME'!#REF!,IF(#REF!=3,'ERKEK ELEME'!#REF!,IF(#REF!=4,'ERKEK ELEME'!#REF!,IF(#REF!=5,'ERKEK ELEME'!#REF!,IF(#REF!=6,'ERKEK ELEME'!#REF!)))))","v":{"$error":"#REF!"}},null,null,null,null,null,null,null,null,null,null,null,null,null,null,null,{"$f":"CH19","v":0},{"$f":"CI19","v":0},"Y17",null,null,{"$f":"IF(AND(R7=0,S7=0),\"\",IF(R7>S7,P4,P9))","v":""},null,null,null,null,null,null,null,null,null,null,null,null,null,null,null,null,null,null,null,null,null,null,null,null,null,null,null,null,null,null,null,null,null,null,null,null,null,null,null,null,null,null,null,null,null,5,null,null,null,null,{"$f":"B13","v":{"$error":"#REF!"}},{"$f":"B15","v":{"$error":"#REF!"}},null,null,null,null,null,null,null,null,null,null,null,null,null,null,null,null,null,null,null,null,null,null,null,null,null,null,null,null,"7th Round"]
[null,null,null,{"$f":"CH5","v":0},{"$f":"CI5","v":0},"Y3",null,3,{"$f":"IF(AND(D8=0,E8=0),\"\",IF(D8>E8,B7,B9))","v":""},null,null,null,null,null,null,null,null,null,null,null,null,null,null,null,null,null,null,null,25,null,null,null,null,null,null,null,null,null,null,null,null,null,null,null,null,null,null,null,null,null,null,null,null,null,null,null,null,null,null,null,null,null,null,null,null,null,null,null,6,null,null,null,null,{"$f":"B16","v":{"$error":"#REF!"}},{"$f":"B18","v":{"$error":"#REF!"}},null,null,null,null,null,null,null,null,null,null,null,null,null,null,null,null,null,null,null,null,null,null,null,null,null,null,null,null,"8th Round"]
[6,{"$f":"IF(#REF!=2,'ERKEK ELEME'!#REF!,IF(#REF!=3,'ERKEK ELEME'!#REF!,IF(#REF!=4,'ERKEK ELEME'!#REF!,IF(#REF!=5,'ERKEK ELEME'!#REF!,IF(#REF!=6,'ERKEK ELEME'!#REF!)))))","v":{"$error":"#REF!"}},null,null,null,null,null,null,null,null,null,null,null,null,10,{"$f":"IF(AND(K10=0,L10=0),\"\",IF(K10>L10,I8,I11))","v":""},null,null,null,null,null,null,null,null,null,null,null,null,null,null,null,null,null,null,null,null,null,null,null,null,null,null,null,null,null,null,null,null,null,null,null,null,null,null,null,null,null,null,null,null,null,null,null,null,null,null,null,null,7,null,null,null,null,{"$f":"B19","v":{"$error":"#REF!"}},{"$f":"B21","v":{"$error":"#REF!"}}]
[7,{"$f":"IF(#REF!=2,'ERKEK ELEME'!#REF!,IF(#REF!=3,'ERKEK ELEME'!#REF!,IF(#REF!=4,'ERKEK ELEME'!#REF!,IF(#REF!=5,'ERKEK ELEME'!#REF!,IF(#REF!=6,'ERKEK ELEME'!#REF!)))))","v":{"$error":"#REF!"}},null,null,null,null,null,null,null,null,{"$f":"CH12","v":0},{"$f":"CI12","v":0},"Y10",null,null,null,null,null,null,null,null,null,null,null,null,null,null,null,null,null,null,null,null,null,null,null,null,null,null,null,null,null,null,null,null,null,null,null,null,null,null,null,null,null,null,null,null,null,null,null,null,null,null,null,null,null,null,null,8,null,null,null,null,{"$f":"B22","v":{"$error":"#REF!"}},{"$f":"B24","v":{"$error":"#REF!"}}]
[null,null,null,{"$f":"CH6","v":0},{"$f":"CI6","v":0},"Y4",null,4,{"$f":"IF(AND(D11=0,E11=0),\"\",IF(D11>E11,B10,B12))","v":""},null,null,null,null,null,null,null,null,null,null,null,null,null,null,null,null,null,null,null,null,null,null,null,null,null,null,null,null,null,null,null,null,null,null,null,null,null,null,null,null,null,null,null,null,null,null,null,null,null,null,null,null,null,null,null,null,null,null,null,9,null,null,null,null,{"$f":"I2","v":""},{"$f":"I5","v":""}]
[8,{"$f":"IF(#REF!=2,'ERKEK ELEME'!#REF!,IF(#REF!=3,'ERKEK ELEME'!#REF!,IF(#REF!=4,'ERKEK ELEME'!#REF!,IF(#REF!=5,'ERKEK ELEME'!#REF!,IF(#REF!=6,'ERKEK ELEME'!#REF!)))))","v":{"$error":"#REF!"}},null,null,null,null,null,null,null,null,null,null,null,null,null,null,null,null,null,null,null,null,null,null,null,null,null,null,null,null,null,null,null,null,null,null,null,null,null,null,null,null,null,null,null,null,null,null,null,null,null,null,null,null,null,null,null,null,null,null,null,null,null,null,null,null,null,null,10,null,null,null,null,{"$f":"I8","v":""},{"$f":"I11","v":""}]
[9,{"$f":"IF(#REF!=2,'ERKEK ELEME'!#REF!,IF(#REF!=3,'ERKEK ELEME'!#REF!,IF(#REF!=4,'ERKEK ELEME'!#REF!,IF(#REF!=5,'ERKEK ELEME'!#REF!,IF(#REF!=6,'ERKEK ELEME'!#REF!)))))","v":{"$error":"#REF!"}},null,null,null,null,null,null,null,null,null,null,null,null,null,null,null,null,null,null,null,null,null,null,{"$f":"CH27","v":0},{"$f":"+CI27","v":0},"Y25",null,null,null,null,null,null,null,null,null,null,null,null,null,null,null,null,null,null,null,null,null,null,null,{"$f":"IF(AND(Y13=0,Z13=0),\"\",IF(Y13>Z13,W7,W18))","v":""},null,null,null,null,null,null,null,null,null,null,null,null,null,null,null,null,null,11,null,null,null,null,{"$f":"I14","v":""},{"$f":"I17","v":""}]
[null,null,null,{"$f":"CH7","v":0},{"$f":"CI7","v":0},"Y5",null,5,{"$f":"IF(AND(D14=0,E14=0),\"\",IF(D14>E14,B13,B15))","v":""},null,null,null,null,null,null,null,null,null,null,null,null,null,null,null,null,null,null,null,null,null,null,null,null,null,null,null,null,null,null,null,null,null,null,null,null,null,null,null,null,null,null,null,null,null,null,null,40,null,null,null,null,null,null,null,null,null,null,null,12,null,null,null,null,{"$f":"I20","v":""},{"$f":"I23","v":""}]
[10,{"$f":"IF(#REF!=2,'ERKEK ELEME'!#REF!,IF(#REF!=3,'ERKEK ELEME'!#REF!,IF(#REF!=4,'ERKEK ELEME'!#REF!,IF(#REF!=5,'ERKEK ELEME'!#REF!,IF(#REF!=6,'ERKEK ELEME'!#REF!)))))","v":{"$error":"#REF!"}},null,null,null,null,null,null,null,null,null,null,null,null,11,null,null,null,null,null,null,null,null,null,null,null,null,null,null,null,null,null,null,null,null,null,null,null,null,null,null,null,null,null,null,null,null,null,null,null,null,null,null,null,null,null,null,null,null,null,null,null,null,null,null,null,null,null,13,null,null,null,null,{"$f":"I26","v":""},{"$f":"I28","v":""}]
[11,{"$f":"IF(#REF!=2,'ERKEK ELEME'!#REF!,IF(#REF!=3,'ERKEK ELEME'!#REF!,IF(#REF!=4,'ERKEK ELEME'!#REF!,IF(#REF!=5,'ERKEK ELEME'!#REF!,IF(#REF!=6,'ERKEK ELEME'!#REF!)))))","v":{"$error":"#REF!"}},null,null,null,null,null,null,null,null,{"$f":"CH13","v":0},{"$f":"CI13","v":0},"Y11",null,null,{"$f":"IF(AND(K16=0,L16=0),\"\",IF(K16>L16,I14,I17))","v":""},null,null,null,null,null,null,null,null,null,null,null,null,null,null,null,null,null,null,null,null,null,null,null,null,null,null,null,null,null,null,null,null,null,null,null,null,null,null,null,null,null,null,null,null,null,null,null,null,null,null,null,null,14,null,null,null,null,{"$f":"I30","v":""},{"$f":"I32","v":""}]
[null,null,null,{"$f":"CH8","v":0},{"$f":"CI8","v":0},"Y6",null,6,{"$f":"IF(AND(D17=0,E17=0),\"\",IF(D17>E17,B16,B18))","v":""},null,null,null,null,null,null,null,null,null,null,null,null,18,null,null,null,null,null,null,null,null,null,null,null,null,null,null,null,null,null,null,null,null,null,null,null,null,null,null,null,null,null,null,null,null,null,null,null,null,null,null,null,null,null,null,null,null,null,null,15,null,null,null,null,{"$f":"I34","v":""},{"$f":"I36","v":""}]
[12,{"$f":"IF(#REF!=2,'ERKEK ELEME'!#REF!,IF(#REF!=3,'ERKEK ELEME'!#REF!,IF(#REF!=4,'ERKEK ELEME'!#REF!,IF(#REF!=5,'ERKEK ELEME'!#REF!,IF(#REF!=6,'ERKEK ELEME'!#REF!)))))","v":{"$error":"#REF!"}},null,null,null,null,null,null,null,null,null,null,null,null,null,null,null,null,null,null,null,null,{"$f":"IF(AND(R19=0,S19=0),\"\",IF(R19>S19,P16,P21))","v":""},null,null,null,null,null,null,null,null,null,null,null,null,null,null,null,null,null,null,null,null,null,null,null,null,null,null,null,null,null,null,null,null,null,null,null,null,null,null,null,null,null,null,null,null,null,16,null,null,null,null,{"$f":"I38","v":""},{"$f":"I40","v":""}]
[13,{"$f":"IF(#REF!=2,'ERKEK ELEME'!#REF!,IF(#REF!=3,'ERKEK ELEME'!#REF!,IF(#REF!=4,'ERKEK ELEME'!#REF!,IF(#REF!=5,'ERKEK ELEME'!#REF!,IF(#REF!=6,'ERKEK ELEME'!#REF!)))))","v":{"$error":"#REF!"}},null,null,null,null,null,null,null,null,null,null,null,null,null,null,null,{"$f":"CH20","v":0},{"$f":"CI20","v":0},"Y18",null,null,null,null,null,null,null,null,null,null,null,null,null,null,null,null,null,null,null,null,null,null,null,null,null,null,null,null,null,null,null,null,{"$f":"CH42","v":0},{"$f":"CI42","v":0},"Y40",null,null,{"$f":"IF(AND(BA19=0,BB19=0),\"\",IF(BA19>BB19,AY13,AY25))","v":""},null,null,null,null,null,null,"1.",null,null,null,17,null,null,null,null,{"$f":"P4","v":""},{"$f":"P9","v":""}]
[null,null,null,{"$f":"CH9","v":0},{"$f":"CI9","v":0},"Y7",null,7,{"$f":"IF(AND(D20=0,E20=0),\"\",IF(D20>E20,B19,B21))","v":""},null,null,null,null,null,null,null,null,null,null,null,null,null,null,null,null,null,null,null,null,null,null,null,null,null,null,null,null,null,null,null,null,null,"Y25",{"$f":"IF(AND(Y13=0,Z13=0),\"\",IF(Y13<Z13,W7,W18))","v":""},null,null,null,null,null,null,null,null,null,null,null,null,null,null,null,null,null,null,null,null,null,null,null,null,18,null,null,null,null,{"$f":"P16","v":""},{"$f":"P21","v":""}]
[14,{"$f":"IF(#REF!=2,'ERKEK ELEME'!#REF!,IF(#REF!=3,'ERKEK ELEME'!#REF!,IF(#REF!=4,'ERKEK ELEME'!#REF!,IF(#REF!=5,'ERKEK ELEME'!#REF!,IF(#REF!=6,'ERKEK ELEME'!#REF!)))))","v":{"$error":"#REF!"}},null,null,null,null,null,null,null,null,null,null,null,null,12,{"$f":"IF(AND(K22=0,L22=0),\"\",IF(K22>L22,I20,I23))","v":""},null,null,null,null,null,null,null,null,null,null,null,null,null,null,null,null,null,null,null,null,null,null,null,null,null,null,null,null,null,null,null,null,null,39,null,null,null,null,null,null,null,null,null,null,null,null,null,null,null,null,null,null,19,null,null,null,null,{"$f":"P25","v":""},{"$f":"P27","v":""}]
[15,{"$f":"IF(#REF!=2,'ERKEK ELEME'!#REF!,IF(#REF!=3,'ERKEK ELEME'!#REF!,IF(#REF!=4,'ERKEK ELEME'!#REF!,IF(#REF!=5,'ERKEK ELEME'!#REF!,IF(#REF!=6,'ERKEK ELEME'!#REF!)))))","v":{"$error":"#REF!"}},null,null,null,null,null,null,null,null,{"$f":"CH14","v":0},{"$f":"CI14","v":0},"Y12",null,null,null,null,null,null,null,null,null,null,null,null,null,null,null,null,null,null,null,null,null,null,null,null,null,null,null,null,null,null,null,null,null,null,null,null,null,null,null,null,null,null,null,null,null,null,null,null,null,null,null,null,null,null,null,20,null,null,null,null,{"$f":"P29","v":""},{"$f":"P31","v":""}]
[null,null,null,{"$f":"CH10","v":0},{"$f":"CI10","v":0},"Y8",null,8,{"$f":"IF(AND(D23=0,E23=0),\"\",IF(D23>E23,B22,B24))","v":""},null,null,null,null,null,null,null,null,null,null,null,null,null,null,null,null,null,null,null,null,null,null,null,null,null,null,null,null,null,null,null,null,null,null,null,null,null,null,null,null,null,null,null,null,null,null,null,null,null,null,null,null,null,null,null,null,null,null,null,21,null,null,null,null,{"$f":"P33","v":""},{"$f":"P35","v":""}]
[16,{"$f":"IF(#REF!=2,'ERKEK ELEME'!#REF!,IF(#REF!=3,'ERKEK ELEME'!#REF!,IF(#REF!=4,'ERKEK ELEME'!#REF!,IF(#REF!=5,'ERKEK ELEME'!#REF!,IF(#REF!=6,'ERKEK ELEME'!#REF!)))))","v":{"$error":"#REF!"}},null,null,null,null,null,null,null,null,null,null,null,null,null,null,null,null,null,null,null,null,null,null,null,null,null,null,"Y17",{"$f":"IF(AND(R7=0,S7=0),\"\",IF(R7<S7,P4,P9))","v":""},null,null,null,null,null,null,null,null,null,null,null,null,null,null,null,null,null,null,null,null,null,null,null,null,null,null,null,null,null,null,null,null,null,null,null,null,null,null,22,null,null,null,null,{"$f":"P37","v":""},{"$f":"P39","v":""}]
[null,null,null,null,null,null,null,null,null,null,null,null,null,null,"Y12",{"$f":"IF(AND(K22=0,L22=0),\"\",IF(K22<L22,I20,I23))","v":""},null,null,null,null,null,null,null,null,null,null,null,null,null,null,null,null,null,null,null,32,null,null,null,null,null,null,null,null,null,{"$f":"CH41","v":0},{"$f":"+CI41","v":0},"Y39",null,null,{"$f":"IF(AND(AT25=0,AU25=0),\"\",IF(AT25>AU25,AR20,AR30))","v":""},null,null,null,null,null,null,null,null,null,null,null,null,null,null,null,null,null,23,null,null,null,null,{"$f":"P53","v":""},{"$f":"P55","v":""},null,null,null,null,null,null,null,null,null,null,null,null,null,null,null,null,null,null,null,null,null,null,null,null,null,null,null,null,null,null,null,null,null,null,null,null,null,null,null,null,null,null,null,null,null,null,null,null,null,null,null,null,null,null,null,null,null,null,null,null,null,null,null,null,null,null,null,null,null,null,null,null,null,null,null,null,null,null,null,null,null,null,null,null,null,null,null,null,null,null,null,null,null,null,null,null,null,null,null,null,null,null,null,null,null,null,null,null,null,null,null,null,null,null,null,null,null,null,null,null,null,null,null,null,null,null,null,null,null,null,null,null,null,null,null,null,null,null,null,null,null,null,null,null,null,null,null,null,null,null,null,null,null,null,null,null,null,null,null,null,null,null,null,null,null,null,null,null,null,null,null,null,null,null,null,null,null,null,null,null,null,null,null,null,null,null,null,null,null,null,null,null,null,null,null,null,null,null,null,null,null,null,null,null,null,null,null,null,null,null,null,null,null,null,null,null,null,null,null,null,null,null,null,null,null,null,null,null,null,null,null,null,null,null,null,null,null,null,null,null,null,null,null,null,null,null,null,null,null,null,null,null,null,null,null,null,null,null,null,null,null,null,null,null,null,null,null,null,null,null,null,null,null,null,null,null,null,null,null,null,null,null,null,null,null,null,null,null,null,null,null,null,null,null,null,null,null,null,null,null,null,null,null,null,null,null,null,null,null,null,null,null,null,null,null,null,null,null,null,null,null,null,null,null,null,null,null,null,null,null,null,null,null,null,null,null,null,null,null,null,null,null,null,null,null,null,null,null,null,null,null,null,null,null,null,null,null,null,null,null,null,null,null,null,null,null,null,null,null,null,null,null,null,null,null,null,null,null,null,null,null,null,null,null,null,null,null,null,null,null,null,null,null,null,null,null,null,null,null,null,null,null,null,null,null,null,null,null,null,null,null,null,null,null,null,null,null,null,null,null,null,null,null,null,null,null,null,null,null,null,null,null,null,null,null,null,null,null,null,null,null,null,null,null,null,null,null,null,null,null,null,null,null,null,null,null,null,null,null,null,null,null,null,null,null,null,null,null,null,null,null,null,null,null,null,null,null,null,null,null,null,null,null,null,null,null,null,null,null,null,null,null,null,null,null,null,null,null,null,null,null,null,null,null,null,null,null,null,null,null,null,null,null,null,null,null,null,null,null,null,null,null,null,null,null,null,null,null,null,null,null,null,null,null,null,null,null,null,null,null,null,null,null,null,null,null,null,null,null,null,null,null,null,null,null,null,null,null,null,null,null,null,null,null,null,null,null,null,null,null,null,null,null,null,null,null,null,null,null,null,null,null,null,null,null,null,null,null,null,null,null,null,null,null,null,null,null,null,null,null,null,null,null,null,null,null,null,null,null,null,null,null,null,null,null,null,null,null,null,null,null,null,null,null,null,null,null,null,null,null,null,null,null,null,null,null,null,null,null,null,null,null,null,null,null,null,null,null,null,null,null,null,null,null,null,null,null,null,null,null,null,null,null,null,null,null,null,null,null,null,null,null,null,null,null,null,null,null,null,null,null,null,null,null,null,null,null,null,null,null,null,null,null,null,null,null,null,null,null,null,null,null,null,null,null,null,null,null,null,null,null,null,null,null,null,null,null,null,null,null,null,null,null,null,null,null,null,null,null,null,null,null,null,null,null,null,null,null,null,null,null,null,null,null,null,null,null,null,null,null,null,null,null,null,null,null,null,null,null,null,null,null,null,null,null,null,null,null,null,null,null,null,null,null,null,null,null,null,null,null,null,null,null,null,null,null,null,null,null,null,null,null,null,null,null,null,null,null,null,null,null,null,null,null,null,null,null,null,null,null,null,null,null,null,null,null,null,null,null,null,null,null,null,null,null,null,null,null,null,null,null,null,null,null,null,null,null,null,null,null,null,null,null,null,null,null,null,null,null,null,null,null,null,null,null,null,null,null,null,null,null,null,null,null,null,null,null,null,null,null,null,null,null,null,null,null,null,null,null,null,null,null,null,null,null,null,null,null,null,null,null,null,null,null,null,null,null,null,null,null,null,null,null,null,null,null,null,null,null,null,null,null,null,null,null,null,null,null,null,null,null,null,null,null,null,null,null,null,null,null,null,null,null,null,null,null,null,null,null,null,null,null,null,null,null,null,null,null,null,null,null,null,null,null,null,null,null,null,null,null,null,null,null,null,null,null,null,null,null,null,null,null,null,null,null,null,null,null,null,null,null,null,null,null,null,null,null,null,null,null,null,null,null,null,null,null,null,null,null,null,null,null,null,null,null,null,null,null,null,null,null,null,null,null,null,null,null,null,null,null,null,null,null,null,null,null,null,null,null,null,null,null,null,null,null,null,null,null,null,null,null,null,null,null,null,null,null,null,null,null,null,null,null,null,null,null,null,null,null,null,null,null,null,null,null,null,null,null,null,null,null,null,null,null,null,null,null,null,null,null,null,null,null,null,null,null,null,null,null,null,null,null,null,null,null,null,null,null,null,null,null,null,null,null,null,null,null,null,null,null,null,null,null,null,null,null,null,null,null,null,null,null,null,null,null,null,null,null,null,null,null,null,null,null,null,null,null,null,null,null,null,0]
[null,null,null,null,null,null,null,"Y1",{"$f":"IF(AND(D2=0,E2=0),\"\",IF(D2<E2,B1,B3))","v":""},null,null,null,null,null,null,null,null,{"$f":"CH21","v":0},{"$f":"CI21","v":0},"Y19",null,19,{"$f":"IF(AND(R26=0,S26=0),\"\",IF(R26>S26,P25,P27))","v":""},null,null,null,null,null,null,null,null,{"$f":"CH34","v":0},{"$f":"+CI34","v":0},"Y32",null,null,{"$f":"IF(AND(AF26=0,AG26=0),\"\",IF(AF26>AG26,AD24,AD28))","v":""},null,null,null,null,null,null,null,null,null,null,null,null,null,null,null,null,null,null,null,"Y40",{"$f":"IF(AND(BA19=0,BB19=0),\"\",IF(BA19<BB19,AY13,AY25))","v":""},null,null,null,null,null,null,"2.",null,null,null,24,null,null,null,null,{"$f":"P57","v":""},{"$f":"P59","v":""}]
[null,null,null,null,null,null,null,null,null,null,{"$f":"CH15","v":0},{"$f":"CI15","v":0},"Y13",null,13,{"$f":"IF(AND(K27=0,L27=0),\"\",IF(K27>L27,I26,I28))","v":""},null,null,null,null,null,null,null,null,null,null,null,null,26,null,null,null,null,null,null,null,null,null,null,null,null,null,37,null,null,null,null,null,null,null,null,null,null,null,null,null,null,null,null,null,null,null,null,null,null,null,null,null,25,null,null,null,null,{"$f":"W7","v":""},{"$f":"W18","v":""}]
[null,null,null,null,null,null,null,"Y2",{"$f":"IF(AND(D5=0,E5=0),\"\",IF(D5<E5,B4,B6))","v":""},null,null,null,null,null,null,null,null,null,null,null,null,null,null,null,{"$f":"CH28","v":0},{"$f":"+CI28","v":0},"Y26",null,null,{"$f":"IF(AND(Y28=0,Z28=0),\"\",IF(Y28>Z28,W26,W30))","v":""},null,null,null,null,null,null,null,null,null,null,null,null,null,null,null,null,null,null,null,null,null,null,null,null,null,null,null,null,null,null,null,null,null,null,null,null,null,null,26,null,null,null,null,{"$f":"W26","v":""},{"$f":"W30","v":""}]
[null,null,null,null,null,null,null,null,null,null,null,null,null,null,"Y11",{"$f":"IF(AND(K16=0,L16=0),\"\",IF(K16<L16,I14,I17))","v":""},null,null,null,null,null,null,null,null,null,null,null,null,null,null,null,null,null,null,null,null,null,null,null,null,null,null,null,null,null,null,null,null,null,null,null,null,null,null,null,null,null,null,null,null,null,null,null,null,null,null,null,null,27,null,null,null,null,{"$f":"W34","v":""},{"$f":"W38","v":""}]
[null,null,null,null,null,null,null,"Y3",{"$f":"IF(AND(D8=0,E8=0),\"\",IF(D8<E8,B7,B9))","v":""},null,null,null,null,null,null,null,null,{"$f":"CH22","v":0},{"$f":"CI22","v":0},"Y20",null,20,{"$f":"IF(AND(R30=0,S30=0),\"\",IF(R30>S30,P29,P31))","v":""},null,null,null,null,null,null,null,null,null,null,null,null,null,null,null,{"$f":"CH39","v":0},{"$f":"+CI39","v":0},"Y37",null,null,{"$f":"IF(AND(AM30=0,AN30=0),\"\",IF(AM30>AN30,AK26,AK34))","v":""},null,null,null,null,null,null,null,null,null,null,null,null,null,null,null,null,null,null,null,null,null,null,null,null,28,null,null,null,null,{"$f":"W44","v":""},{"$f":"W46","v":""}]
[null,null,null,null,null,null,null,null,null,null,{"$f":"CH16","v":0},{"$f":"CI16","v":0},"Y14",null,14,{"$f":"IF(AND(K31=0,L31=0),\"\",IF(K31>L31,I30,I32))","v":""},null,null,null,null,null,null,null,null,null,null,null,null,null,null,null,null,null,null,null,null,null,null,null,null,null,null,null,null,null,null,null,null,null,"Y39",{"$f":"IF(AND(AT25=0,AU25=0),\"\",IF(AT25<AU25,AR20,AR30))","v":""},null,null,null,null,null,"3.",null,null,null,null,null,null,null,null,null,null,null,29,null,null,null,null,{"$f":"W48","v":""},{"$f":"W50","v":""}]
[null,null,null,null,null,null,null,"Y4",{"$f":"IF(AND(D11=0,E11=0),\"\",IF(D11<E11,B10,B12))","v":""},null,null,null,null,null,null,null,null,null,null,null,null,null,null,null,null,null,null,null,"Y18",{"$f":"IF(AND(R19=0,S19=0),\"\",IF(R19<S19,P16,P21))","v":""},null,null,null,null,null,null,null,null,null,null,null,null,null,null,null,null,null,null,null,null,null,null,null,null,null,null,null,null,null,null,null,null,null,null,null,null,null,null,30,null,null,null,null,{"$f":"W54","v":""},{"$f":"W58","v":""}]
[null,null,null,null,null,null,null,null,null,null,null,null,null,null,"Y10",{"$f":"IF(AND(K10=0,L10=0),\"\",IF(K10<L10,I8,I11))","v":""},null,null,null,null,null,null,null,null,null,null,null,null,null,null,null,null,null,null,null,33,null,null,null,null,null,null,null,null,null,null,null,null,null,null,null,null,null,null,null,null,null,null,null,null,null,null,null,null,null,null,null,null,31,null,null,null,null,{"$f":"W60","v":""},{"$f":"W62","v":""}]
[null,null,null,null,null,null,null,"Y5",{"$f":"IF(AND(D14=0,E14=0),\"\",IF(D14<E14,B13,B15))","v":""},null,null,null,null,null,null,null,null,{"$f":"CH23","v":0},{"$f":"CI23","v":0},"Y21",null,21,{"$f":"IF(AND(R34=0,S34=0),\"\",IF(R34>S34,P33,P35))","v":""},null,null,null,null,null,null,null,null,{"$f":"CH35","v":0},{"$f":"+CI35","v":0},"Y33",null,null,{"$f":"IF(AND(AF34=0,AG34=0),\"\",IF(AF34>AG34,AD32,AD36))","v":""},null,null,null,null,null,null,null,null,null,null,null,null,null,null,null,null,null,null,null,null,null,null,null,null,null,null,null,null,null,null,null,32,null,null,null,null,{"$f":"AD24","v":""},{"$f":"AD28","v":""}]
[null,null,null,null,null,null,null,null,null,null,{"$f":"CH17","v":0},{"$f":"CI17","v":0},"Y15",null,15,{"$f":"IF(AND(K35=0,L35=0),\"\",IF(K35>L35,I34,I36))","v":""},null,null,null,null,null,null,null,null,null,null,null,null,27,null,null,null,null,null,null,null,null,null,null,null,null,null,"Y37",{"$f":"IF(AND(AM30=0,AN30=0),\"\",IF(AM30<AN30,AK26,AK34))","v":""},null,null,null,null,null,null,"4.",null,null,null,null,null,null,null,null,null,null,null,null,null,null,null,null,null,33,null,null,null,null,{"$f":"AD32","v":""},{"$f":"AD36","v":""}]
[null,null,null,null,null,null,null,"Y6",{"$f":"IF(AND(D17=0,E17=0),\"\",IF(D17<E17,B16,B18))","v":""},null,null,null,null,null,null,null,null,null,null,null,null,null,null,null,{"$f":"CH29","v":0},{"$f":"+CI29","v":0},"Y27",null,null,{"$f":"IF(AND(Y36=0,Z36=0),\"\",IF(Y36>Z36,W34,W38))","v":""},null,null,null,null,null,null,null,null,null,null,null,null,null,null,null,null,null,null,null,null,null,null,null,null,null,null,null,null,null,null,null,null,null,null,null,null,null,null,34,null,null,null,null,{"$f":"AD41","v":""},{"$f":"AD43","v":""}]
[null,null,null,null,null,null,null,null,null,null,null,null,null,null,"Y9",{"$f":"IF(AND(K4=0,L4=0),\"\",IF(K4<L4,I2,I5))","v":""},null,null,null,null,null,null,null,null,null,null,null,null,null,null,null,null,null,null,null,"Y32",{"$f":"IF(AND(AF26=0,AG26=0),\"\",IF(AF26<AG26,AD24,AD28))","v":""},null,null,null,null,null,null,null,null,null,null,null,null,null,null,null,null,null,null,null,null,null,null,null,null,null,null,null,null,null,null,null,35,null,null,null,null,{"$f":"AD45","v":""},{"$f":"AD49","v":""}]
[null,null,null,null,null,null,null,"Y7",{"$f":"IF(AND(D20=0,E20=0),\"\",IF(D20<E20,B19,B21))","v":""},null,null,null,null,null,null,null,null,{"$f":"CH24","v":0},{"$f":"CI24","v":0},"Y22",null,22,{"$f":"IF(AND(R38=0,S38=0),\"\",IF(R38>S38,P37,P39))","v":""},null,null,null,null,null,null,null,null,null,null,null,null,null,null,null,{"$f":"CH40","v":0},{"$f":"+CI40","v":0},"Y38",null,38,{"$f":"IF(AND(AM38=0,AN38=0),\"\",IF(AM38>AN38,AK37,AK39))","v":""},null,null,null,null,null,null,"5.",null,null,null,null,null,null,null,null,null,null,null,null,null,null,null,null,null,36,null,null,null,null,{"$f":"AD51","v":""},{"$f":"AD53","v":""}]
[null,null,null,null,null,null,null,null,null,null,{"$f":"CH18","v":0},{"$f":"CI18","v":0},"Y16",null,16,{"$f":"IF(AND(K39=0,L39=0),\"\",IF(K39>L39,I38,I40))","v":""},null,null,null,null,null,null,null,null,null,null,null,null,null,null,null,null,null,null,null,"Y33",{"$f":"IF(AND(AF34=0,AG34=0),\"\",IF(AF34<AG34,AD32,AD36))","v":""},null,null,null,null,null,null,null,null,null,null,null,null,null,null,null,null,null,null,null,null,null,null,null,null,null,null,null,null,null,null,null,37,null,null,null,null,{"$f":"AK26","v":""},{"$f":"AK34","v":""}]
[null,null,null,null,null,null,null,"Y8",{"$f":"IF(AND(D23=0,E23=0),\"\",IF(D23<E23,B22,B24))","v":""},null,null,null,null,null,null,null,null,null,null,null,null,null,null,null,null,null,null,null,null,null,null,null,null,null,null,null,null,null,null,null,null,null,"Y38",{"$f":"IF(AND(AM38=0,AN38=0),\"\",IF(AM38<AN38,AK37,AK39))","v":""},null,null,null,null,null,null,"6.",null,null,null,null,null,null,null,null,null,null,null,null,null,null,null,null,null,38,null,null,null,null,{"$f":"AK37","v":""},{"$f":"AK39","v":""}]
[null,null,null,null,null,null,null,null,null,null,null,null,null,null,null,null,null,null,null,null,null,null,null,null,null,null,null,null,"Y26",{"$f":"IF(AND(Y28=0,Z28=0),\"\",IF(Y28<Z28,W26,W30))","v":""},null,null,null,null,null,null,null,null,null,null,null,null,null,null,null,null,null,null,null,null,null,null,null,null,null,null,null,null,null,null,null,null,null,null,null,null,null,null,39,null,null,null,null,{"$f":"AR20","v":""},{"$f":"AR30","v":""}]
[null,null,null,null,null,null,null,null,null,null,null,null,null,null,null,null,null,null,null,null,null,null,null,null,null,null,null,null,null,null,null,{"$f":"CH36","v":0},{"$f":"+CI36","v":0},"Y34",null,34,{"$f":"IF(AND(AF42=0,AG42=0),\"\",IF(AF42>AG42,AD41,AD43))","v":""},null,null,null,null,null,null,"7.",null,null,null,null,null,null,null,null,null,null,null,null,null,null,null,null,null,null,null,null,null,null,null,null,40,null,null,null,null,{"$f":"AY13","v":""},{"$f":"AY25","v":""}]
[null,null,null,null,null,null,null,null,null,null,null,null,null,null,null,null,null,null,null,null,null,null,null,null,null,null,null,null,"Y27",{"$f":"IF(AND(Y36=0,Z36=0),\"\",IF(Y36<Z36,W34,W38))","v":""}]
[null,null,null,null,null,null,null,null,null,null,null,null,null,null,null,null,null,null,null,null,null,"Y19",{"$f":"IF(AND(R26=0,S26=0),\"\",IF(R26<S26,P25,P27))","v":""},null,null,null,null,null,null,null,null,null,null,null,null,"Y34",{"$f":"IF(AND(AF42=0,AG42=0),\"\",IF(AF42<AG42,AD41,AD43))","v":""},null,null,null,null,null,null,"8."]
[null,null,null,null,null,null,null,null,null,null,null,null,null,null,null,null,null,null,null,null,null,null,null,null,{"$f":"CH30","v":0},{"$f":"+CI30","v":0},"Y28",null,28,{"$f":"IF(AND(Y45=0,Z45=0),\"\",IF(Y45>Z45,W44,W46))","v":""}]
[null,null,null,null,null,null,null,null,null,null,null,null,null,null,null,null,null,null,null,null,null,"Y20",{"$f":"IF(AND(R30=0,S30=0),\"\",IF(R30<S30,P29,P31))","v":""},null,null,null,null,null,null,null,null,null,null,null,null,35]
[null,null,null,null,null,null,null,null,null,null,null,null,null,null,null,null,null,null,null,null,null,null,null,null,null,null,null,null,null,null,null,{"$f":"CH37","v":0},{"$f":"+CI37","v":0},"Y35",null,null,{"$f":"IF(AND(AF47=0,AG47=0),\"\",IF(AF47>AG47,AD45,AD49))","v":""},null,null,null,null,null,null,"9."]
[null,null,null,null,null,null,null,null,null,null,null,null,null,null,null,null,null,null,null,null,null,"Y21",{"$f":"IF(AND(R34=0,S34=0),\"\",IF(R34<S34,P33,P35))","v":""}]
[null,null,null,null,null,null,null,null,null,null,null,null,null,null,null,null,null,null,null,null,null,null,null,null,{"$f":"CH31","v":0},{"$f":"+CI31","v":0},"Y29",null,29,{"$f":"IF(AND(Y49=0,Z49=0),\"\",IF(Y49>Z49,W48,W50))","v":""}]
[null,null,null,null,null,null,null,null,null,null,null,null,null,null,null,null,null,null,null,null,null,"Y22",{"$f":"IF(AND(R38=0,S38=0),\"\",IF(R38<S38,P37,P39))","v":""},null,null,null,null,null,null,null,null,null,null,null,null,"Y35",{"$f":"IF(AND(AF47=0,AG47=0),\"\",IF(AF47<AG47,AD45,AD49))","v":""},null,null,null,null,null,null,"10."]
[null,null,null,null,null,null,null,null,null,null,null,null,null,null,null,null,null,null,null,null,null,null,null,null,null,null,null,null,"Y28",{"$f":"IF(AND(Y45=0,Z45=0),\"\",IF(Y45<Z45,W44,W46))","v":""}]
[null,null,null,null,null,null,null,null,null,null,null,null,null,null,null,null,null,null,null,null,null,null,null,null,null,null,null,null,null,null,null,{"$f":"CH38","v":0},{"$f":"+CI38","v":0},"Y36",null,36,{"$f":"IF(AND(AF52=0,AG52=0),\"\",IF(AF52>AG52,AD51,AD53))","v":""},null,null,null,null,null,null,"11."]
[null,null,null,null,null,null,null,null,null,null,null,null,null,null,"Y13",{"$f":"IF(AND(K27=0,L27=0),\"\",IF(K27<L27,I26,I28))","v":""},null,null,null,null,null,null,null,null,null,null,null,null,"Y29",{"$f":"IF(AND(Y49=0,Z49=0),\"\",IF(Y49<Z49,W48,W50))","v":""}]
[null,null,null,null,null,null,null,null,null,null,null,null,null,null,null,null,null,{"$f":"CH25","v":0},{"$f":"CI25","v":0},"Y23",null,23,{"$f":"IF(AND(R54=0,S54=0),\"\",IF(R54>S54,P53,P55))","v":""},null,null,null,null,null,null,null,null,null,null,null,null,"Y36",{"$f":"IF(AND(AF52=0,AG52=0),\"\",IF(AF52<AG52,AD51,AD53))","v":""},null,null,null,null,null,null,"12."]
[null,null,null,null,null,null,null,null,null,null,null,null,null,null,"Y14",{"$f":"IF(AND(K31=0,L31=0),\"\",IF(K31<L31,I30,I32))","v":""},null,null,null,null,null,null,null,null,null,null,null,null,30]
[null,null,null,null,null,null,null,null,null,null,null,null,null,null,null,null,null,null,null,null,null,null,null,null,{"$f":"CH32","v":0},{"$f":"+CI32","v":0},"Y30",null,null,{"$f":"IF(AND(Y56=0,Z56=0),\"\",IF(Y56>Z56,W54,W58))","v":""},null,null,null,null,null,null,"13."]
[null,null,null,null,null,null,null,null,null,null,null,null,null,null,"Y15",{"$f":"IF(AND(K35=0,L35=0),\"\",IF(K35<L35,I34,I36))","v":""}]
[null,null,null,null,null,null,null,null,null,null,null,null,null,null,null,null,null,{"$f":"CH26","v":0},{"$f":"CI26","v":0},"Y24",null,24,{"$f":"IF(AND(R58=0,S58=0),\"\",IF(R58>S58,P57,P59))","v":""}]
[null,null,null,null,null,null,null,null,null,null,null,null,null,null,"Y16",{"$f":"IF(AND(K39=0,L39=0),\"\",IF(K39<L39,I38,I40))","v":""},null,null,null,null,null,null,null,null,null,null,null,null,"Y30",{"$f":"IF(AND(Y56=0,Z56=0),\"\",IF(Y56<Z56,W54,W58))","v":""},null,null,null,null,null,null,"14."]
[null,null,null,null,null,null,null,null,null,null,null,null,null,null,null,null,null,null,null,null,null,"Y23",{"$f":"IF(AND(R54=0,S54=0),\"\",IF(R54<S54,P53,P55))","v":""}]
[null,null,null,null,null,null,null,null,null,null,null,null,null,null,null,null,null,null,null,null,null,null,null,null,{"$f":"CH33","v":0},{"$f":"+CI33","v":0},"Y31",null,31,{"$f":"IF(AND(Y61=0,Z61=0),\"\",IF(Y61>Z61,W60,W62))","v":""},null,null,null,null,null,null,"15."]
[null,null,null,null,null,null,null,null,null,null,null,null,null,null,null,null,null,null,null,null,null,"Y24",{"$f":"IF(AND(R58=0,S58=0),\"\",IF(R58<S58,P57,P59))","v":""}]
[null,null,null,null,null,null,null,null,null,null,null,null,null,null,null,null,null,null,null,null,null,null,null,null,null,null,null,null,"Y31",{"$f":"IF(AND(Y61=0,Z61=0),\"\",IF(Y61<Z61,W60,W62))","v":""},null,null,null,null,null,null,"16."]

{"sheet":"16(8DE)","index":8,"n_rows":41,"n_cols":105,"rows_kept":41,"cut":false,"hidden":true,"merged":[[32,15,32,21],[37,22,37,28],[39,22,39,28],[28,22,28,28],[40,29,40,35],[35,36,35,42],[38,29,38,35],[31,22,31,28],[20,1,20,7],[20,15,20,21],[21,1,21,7],[22,8,22,14],[27,36,27,42],[24,29,24,35],[26,15,26,21],[30,15,30,21],[29,29,29,35],[22,36,22,42],[23,1,23,7],[22,22,22,28],[24,15,24,21],[19,8,19,14],[12,1,12,7],[17,1,17,7],[17,22,17,28],[18,1,18,7],[18,22,18,28],[13,8,13,14],[14,1,14,7],[15,1,15,7],[15,15,15,21],[16,8,16,14],[8,1,8,7],[8,15,8,21],[9,1,9,7],[10,8,10,14],[11,1,11,7],[4,8,4,14],[5,1,5,7],[6,1,6,7],[6,22,6,28],[7,8,7,14],[3,26,4,48],[0,1,0,7],[1,8,1,14],[2,1,2,7],[3,1,3,7],[3,15,3,21],[0,26,2,48],[26,50,26,56],[32,29,32,35],[33,36,33,42],[34,29,34,35],[30,36,30,42],[28,43,28,49],[18,50,18,56],[12,43,12,49],[25,43,25,49],[25,22,25,28],[1,77,1,78],[1,67,1,68],[1,69,1,70],[1,71,1,72],[1,73,1,74],[1,75,1,76]]}
[1,{"$f":"IF(#REF!=2,'ERKEK ELEME'!#REF!,IF(#REF!=3,'ERKEK ELEME'!#REF!,IF(#REF!=4,'ERKEK ELEME'!#REF!,IF(#REF!=5,'ERKEK ELEME'!#REF!,IF(#REF!=6,'ERKEK ELEME'!#REF!)))))","v":{"$error":"#REF!"}},null,null,null,null,null,null,null,null,null,null,null,null,null,null,null,null,null,null,null,null,null,null,null,null,{"$f":"KATILIM!AC1","v":"TÜRKİYE MASA TENİSİ FEDERASYONU\nYILDIZLAR KUZEYBATI BÖLGE YARIŞMALARI"},null,null,null,null,null,null,null,null,null,null,null,null,null,null,null,null,null,null,null,null,null,null,null,null,null,null,null,null,null,null,null,null,null,null,null,null,null,null,null,null,null,null,null,null,null,null,null,null,null,null,null,null,null,null,null,null,null,null,null,null,null,null,null,null,null,null,null,null,null,null,null,null,null,null,null,null,"1st Round",1]
[null,null,null,{"$f":"BZ3","v":0},{"$f":"CA3","v":0},null,null,1,{"$f":"IF(AND(D2=0,E2=0),\"\",IF(D2>E2,B1,B3))","v":""},null,null,null,null,null,null,null,null,null,null,null,null,null,null,null,null,null,null,null,null,null,null,null,null,null,null,null,null,null,null,null,null,null,null,null,null,null,null,null,null,null,null,null,null,null,null,null,null,null,null,null,"#","Date","Time","Table","Competition","Player A","Player B","Set1",null,"Set2",null,"Set3",null,"Set4",null,"Set5",null,"Result",null,null,null,null,null,null,null,null,null,null,null,null,null,null,null,null,null,null,null,null,null,null,null,null,null,"2sn Round"]
[2,{"$f":"IF(#REF!=2,'ERKEK ELEME'!#REF!,IF(#REF!=3,'ERKEK ELEME'!#REF!,IF(#REF!=4,'ERKEK ELEME'!#REF!,IF(#REF!=5,'ERKEK ELEME'!#REF!,IF(#REF!=6,'ERKEK ELEME'!#REF!)))))","v":{"$error":"#REF!"}},null,null,null,null,null,null,null,null,null,null,null,null,9,null,null,null,null,null,null,null,null,null,null,null,null,null,null,null,null,null,null,null,null,null,null,null,null,null,null,null,null,null,null,null,null,null,null,null,null,null,null,null,null,null,null,null,null,null,1,null,null,null,null,{"$f":"B1","v":{"$error":"#REF!"}},{"$f":"B3","v":{"$error":"#REF!"}},null,null,null,null,null,null,null,null,null,null,null,null,null,null,null,null,null,null,null,null,null,null,null,null,null,null,null,null,null,null,null,null,null,null,null,null,"3th Round"]
[3,{"$f":"IF(#REF!=2,'ERKEK ELEME'!#REF!,IF(#REF!=3,'ERKEK ELEME'!#REF!,IF(#REF!=4,'ERKEK ELEME'!#REF!,IF(#REF!=5,'ERKEK ELEME'!#REF!,IF(#REF!=6,'ERKEK ELEME'!#REF!)))))","v":{"$error":"#REF!"}},null,null,null,null,null,null,null,null,{"$f":"+BZ11","v":0},{"$f":"+CA11","v":0},"Y1",null,null,{"$f":"IF(AND(K4=0,L4=0),\"\",IF(K4>L4,I2,I5))","v":""},null,null,null,null,null,null,null,null,null,null,{"$f":"KATILIM!AC2&\" \"&KATILIM!AE3","v":"ERKEK TAKIM  [01-02 Mart 2025 BALIKESİR] [ Ana Tablo ]"},null,null,null,null,null,null,null,null,null,null,null,null,null,null,null,null,null,null,null,null,null,null,null,null,null,null,null,null,null,null,null,null,null,2,null,null,null,null,{"$f":"B4","v":{"$error":"#REF!"}},{"$f":"B6","v":{"$error":"#REF!"}},null,null,null,null,null,null,null,null,null,null,null,null,null,null,null,null,null,null,null,null,null,null,null,null,null,null,null,null,null,null,null,null,null,null,null,null,"4th Round"]
[null,null,null,{"$f":"BZ4","v":0},{"$f":"CA4","v":0},null,null,2,{"$f":"IF(AND(D5=0,E5=0),\"\",IF(D5>E5,B4,B6))","v":""},null,null,null,null,null,null,null,null,null,null,null,null,13,null,null,null,null,null,null,null,null,null,null,null,null,null,null,null,null,null,null,null,null,null,null,null,null,null,null,null,null,null,null,null,null,null,null,null,null,null,null,3,null,null,null,null,{"$f":"B7","v":{"$error":"#REF!"}},{"$f":"B9","v":{"$error":"#REF!"}},null,null,null,null,null,null,null,null,null,null,null,null,null,null,null,null,null,null,null,null,null,null,null,null,null,null,null,null,null,null,null,null,null,null,null,null,"5th Round"]
[4,{"$f":"IF(#REF!=2,'ERKEK ELEME'!#REF!,IF(#REF!=3,'ERKEK ELEME'!#REF!,IF(#REF!=4,'ERKEK ELEME'!#REF!,IF(#REF!=5,'ERKEK ELEME'!#REF!,IF(#REF!=6,'ERKEK ELEME'!#REF!)))))","v":{"$error":"#REF!"}},null,null,null,null,null,null,null,null,null,null,null,null,null,null,null,null,null,null,null,null,null,null,null,null,null,null,null,null,null,null,null,null,null,null,null,null,null,null,null,null,null,null,null,null,null,null,null,null,null,null,null,null,null,null,null,null,null,null,4,null,null,null,null,{"$f":"B10","v":{"$error":"#REF!"}},{"$f":"B12","v":{"$error":"#REF!"}},null,null,null,null,null,null,null,null,null,null,null,null,null,null,null,null,null,null,null,null,null,null,null,null,null,null,null,null,null,null,null,null,null,null,null,null,"6th Round"]
[5,{"$f":"IF(#REF!=2,'ERKEK ELEME'!#REF!,IF(#REF!=3,'ERKEK ELEME'!#REF!,IF(#REF!=4,'ERKEK ELEME'!#REF!,IF(#REF!=5,'ERKEK ELEME'!#REF!,IF(#REF!=6,'ERKEK ELEME'!#REF!)))))","v":{"$error":"#REF!"}},null,null,null,null,null,null,null,null,null,null,null,null,null,null,null,{"$f":"+BZ15","v":0},{"$f":"+CA15","v":0},"Y5",null,null,{"$f":"IF(AND(R7=0,S7=0),\"\",IF(R7>S7,P4,P9))","v":""},null,null,null,null,null,null,null,null,null,null,null,null,null,null,null,null,null,null,null,null,null,null,null,null,null,null,null,null,null,null,null,null,null,null,null,null,null,5,null,null,null,null,{"$f":"B13","v":{"$error":"#REF!"}},{"$f":"B15","v":{"$error":"#REF!"}},null,null,null,null,null,null,null,null,null,null,null,null,null,null,null,null,null,null,null,null,null,null,null,null,null,null,null,null,null,null,null,null,null,null,null,null,"7th Round"]
[null,null,null,{"$f":"BZ5","v":0},{"$f":"CA5","v":0},null,null,3,{"$f":"IF(AND(D8=0,E8=0),\"\",IF(D8>E8,B7,B9))","v":""},null,null,null,null,null,null,null,null,null,null,null,null,null,null,null,null,null,null,null,17,null,null,null,null,null,null,null,null,null,null,null,null,null,null,null,null,null,null,null,null,null,null,null,null,null,null,null,null,null,null,null,6,null,null,null,null,{"$f":"B16","v":{"$error":"#REF!"}},{"$f":"B18","v":{"$error":"#REF!"}}]
[6,{"$f":"IF(#REF!=2,'ERKEK ELEME'!#REF!,IF(#REF!=3,'ERKEK ELEME'!#REF!,IF(#REF!=4,'ERKEK ELEME'!#REF!,IF(#REF!=5,'ERKEK ELEME'!#REF!,IF(#REF!=6,'ERKEK ELEME'!#REF!)))))","v":{"$error":"#REF!"}},null,null,null,null,null,null,null,null,null,null,null,null,10,{"$f":"IF(AND(K10=0,L10=0),\"\",IF(K10>L10,I8,I11))","v":""},null,null,null,null,null,null,null,null,null,null,null,null,null,null,null,null,null,null,null,null,null,null,null,null,null,null,null,null,null,null,null,null,null,null,null,null,null,null,null,null,null,null,null,null,7,null,null,null,null,{"$f":"B19","v":{"$error":"#REF!"}},{"$f":"B21","v":{"$error":"#REF!"}}]
[7,{"$f":"IF(#REF!=2,'ERKEK ELEME'!#REF!,IF(#REF!=3,'ERKEK ELEME'!#REF!,IF(#REF!=4,'ERKEK ELEME'!#REF!,IF(#REF!=5,'ERKEK ELEME'!#REF!,IF(#REF!=6,'ERKEK ELEME'!#REF!)))))","v":{"$error":"#REF!"}},null,null,null,null,null,null,null,null,{"$f":"+BZ12","v":0},{"$f":"+CA12","v":0},"Y2",null,null,null,null,null,null,null,null,null,null,null,null,null,null,null,null,null,null,null,null,null,null,null,null,null,null,null,null,null,null,null,null,null,null,null,null,null,null,null,null,null,null,null,null,null,null,null,8,null,null,null,null,{"$f":"B22","v":{"$error":"#REF!"}},{"$f":"B24","v":{"$error":"#REF!"}}]
[null,null,null,{"$f":"BZ6","v":0},{"$f":"CA6","v":0},null,null,4,{"$f":"IF(AND(D11=0,E11=0),\"\",IF(D11>E11,B10,B12))","v":""},null,null,null,null,null,null,null,null,null,null,null,null,null,null,null,null,null,null,null,null,null,null,null,null,null,null,null,null,null,null,null,null,null,null,null,null,null,null,null,null,null,null,null,null,null,null,null,null,null,null,null,9,null,null,null,null,{"$f":"I2","v":""},{"$f":"I5","v":""}]
[8,{"$f":"IF(#REF!=2,'ERKEK ELEME'!#REF!,IF(#REF!=3,'ERKEK ELEME'!#REF!,IF(#REF!=4,'ERKEK ELEME'!#REF!,IF(#REF!=5,'ERKEK ELEME'!#REF!,IF(#REF!=6,'ERKEK ELEME'!#REF!)))))","v":{"$error":"#REF!"}},null,null,null,null,null,null,null,null,null,null,null,null,null,null,null,null,null,null,null,null,null,null,null,null,null,null,null,null,null,null,null,null,null,null,null,null,null,null,null,null,null,null,null,null,null,null,null,null,null,null,null,null,null,null,null,null,null,null,10,null,null,null,null,{"$f":"I8","v":""},{"$f":"I11","v":""}]
[9,{"$f":"IF(#REF!=2,'ERKEK ELEME'!#REF!,IF(#REF!=3,'ERKEK ELEME'!#REF!,IF(#REF!=4,'ERKEK ELEME'!#REF!,IF(#REF!=5,'ERKEK ELEME'!#REF!,IF(#REF!=6,'ERKEK ELEME'!#REF!)))))","v":{"$error":"#REF!"}},null,null,null,null,null,null,null,null,null,null,null,null,null,null,null,null,null,null,null,null,null,null,{"$f":"+BZ19","v":0},{"$f":"+CA19","v":0},"Y9",null,null,null,null,null,null,null,null,null,null,null,null,null,null,null,null,{"$f":"IF(AND(Y13=0,Z13=0),\"\",IF(Y13>Z13,W7,W18))","v":""},null,null,null,null,null,null,null,null,null,null,null,null,null,null,null,null,11,null,null,null,null,{"$f":"I14","v":""},{"$f":"I17","v":""}]
[null,null,null,{"$f":"BZ7","v":0},{"$f":"CA7","v":0},null,null,5,{"$f":"IF(AND(D14=0,E14=0),\"\",IF(D14>E14,B13,B15))","v":""},null,null,null,null,null,null,null,null,null,null,null,null,null,null,null,null,null,null,null,null,null,null,null,null,null,null,null,null,null,null,null,null,null,null,null,null,null,null,null,null,24,null,null,null,null,null,null,null,null,null,null,12,null,null,null,null,{"$f":"I20","v":""},{"$f":"I23","v":""}]
[10,{"$f":"IF(#REF!=2,'ERKEK ELEME'!#REF!,IF(#REF!=3,'ERKEK ELEME'!#REF!,IF(#REF!=4,'ERKEK ELEME'!#REF!,IF(#REF!=5,'ERKEK ELEME'!#REF!,IF(#REF!=6,'ERKEK ELEME'!#REF!)))))","v":{"$error":"#REF!"}},null,null,null,null,null,null,null,null,null,null,null,null,11,null,null,null,null,null,null,null,null,null,null,null,null,null,null,null,null,null,null,null,null,null,null,null,null,null,null,null,null,null,null,null,null,null,null,null,null,null,null,null,null,null,null,null,null,null,13,null,null,null,null,{"$f":"P4","v":""},{"$f":"P9","v":""}]
[11,{"$f":"IF(#REF!=2,'ERKEK ELEME'!#REF!,IF(#REF!=3,'ERKEK ELEME'!#REF!,IF(#REF!=4,'ERKEK ELEME'!#REF!,IF(#REF!=5,'ERKEK ELEME'!#REF!,IF(#REF!=6,'ERKEK ELEME'!#REF!)))))","v":{"$error":"#REF!"}},null,null,null,null,null,null,null,null,{"$f":"+BZ13","v":0},{"$f":"+CA13","v":0},"Y3",null,null,{"$f":"IF(AND(K16=0,L16=0),\"\",IF(K16>L16,I14,I17))","v":""},null,null,null,null,null,null,null,null,null,null,null,null,null,null,null,null,null,null,null,null,null,null,null,null,null,null,null,null,null,null,null,null,null,null,null,null,null,null,null,null,null,null,null,null,14,null,null,null,null,{"$f":"P16","v":""},{"$f":"P21","v":""}]
[null,null,null,{"$f":"BZ8","v":0},{"$f":"CA8","v":0},null,null,6,{"$f":"IF(AND(D17=0,E17=0),\"\",IF(D17>E17,B16,B18))","v":""},null,null,null,null,null,null,null,null,null,null,null,null,14,null,null,null,null,null,null,null,null,null,null,null,null,null,null,null,null,null,null,null,null,null,null,null,null,null,null,null,null,null,null,null,null,null,null,null,null,null,null,15,null,null,null,null,{"$f":"P25","v":""},{"$f":"P27","v":""}]
[12,{"$f":"IF(#REF!=2,'ERKEK ELEME'!#REF!,IF(#REF!=3,'ERKEK ELEME'!#REF!,IF(#REF!=4,'ERKEK ELEME'!#REF!,IF(#REF!=5,'ERKEK ELEME'!#REF!,IF(#REF!=6,'ERKEK ELEME'!#REF!)))))","v":{"$error":"#REF!"}},null,null,null,null,null,null,null,null,null,null,null,null,null,null,null,null,null,null,null,null,{"$f":"IF(AND(R19=0,S19=0),\"\",IF(R19>S19,P16,P21))","v":""},null,null,null,null,null,null,null,null,null,null,null,null,null,null,null,null,null,null,null,null,null,null,null,null,null,null,null,null,null,null,null,null,null,null,null,null,null,16,null,null,null,null,{"$f":"P31","v":""},{"$f":"P33","v":""}]
[13,{"$f":"IF(#REF!=2,'ERKEK ELEME'!#REF!,IF(#REF!=3,'ERKEK ELEME'!#REF!,IF(#REF!=4,'ERKEK ELEME'!#REF!,IF(#REF!=5,'ERKEK ELEME'!#REF!,IF(#REF!=6,'ERKEK ELEME'!#REF!)))))","v":{"$error":"#REF!"}},null,null,null,null,null,null,null,null,null,null,null,null,null,null,null,{"$f":"+BZ16","v":0},{"$f":"+CA16","v":0},"Y6",null,null,null,null,null,null,null,null,null,null,null,null,null,null,null,null,null,null,null,null,null,null,null,null,null,{"$f":"+BZ26","v":0},{"$f":"+CA26","v":0},"Y16",null,null,{"$f":"IF(AND(AT19=0,AU19=0),\"\",IF(AT19>AU19,AR13,AR26))","v":""},null,null,null,null,null,null,"1.",null,null,17,null,null,null,null,{"$f":"W7","v":""},{"$f":"W18","v":""}]
[null,null,null,{"$f":"BZ9","v":0},{"$f":"CA9","v":0},null,null,7,{"$f":"IF(AND(D20=0,E20=0),\"\",IF(D20>E20,B19,B21))","v":""},null,null,null,null,null,null,null,null,null,null,null,null,null,null,null,null,null,null,null,null,null,null,null,null,null,null,null,null,null,null,null,null,null,null,null,null,null,null,null,null,null,null,null,null,null,null,null,null,null,null,null,18,null,null,null,null,{"$f":"W23","v":""},{"$f":"W26","v":""}]
[14,{"$f":"IF(#REF!=2,'ERKEK ELEME'!#REF!,IF(#REF!=3,'ERKEK ELEME'!#REF!,IF(#REF!=4,'ERKEK ELEME'!#REF!,IF(#REF!=5,'ERKEK ELEME'!#REF!,IF(#REF!=6,'ERKEK ELEME'!#REF!)))))","v":{"$error":"#REF!"}},null,null,null,null,null,null,null,null,null,null,null,null,12,{"$f":"IF(AND(K22=0,L22=0),\"\",IF(K22>L22,I20,I23))","v":""},null,null,null,null,null,null,null,null,null,null,null,null,null,null,null,null,null,null,null,null,null,null,null,null,null,null,null,null,null,null,null,null,null,null,null,null,null,null,null,null,null,null,null,null,19,null,null,null,null,{"$f":"W29","v":""},{"$f":"W32","v":""}]
[15,{"$f":"IF(#REF!=2,'ERKEK ELEME'!#REF!,IF(#REF!=3,'ERKEK ELEME'!#REF!,IF(#REF!=4,'ERKEK ELEME'!#REF!,IF(#REF!=5,'ERKEK ELEME'!#REF!,IF(#REF!=6,'ERKEK ELEME'!#REF!)))))","v":{"$error":"#REF!"}},null,null,null,null,null,null,null,null,{"$f":"+BZ14","v":0},{"$f":"+CA14","v":0},"Y4",null,null,null,null,null,null,null,null,null,null,null,null,null,null,null,null,null,null,null,null,null,null,null,null,null,null,null,null,null,null,null,null,null,null,null,null,null,null,null,null,null,null,null,null,null,null,null,20,null,null,null,null,{"$f":"W38","v":""},{"$f":"W40","v":""}]
[null,null,null,{"$f":"BZ10","v":0},{"$f":"CA10","v":0},null,null,8,{"$f":"IF(AND(D23=0,E23=0),\"\",IF(D23>E23,B22,B24))","v":""},null,null,null,null,null,null,null,null,null,null,null,null,"Y6",{"$f":"IF(AND(R19=0,S19=0),\"\",IF(R19<S19,P16,P21))","v":""},null,null,null,null,null,null,null,null,null,null,null,null,"Y9",{"$f":"IF(AND(Y13=0,Z13=0),\"\",IF(Y13<Z13,W7,W18))","v":""},null,null,null,null,null,null,null,null,null,null,null,null,null,null,null,null,null,null,null,null,null,null,null,21,null,null,null,null,{"$f":"AD25","v":""},{"$f":"AD30","v":""}]
[16,{"$f":"IF(#REF!=2,'ERKEK ELEME'!#REF!,IF(#REF!=3,'ERKEK ELEME'!#REF!,IF(#REF!=4,'ERKEK ELEME'!#REF!,IF(#REF!=5,'ERKEK ELEME'!#REF!,IF(#REF!=6,'ERKEK ELEME'!#REF!)))))","v":{"$error":"#REF!"}},null,null,null,null,null,null,null,null,null,null,null,null,null,null,null,null,null,null,null,null,null,null,null,null,null,null,18,null,null,null,null,null,null,null,null,null,null,null,null,null,23,null,null,null,null,null,null,null,null,null,null,null,null,null,null,null,null,null,22,null,null,null,null,{"$f":"AD33","v":""},{"$f":"AD35","v":""}]
[null,null,null,null,null,null,null,null,null,null,null,null,null,null,"Y1",{"$f":"IF(AND(K4=0,L4=0),\"\",IF(K4<L4,I2,I5))","v":""},null,null,null,null,null,null,null,null,{"$f":"+BZ20","v":0},{"$f":"+CA20","v":0},"Y10",null,null,{"$f":"IF(AND(Y25=0,Z25=0),\"\",IF(Y25>Z25,W23,W26))","v":""},null,null,null,null,null,null,null,null,null,null,null,null,null,null,null,null,null,null,null,null,null,null,null,null,null,null,null,null,null,null,23,null,null,null,null,{"$f":"AK23","v":""},{"$f":"AK28","v":""}]
[null,null,null,null,null,null,null,null,null,null,null,null,null,null,null,null,null,{"$f":"+BZ17","v":0},{"$f":"+CA17","v":0},"Y7",null,15,{"$f":"IF(AND(R26=0,S26=0),\"\",IF(R26>S26,P25,P27))","v":""},null,null,null,null,null,null,null,null,null,null,null,null,21,null,null,{"$f":"+BZ25","v":0},{"$f":"+CA25","v":0},"Y15",null,null,{"$f":"IF(AND(AM26=0,AN26=0),\"\",IF(AM26>AN26,AK23,AK28))","v":""},null,null,null,null,null,null,null,null,null,null,null,null,null,null,null,null,24,null,null,null,null,{"$f":"AR13","v":""},{"$f":"AR26","v":""}]
[null,null,null,null,null,null,null,null,null,null,null,null,null,null,"Y2",{"$f":"IF(AND(K10=0,L10=0),\"\",IF(K10<L10,I8,I11))","v":""},null,null,null,null,null,null,null,null,null,null,null,null,null,null,null,null,null,null,null,null,null,null,null,null,null,null,null,null,null,null,null,null,null,"Y16",{"$f":"IF(AND(AT19=0,AU19=0),\"\",IF(AT19<AU19,AR13,AR26))","v":""},null,null,null,null,null,null,"2."]
[null,null,null,null,null,null,null,null,null,null,null,null,null,null,null,null,null,null,null,null,null,null,null,null,null,null,null,null,null,null,null,{"$f":"+BZ23","v":0},{"$f":"+CA23","v":0},"Y13",null,null,{"$f":"IF(AND(AF28=0,AG28=0),\"\",IF(AF28>AG28,AD25,AD30))","v":""}]
[null,null,null,null,null,null,null,null,null,null,null,null,null,null,null,null,null,null,null,null,null,"Y5",{"$f":"IF(AND(R7=0,S7=0),\"\",IF(R7<S7,P4,P9))","v":""},null,null,null,null,null,null,null,null,null,null,null,null,null,null,null,null,null,null,null,"Y15",{"$f":"IF(AND(AM26=0,AN26=0),\"\",IF(AM26<AN26,AK23,AK28))","v":""},null,null,null,null,null,null,"3."]
[null,null,null,null,null,null,null,null,null,null,null,null,null,null,null,null,null,null,null,null,null,null,null,null,null,null,null,null,19,{"$f":"IF(AND(Y31=0,Z31=0),\"\",IF(Y31>Z31,W29,W32))","v":""}]
[null,null,null,null,null,null,null,null,null,null,null,null,null,null,"Y3",{"$f":"IF(AND(K16=0,L16=0),\"\",IF(K16<L16,I14,I17))","v":""},null,null,null,null,null,null,null,null,{"$f":"+BZ21","v":0},{"$f":"+CA21","v":0},"Y11",null,null,null,null,null,null,null,null,"Y13",{"$f":"IF(AND(AF28=0,AG28=0),\"\",IF(AF28<AG28,AD25,AD30))","v":""},null,null,null,null,null,null,"4."]
[null,null,null,null,null,null,null,null,null,null,null,null,null,null,null,null,null,{"$f":"+BZ18","v":0},{"$f":"+CA18","v":0},"Y8",null,16,{"$f":"IF(AND(R32=0,S32=0),\"\",IF(R32>S32,P31,P33))","v":""}]
[null,null,null,null,null,null,null,null,null,null,null,null,null,null,"Y4",{"$f":"IF(AND(K22=0,L22=0),\"\",IF(K22<L22,I20,I23))","v":""},null,null,null,null,null,null,null,null,null,null,null,null,"Y10",{"$f":"IF(AND(Y25=0,Z25=0),\"\",IF(Y25<Z25,W23,W26))","v":""}]
[null,null,null,null,null,null,null,null,null,null,null,null,null,null,null,null,null,null,null,null,null,null,null,null,null,null,null,null,null,null,null,{"$f":"+BZ24","v":0},{"$f":"+CA24","v":0},"Y14",null,22,{"$f":"IF(AND(AF34=0,AG34=0),\"\",IF(AF34>AG34,AD33,AD35))","v":""},null,null,null,null,null,null,"5."]
[null,null,null,null,null,null,null,null,null,null,null,null,null,null,null,null,null,null,null,null,null,null,null,null,null,null,null,null,"Y11",{"$f":"IF(AND(Y31=0,Z31=0),\"\",IF(Y31<Z31,W29,W32))","v":""}]
[null,null,null,null,null,null,null,null,null,null,null,null,null,null,null,null,null,null,null,null,null,null,null,null,null,null,null,null,null,null,null,null,null,null,null,"Y14",{"$f":"IF(AND(AF34=0,AG34=0),\"\",IF(AF34<AG34,AD33,AD35))","v":""},null,null,null,null,null,null,"6."]
[]
[null,null,null,null,null,null,null,null,null,null,null,null,null,null,null,null,null,null,null,null,null,"Y7",{"$f":"IF(AND(R26=0,S26=0),\"\",IF(R26<S26,P25,P27))","v":""}]
[null,null,null,null,null,null,null,null,null,null,null,null,null,null,null,null,null,null,null,null,null,null,null,null,{"$f":"+BZ22","v":0},{"$f":"+CA22","v":0},"Y12",null,20,{"$f":"IF(AND(Y39=0,Z39=0),\"\",IF(Y39>Z39,W38,W40))","v":""},null,null,null,null,null,null,"7."]
[null,null,null,null,null,null,null,null,null,null,null,null,null,null,null,null,null,null,null,null,null,"Y8",{"$f":"IF(AND(R32=0,S32=0),\"\",IF(R32<S32,P31,P33))","v":""}]
[null,null,null,null,null,null,null,null,null,null,null,null,null,null,null,null,null,null,null,null,null,null,null,null,null,null,null,null,"Y12",{"$f":"IF(AND(Y39=0,Z39=0),\"\",IF(Y39<Z39,W38,W40))","v":""},null,null,null,null,null,null,"8."]

{"sheet":"ERKEK ANA TABLO","index":9,"n_rows":41,"n_cols":37,"rows_kept":41,"cut":false,"hidden":false,"merged":[[9,8,9,14],[5,1,5,7],[6,8,6,14],[7,1,7,7],[8,1,8,7],[8,15,8,21],[10,1,10,7],[11,1,11,7],[11,22,11,28],[12,8,12,14],[13,1,13,7],[13,15,13,21],[20,1,20,7],[20,15,20,21],[21,8,21,14],[22,1,22,7],[17,29,17,35],[18,8,18,14],[14,1,14,7],[15,8,15,14],[16,1,16,7],[17,1,17,7],[19,1,19,7],[23,1,23,7],[24,8,24,14],[25,1,25,7],[25,15,25,21],[22,22,22,28],[37,22,37,28],[32,15,32,21],[26,1,26,7],[27,8,27,14],[28,1,28,7],[30,15,30,21],[23,29,23,35],[30,29,30,35],[36,29,36,35],[40,29,40,35],[0,0,2,36],[3,0,4,36],[31,22,31,28],[35,22,35,28],[27,22,27,28],[29,22,29,28],[28,29,28,35],[33,29,33,35],[38,29,38,35],[39,22,39,28],[34,15,34,21],[36,15,36,21]]}
["TÜRKİYE MASA TENİSİ FEDERASYONU\nYILDIZLAR KUZEYBATI BÖLGE YARIŞMALARI"]
[]
[]
["ERKEK TAKIM  [01-02 Mart 2025 BALIKESİR] [ Ana Tablo ]"]
[]
[1,"YALOVA BLD. SPOR (A) (YLV)"]
[null,null,null,3,0,null,null,1,"YALOVA BLD. SPOR (A) (YLV)"]
[2,"YALOVA BLD. SPOR (B) (YLV)",null,null,null,null,null,null,null,null,null,null,null,null,9]
[3,"GENÇLİKSPOR KIRKLARELİ (B) (KRL)",null,null,null,null,null,null,null,null,3,0,"Y-A",null,null,"YALOVA BLD. SPOR (A) (YLV)",null,null,null,null,null,null,null,null,null,null,null,null,null,null,null,null,null,null,null,"  "]
[null,null,null,0,3,null,null,2,"UMUDUMUZ ÖZEL SPORCULAR GSK (A) (BRT)",null,null,null,null,null,null,null,null,null,null,null,null,13]
[4,"UMUDUMUZ ÖZEL SPORCULAR GSK (A) (BRT)"]
[5,"İSTANBUL DSİ SPOR (B) (İST)",null,null,null,null,null,null,null,null,null,null,null,null,null,null,null,3,2,"Y-E",null,null,"YALOVA BLD. SPOR (A) (YLV)"]
[null,null,null,3,0,null,null,3,"İSTANBUL DSİ SPOR (B) (İST)",null,null,null,null,null,null,null,null,null,null,null,null,null,null,null,null,null,null,null,17]
[6,"BALIKESİR G.SPOR(A) (BLK)",null,null,null,null,null,null,null,null,null,null,null,null,10,"İSTANBUL BBSK (A) (İST)"]
[7,"YALOVA BLD. SPOR (C) (YLV)",null,null,null,null,null,null,null,null,0,3,"Y-B"]
[null,null,null,0,3,null,null,4,"İSTANBUL BBSK (A) (İST)"]
[8,"İSTANBUL BBSK (A) (İST)"]
[9,"YILDIZ RAKETLER SPOR (A) (İST)",null,null,null,null,null,null,null,null,null,null,null,null,null,null,null,null,null,null,null,null,null,null,1,3,"Y-I",null,null,"FENERBAHÇE (A) (İST)",null,null,null,null,null,null,"1."]
[null,null,null,3,0,null,null,5,"YILDIZ RAKETLER SPOR (A) (İST)"]
[10,"ÇERKEZKÖY BLD. GSK (A) (TKD)",null,null,null,null,null,null,null,null,null,null,null,null,11]
[11,"YILDIZ RAKETLER SPOR (B) (İST)",null,null,null,null,null,null,null,null,0,3,"Y-C",null,null,"İSTANBUL DSİ SPOR (A) (İST)"]
[null,null,null,0,3,null,null,6,"İSTANBUL DSİ SPOR (A) (İST)",null,null,null,null,null,null,null,null,null,null,null,null,14]
[12,"İSTANBUL DSİ SPOR (A) (İST)",null,null,null,null,null,null,null,null,null,null,null,null,null,null,null,null,null,null,null,null,"FENERBAHÇE (A) (İST)"]
[13,"PENDİK BLD. SPOR (A) (İST)",null,null,null,null,null,null,null,null,null,null,null,null,null,null,null,1,3,"Y-F",null,null,null,null,null,null,null,null,"I","YALOVA BLD. SPOR (A) (YLV)",null,null,null,null,null,null,"2."]
[null,null,null,1,3,null,null,7,"BEYOĞLUSPOR (A) (İST)"]
[14,"BEYOĞLUSPOR (A) (İST)",null,null,null,null,null,null,null,null,null,null,null,null,12,"FENERBAHÇE (A) (İST)"]
[15,"TRAKER SPOR (A) (KRL)",null,null,null,null,null,null,null,null,0,3,"Y-D"]
[null,null,null,0,3,null,null,8,"FENERBAHÇE (A) (İST)",null,null,null,null,null,null,null,null,null,null,null,null,"E","İSTANBUL BBSK (A) (İST)"]
[16,"FENERBAHÇE (A) (İST)",null,null,null,null,null,null,null,null,null,null,null,null,null,null,null,null,null,null,null,null,null,null,3,0,"Y-J",null,18,"İSTANBUL BBSK (A) (İST)",null,null,null,null,null,null,"3."]
[null,null,null,null,null,null,null,null,null,null,null,null,null,null,null,null,null,null,null,null,null,"F","İSTANBUL DSİ SPOR (A) (İST)"]
[null,null,null,null,null,null,null,null,null,null,null,null,null,null,"A","UMUDUMUZ ÖZEL SPORCULAR GSK (A) (BRT)",null,null,null,null,null,null,null,null,null,null,null,null,"J","İSTANBUL DSİ SPOR (A) (İST)",null,null,null,null,null,null,"4."]
[null,null,null,null,null,null,null,null,null,null,null,null,null,null,null,null,null,0,3,"Y-G",null,15,"İSTANBUL DSİ SPOR (B) (İST)"]
[null,null,null,null,null,null,null,null,null,null,null,null,null,null,"B","İSTANBUL DSİ SPOR (B) (İST)",null,null,null,null,null,null,null,null,null,null,null,null,19]
[null,null,null,null,null,null,null,null,null,null,null,null,null,null,null,null,null,null,null,null,null,null,null,null,0,3,"Y-K",null,null,"YILDIZ RAKETLER SPOR (A) (İST)",null,null,null,null,null,null,"5."]
[null,null,null,null,null,null,null,null,null,null,null,null,null,null,"C","YILDIZ RAKETLER SPOR (A) (İST)"]
[null,null,null,null,null,null,null,null,null,null,null,null,null,null,null,null,null,3,0,"Y-H",null,16,"YILDIZ RAKETLER SPOR (A) (İST)"]
[null,null,null,null,null,null,null,null,null,null,null,null,null,null,"D","BEYOĞLUSPOR (A) (İST)",null,null,null,null,null,null,null,null,null,null,null,null,"K","İSTANBUL DSİ SPOR (B) (İST)",null,null,null,null,null,null,"6."]
[null,null,null,null,null,null,null,null,null,null,null,null,null,null,null,null,null,null,null,null,null,"G","UMUDUMUZ ÖZEL SPORCULAR GSK (A) (BRT)"]
[null,null,null,null,null,null,null,null,null,null,null,null,null,null,null,null,null,null,null,null,null,null,null,null,3,0,"Y-L",null,20,"UMUDUMUZ ÖZEL SPORCULAR GSK (A) (BRT)",null,null,null,null,null,null,"7."]
[null,null,null,null,null,null,null,null,null,null,null,null,null,null,null,null,null,null,null,null,null,"H","BEYOĞLUSPOR (A) (İST)"]
[null,null,null,null,null,null,null,null,null,null,null,null,null,null,null,null,null,null,null,null,null,null,null,null,null,null,null,null,"L","BEYOĞLUSPOR (A) (İST)",null,null,null,null,null,null,"8."]

{"sheet":"8DE","index":10,"n_rows":33,"n_cols":105,"rows_kept":33,"cut":false,"hidden":true,"merged":[[32,22,32,28],[25,29,25,35],[26,22,26,28],[27,29,27,35],[29,15,29,21],[30,22,30,28],[31,15,31,21],[24,22,24,28],[17,36,17,42],[18,15,18,21],[18,43,18,49],[19,8,19,14],[19,29,19,35],[20,15,20,21],[20,36,20,41],[21,8,21,14],[21,22,21,28],[22,15,22,21],[22,29,22,35],[23,8,23,14],[15,1,15,7],[15,29,15,35],[16,1,16,7],[16,15,16,21],[17,8,17,14],[17,22,17,28],[14,43,14,49],[7,1,7,7],[7,15,7,21],[8,8,8,14],[9,1,9,7],[10,1,10,7],[10,36,10,42],[11,8,11,14],[12,1,12,7],[12,15,12,21],[13,1,13,7],[14,8,14,14],[6,1,6,7],[0,0,1,50],[4,1,4,7],[5,8,5,14],[2,0,3,50],[1,71,1,72],[1,61,1,62],[1,63,1,64],[1,65,1,66],[1,67,1,68],[1,69,1,70]]}
[{"$f":"KATILIM!AC1","v":"TÜRKİYE MASA TENİSİ FEDERASYONU\nYILDIZLAR KUZEYBATI BÖLGE YARIŞMALARI"},null,null,null,null,null,null,null,null,null,null,null,null,null,null,null,null,null,null,null,null,null,null,null,null,null,null,null,null,null,null,null,null,null,null,null,null,null,null,null,null,null,null,null,null,null,null,null,null,null,null,null,null,null,null,null,null,null,null,null,null,null,null,null,null,null,null,null,null,null,null,null,null,null,null,null,null,null,null,null,null,null,null,null,null,null,null,null,null,null,null,null,null,null,null,null,null,null,null,null,null,null,null,"1st Round",1]
[null,null,null,null,null,null,null,null,null,null,null,null,null,null,null,null,null,null,null,null,null,null,null,null,null,null,null,null,null,null,null,null,null,null,null,null,null,null,null,null,null,null,null,null,null,null,null,null,null,null,null,null,null,null,"#","Date","Time","Table","Competition","Player A","Player B","Set1",null,"Set2",null,"Set3",null,"Set4",null,"Set5",null,"Result",null,null,null,null,null,null,null,null,null,null,null,null,null,null,null,null,null,null,null,null,null,null,null,null,null,null,null,null,null,null,null,"2sn Round"]
[{"$f":"KATILIM!AC2&\" \"&KATILIM!AE3","v":"ERKEK TAKIM  [01-02 Mart 2025 BALIKESİR] [ Ana Tablo ]"},null,null,null,null,null,null,null,null,null,null,null,null,null,null,null,null,null,null,null,null,null,null,null,null,null,null,null,null,null,null,null,null,null,null,null,null,null,null,null,null,null,null,null,null,null,null,null,null,null,null,null,null,null,1,null,null,null,null,{"$f":"+B5","v":{"$error":"#REF!"}},{"$f":"+B7","v":{"$error":"#REF!"}},null,null,null,null,null,null,null,null,null,null,3,null,null,null,null,null,null,null,null,null,null,null,null,null,null,null,null,null,null,null,null,null,null,null,null,null,null,null,null,null,null,null,"3th Round"]
[null,null,null,null,null,null,null,null,null,null,null,null,null,null,null,null,null,null,null,null,null,null,null,null,null,null,null,null,null,null,null,null,null,null,null,null,null,null,null,null,null,null,null,null,null,null,null,null,null,null,null,null,null,null,2,null,null,null,null,{"$f":"+B8","v":{"$error":"#REF!"}},{"$f":"+B10","v":{"$error":"#REF!"}},null,null,null,null,null,null,null,null,null,null,3,null,null,null,null,null,null,null,null,null,null,null,null,null,null,null,null,null,null,null,null,null,null,null,null,null,null,null,null,null,null,null,"4th Round"]
[1,{"$f":"IF(#REF!=2,'ERKEK ELEME'!#REF!,IF(#REF!=3,'ERKEK ELEME'!#REF!,IF(#REF!=4,'ERKEK ELEME'!#REF!,IF(#REF!=5,'ERKEK ELEME'!#REF!,IF(#REF!=6,'ERKEK ELEME'!#REF!,IF(#REF!=7,'ERKEK ELEME'!F758))))))","v":{"$error":"#REF!"}},null,null,null,null,null,null,null,null,null,null,null,null,null,null,null,null,null,null,null,null,null,null,null,null,null,null,null,null,null,null,null,null,null,null,null,null,null,null,null,null,null,null,null,null,null,null,null,null,null,null,null,null,3,null,null,null,null,{"$f":"+B11","v":{"$error":"#REF!"}},{"$f":"+B13","v":{"$error":"#REF!"}},null,null,null,null,null,null,null,null,null,null,3,null,null,null,null,null,null,null,null,null,null,null,null,null,null,null,null,null,null,null,null,null,null,null,null,null,null,null,null,null,null,null,"5th Round"]
[null,null,null,{"$f":"+BT3","v":3},{"$f":"+BU3","v":0},"Y1",null,1,{"$f":"IF(AND(D6=0,E6=0),\"\",IF(D6>E6,B5,B7))","v":{"$error":"#REF!"}},null,null,null,null,null,null,null,null,null,null,null,null,null,null,null,null,null,null,null,null,null,null,null,null,null,null,null,null,null,null,null,null,null,null,null,null,null,null,null,null,null,null,null,null,null,4,null,null,null,null,{"$f":"+B14","v":{"$error":"#REF!"}},{"$f":"+B16","v":{"$error":"#REF!"}},null,null,null,null,null,null,null,null,null,null,3,null,null,null,null,null,null,null,null,null,null,null,null,null,null,null,null,null,null,null,null,null,null,null,null,null,null,null,null,null,null,null,"6th Round"]
[2,{"$f":"IF(#REF!=2,'ERKEK ELEME'!#REF!,IF(#REF!=3,'ERKEK ELEME'!#REF!,IF(#REF!=4,'ERKEK ELEME'!#REF!,IF(#REF!=5,'ERKEK ELEME'!#REF!,IF(#REF!=6,'ERKEK ELEME'!#REF!,IF(#REF!=7,'ERKEK ELEME'!F760))))))","v":{"$error":"#REF!"}},null,null,null,null,null,null,null,null,null,null,null,null,5,null,null,null,null,null,null,null,null,null,null,null,null,null,null,null,null,null,null,null,null,null,null,null,null,null,null,null,null,null,null,null,null,null,null,null,null,null,null,null,5,null,null,null,null,{"$f":"+I6","v":{"$error":"#REF!"}},{"$f":"+I9","v":{"$error":"#REF!"}},null,null,null,null,null,null,null,null,null,null,3]
[3,{"$f":"IF(#REF!=2,'ERKEK ELEME'!#REF!,IF(#REF!=3,'ERKEK ELEME'!#REF!,IF(#REF!=4,'ERKEK ELEME'!#REF!,IF(#REF!=5,'ERKEK ELEME'!#REF!,IF(#REF!=6,'ERKEK ELEME'!#REF!,IF(#REF!=7,'ERKEK ELEME'!F761))))))","v":{"$error":"#REF!"}},null,null,null,null,null,null,null,null,{"$f":"+BT7","v":3},{"$f":"+BU7","v":0},"Y5",null,null,{"$f":"IF(AND(K8=0,L8=0),\"\",IF(K8>L8,I6,I9))","v":{"$error":"#REF!"}},null,null,null,null,null,null,null,null,null,null,null,null,null,null,null,null,null,null,null,null,null,null,null,null,null,null,null,null,null,null,null,null,null,null,null,null,null,null,6,null,null,null,null,{"$f":"+I12","v":{"$error":"#REF!"}},{"$f":"+I15","v":{"$error":"#REF!"}},null,null,null,null,null,null,null,null,null,null,3]
[null,null,null,{"$f":"+BT4","v":3},{"$f":"+BU4","v":0},"Y2",null,2,{"$f":"IF(AND(D9=0,E9=0),\"\",IF(D9>E9,B8,B10))","v":{"$error":"#REF!"}},null,null,null,null,null,null,null,null,null,null,null,null,9,null,null,null,null,null,null,null,null,null,null,null,null,null,null,null,null,null,null,null,null,null,null,null,null,null,null,null,null,null,null,null,null,7,null,null,null,null,{"$f":"+I18","v":{"$error":"#REF!"}},{"$f":"+I20","v":{"$error":"#REF!"}},null,null,null,null,null,null,null,null,null,null,3]
[4,{"$f":"IF(#REF!=2,'ERKEK ELEME'!#REF!,IF(#REF!=3,'ERKEK ELEME'!#REF!,IF(#REF!=4,'ERKEK ELEME'!#REF!,IF(#REF!=5,'ERKEK ELEME'!#REF!,IF(#REF!=6,'ERKEK ELEME'!#REF!,IF(#REF!=7,'ERKEK ELEME'!F763))))))","v":{"$error":"#REF!"}},null,null,null,null,null,null,null,null,null,null,null,null,null,null,null,null,null,null,null,null,null,null,null,null,null,null,null,null,null,null,null,null,null,null,null,null,null,null,null,null,null,null,null,null,null,null,null,null,null,null,null,null,8,null,null,null,null,{"$f":"+I22","v":{"$error":"#REF!"}},{"$f":"+I24","v":{"$error":"#REF!"}},null,null,null,null,null,null,null,null,null,null,3]
[5,{"$f":"IF(#REF!=2,'ERKEK ELEME'!#REF!,IF(#REF!=3,'ERKEK ELEME'!#REF!,IF(#REF!=4,'ERKEK ELEME'!#REF!,IF(#REF!=5,'ERKEK ELEME'!#REF!,IF(#REF!=6,'ERKEK ELEME'!#REF!,IF(#REF!=7,'ERKEK ELEME'!F764))))))","v":{"$error":"#REF!"}},null,null,null,null,null,null,null,null,null,null,null,null,null,null,null,{"$f":"+BT11","v":3},{"$f":"+BU11","v":0},"Y9",null,null,null,null,null,null,null,null,null,null,null,null,null,null,null,null,{"$f":"IF(AND(R11=0,S11=0),\"\",IF(R11>S11,P8,P13))","v":{"$error":"#REF!"}},null,null,null,null,null,null,null,null,null,null,null,null,null,null,null,null,null,9,null,null,null,null,{"$f":"+P8","v":{"$error":"#REF!"}},{"$f":"+P13","v":{"$error":"#REF!"}},null,null,null,null,null,null,null,null,null,null,3]
[null,null,null,{"$f":"+BT5","v":3},{"$f":"+BU5","v":0},"Y3",null,3,{"$f":"IF(AND(D12=0,E12=0),\"\",IF(D12>E12,B11,B13))","v":{"$error":"#REF!"}},null,null,null,null,null,null,null,null,null,null,null,null,null,null,null,null,null,null,null,null,null,null,null,null,null,null,null,null,null,null,null,null,null,16,null,null,null,null,null,null,null,null,null,null,null,10,null,null,null,null,{"$f":"+P17","v":{"$error":"#REF!"}},{"$f":"+P19","v":{"$error":"#REF!"}},null,null,null,null,null,null,null,null,null,null,3]
[6,{"$f":"IF(#REF!=2,'ERKEK ELEME'!#REF!,IF(#REF!=3,'ERKEK ELEME'!#REF!,IF(#REF!=4,'ERKEK ELEME'!#REF!,IF(#REF!=5,'ERKEK ELEME'!#REF!,IF(#REF!=6,'ERKEK ELEME'!#REF!,IF(#REF!=7,'ERKEK ELEME'!F766))))))","v":{"$error":"#REF!"}},null,null,null,null,null,null,null,null,null,null,null,null,6,{"$f":"IF(AND(K14=0,L14=0),\"\",IF(K14>L14,I12,I15))","v":{"$error":"#REF!"}},null,null,null,null,null,null,null,null,null,null,null,null,null,null,null,null,null,null,null,null,null,null,null,null,null,null,null,null,null,null,null,null,null,null,null,null,null,null,11,null,null,null,null,{"$f":"+P21","v":{"$error":"#REF!"}},{"$f":"+P23","v":{"$error":"#REF!"}},null,null,null,null,null,null,null,null,null,null,3]
[7,{"$f":"IF(#REF!=2,'ERKEK ELEME'!#REF!,IF(#REF!=3,'ERKEK ELEME'!#REF!,IF(#REF!=4,'ERKEK ELEME'!#REF!,IF(#REF!=5,'ERKEK ELEME'!#REF!,IF(#REF!=6,'ERKEK ELEME'!#REF!,IF(#REF!=7,'ERKEK ELEME'!F767))))))","v":{"$error":"#REF!"}},null,null,null,null,null,null,null,null,{"$f":"+BT8","v":3},{"$f":"+BU8","v":0},"Y6",null,null,null,null,null,null,null,null,null,null,null,null,null,null,null,null,null,null,null,null,null,null,null,null,null,null,null,null,null,null,null,null,null,null,null,null,null,null,null,null,null,12,null,null,null,null,{"$f":"+P30","v":{"$error":"#REF!"}},{"$f":"+P32","v":{"$error":"#REF!"}},null,null,null,null,null,null,null,null,null,null,3]
[null,null,null,{"$f":"+BT6","v":3},{"$f":"+BU6","v":0},"Y4",null,4,{"$f":"IF(AND(D15=0,E15=0),\"\",IF(D15>E15,B14,B16))","v":{"$error":"#REF!"}},null,null,null,null,null,null,null,null,null,null,null,null,null,null,null,null,null,null,null,null,null,null,null,null,null,null,null,null,null,{"$f":"+BT18","v":3},{"$f":"+BU18","v":0},"Y16",null,null,{"$f":"IF(AND(AM15=0,AN15=0),\"\",IF(AM15>AN15,AK11,AK18))","v":{"$error":"#REF!"}},null,null,null,null,null,null,"1.",null,null,null,13,null,null,null,null,{"$f":"+W18","v":{"$error":"#REF!"}},{"$f":"+W22","v":{"$error":"#REF!"}},null,null,null,null,null,null,null,null,null,null,3]
[8,{"$f":"IF(#REF!=2,'ERKEK ELEME'!#REF!,IF(#REF!=3,'ERKEK ELEME'!#REF!,IF(#REF!=4,'ERKEK ELEME'!#REF!,IF(#REF!=5,'ERKEK ELEME'!#REF!,IF(#REF!=6,'ERKEK ELEME'!#REF!,IF(#REF!=7,'ERKEK ELEME'!F769))))))","v":{"$error":"#REF!"}},null,null,null,null,null,null,null,null,null,null,null,null,null,null,null,null,null,null,null,null,null,null,null,null,null,null,"Y9",{"$f":"IF(AND(R11=0,S11=0),\"\",IF(R11<S11,P8,P13))","v":{"$error":"#REF!"}},null,null,null,null,null,null,null,null,null,null,null,null,null,null,null,null,null,null,null,null,null,null,null,null,14,null,null,null,null,{"$f":"+W25","v":{"$error":"#REF!"}},{"$f":"+W27","v":{"$error":"#REF!"}},null,null,null,null,null,null,null,null,null,null,3]
[null,null,null,null,null,null,null,null,null,null,null,null,null,null,"Y6",{"$f":"IF(AND(K14=0,L14=0),\"\",IF(K14<L14,I12,I15))","v":{"$error":"#REF!"}},null,null,null,null,null,null,null,null,null,null,null,null,null,null,null,null,null,null,null,15,null,null,null,null,null,null,null,null,null,null,null,null,null,null,null,null,null,null,15,null,null,null,null,{"$f":"+AD16","v":{"$error":"#REF!"}},{"$f":"+AD20","v":{"$error":"#REF!"}},null,null,null,null,null,null,null,null,null,null,3]
[null,null,null,null,null,null,null,"Y1",{"$f":"IF(AND(D6=0,E6=0),\"\",IF(D6<E6,B5,B7))","v":{"$error":"#REF!"}},null,null,null,null,null,null,null,null,{"$f":"+BT12","v":3},{"$f":"+BU12","v":0},"Y10",null,10,{"$f":"IF(AND(R18=0,S18=0),\"\",IF(R18>S18,P17,P19))","v":{"$error":"#REF!"}},null,null,null,null,null,null,null,null,{"$f":"+BT17","v":3},{"$f":"+BU17","v":0},"Y15",null,null,{"$f":"IF(AND(AF18=0,AG18=0),\"\",IF(AF18>AG18,AD16,AD20))","v":{"$error":"#REF!"}},null,null,null,null,null,null,null,null,null,null,null,null,null,null,null,null,null,16,null,null,null,null,{"$f":"+AK11","v":{"$error":"#REF!"}},{"$f":"+AK18","v":{"$error":"#REF!"}},null,null,null,null,null,null,null,null,null,null,3]
[null,null,null,null,null,null,null,null,null,null,{"$f":"+BT9","v":3},{"$f":"+BU9","v":0},"Y7",null,7,{"$f":"IF(AND(K19=0,L19=0),\"\",IF(K19>L19,I18,I20))","v":{"$error":"#REF!"}},null,null,null,null,null,null,null,null,null,null,null,null,13,null,null,null,null,null,null,null,null,null,null,null,null,null,"Y16",{"$f":"IF(AND(AM15=0,AN15=0),\"\",IF(AM15<AN15,AK11,AK18))","v":{"$error":"#REF!"}},null,null,null,null,null,null,"2."]
[null,null,null,null,null,null,null,"Y2",{"$f":"IF(AND(D9=0,E9=0),\"\",IF(D9<E9,B8,B10))","v":{"$error":"#REF!"}},null,null,null,null,null,null,null,null,null,null,null,null,null,null,null,{"$f":"+BT15","v":3},{"$f":"+BU15","v":0},"Y13",null,null,{"$f":"IF(AND(Y20=0,Z20=0),\"\",IF(Y20>Z20,W18,W22))","v":{"$error":"#REF!"}}]
[null,null,null,null,null,null,null,null,null,null,null,null,null,null,"Y5",{"$f":"IF(AND(K8=0,L8=0),\"\",IF(K8<L8,I6,I9))","v":{"$error":"#REF!"}},null,null,null,null,null,null,null,null,null,null,null,null,null,null,null,null,null,null,null,"Y15",{"$f":"IF(AND(AF18=0,AG18=0),\"\",IF(AF18<AG18,AD16,AD20))","v":{"$error":"#REF!"}},null,null,null,null,null,"3."]
[null,null,null,null,null,null,null,"Y3",{"$f":"IF(AND(D12=0,E12=0),\"\",IF(D12<E12,B11,B13))","v":{"$error":"#REF!"}},null,null,null,null,null,null,null,null,{"$f":"+BT13","v":3},{"$f":"+BU13","v":0},"Y11",null,11,{"$f":"IF(AND(R22=0,S22=0),\"\",IF(R22>S22,P21,P23))","v":{"$error":"#REF!"}}]
[null,null,null,null,null,null,null,null,null,null,{"$f":"+BT10","v":3},{"$f":"+BU10","v":0},"Y8",null,8,{"$f":"IF(AND(K23=0,L23=0),\"\",IF(K23>L23,I22,I24))","v":{"$error":"#REF!"}},null,null,null,null,null,null,null,null,null,null,null,null,"Y13",{"$f":"IF(AND(Y20=0,Z20=0),\"\",IF(Y20<Z20,W18,W22))","v":{"$error":"#REF!"}},null,null,null,null,null,null,"4."]
[null,null,null,null,null,null,null,"Y4",{"$f":"IF(AND(D15=0,E15=0),\"\",IF(D15<E15,B14,B16))","v":{"$error":"#REF!"}}]
[null,null,null,null,null,null,null,null,null,null,null,null,null,null,null,null,null,null,null,null,null,"Y10",{"$f":"IF(AND(R18=0,S18=0),\"\",IF(R18<S18,P17,P19))","v":{"$error":"#REF!"}}]
[null,null,null,null,null,null,null,null,null,null,null,null,null,null,null,null,null,null,null,null,null,null,null,null,{"$f":"+BT16","v":3},{"$f":"+BU16","v":0},"Y14",null,14,{"$f":"IF(AND(Y26=0,Z26=0),\"\",IF(Y26>Z26,W25,W27))","v":{"$error":"#REF!"}},null,null,null,null,null,null,"5."]
[null,null,null,null,null,null,null,null,null,null,null,null,null,null,null,null,null,null,null,null,null,"Y11",{"$f":"IF(AND(R22=0,S22=0),\"\",IF(R22<S22,P21,P23))","v":{"$error":"#REF!"}}]
[null,null,null,null,null,null,null,null,null,null,null,null,null,null,null,null,null,null,null,null,null,null,null,null,null,null,null,null,"Y14",{"$f":"IF(AND(Y26=0,Z26=0),\"\",IF(Y26<Z26,W25,W27))","v":{"$error":"#REF!"}},null,null,null,null,null,null,"6."]
[]
[null,null,null,null,null,null,null,null,null,null,null,null,null,null,"Y7",{"$f":"IF(AND(K19=0,L19=0),\"\",IF(K19<L19,I18,I20))","v":{"$error":"#REF!"}}]
[null,null,null,null,null,null,null,null,null,null,null,null,null,null,null,null,null,{"$f":"+BT14","v":3},{"$f":"+BU14","v":0},"Y12",null,12,{"$f":"IF(AND(R31=0,S31=0),\"\",IF(R31>S31,P30,P32))","v":{"$error":"#REF!"}},null,null,null,null,null,null,"7."]
[null,null,null,null,null,null,null,null,null,null,null,null,null,null,"Y8",{"$f":"IF(AND(K23=0,L23=0),\"\",IF(K23<L23,I22,I24))","v":{"$error":"#REF!"}}]
[null,null,null,null,null,null,null,null,null,null,null,null,null,null,null,null,null,null,null,null,null,"Y12",{"$f":"IF(AND(R31=0,S31=0),\"\",IF(R31<S31,P30,P32))","v":{"$error":"#REF!"}},null,null,null,null,null,null,"8."]

{"sheet":"8TE","index":11,"n_rows":34,"n_cols":105,"rows_kept":34,"cut":false,"hidden":true,"merged":[[29,15,29,21],[30,22,30,28],[33,22,33,28],[24,22,24,28],[27,22,27,28],[31,15,31,21],[24,8,24,14],[25,15,25,21],[26,8,26,14],[21,8,21,14],[22,15,22,21],[23,8,23,14],[12,1,12,7],[12,15,12,21],[1,71,1,72],[4,1,4,7],[5,8,5,14],[6,1,6,7],[7,1,7,7],[7,15,7,21],[1,61,1,62],[1,63,1,64],[1,65,1,66],[1,67,1,68],[1,69,1,70],[14,22,14,28],[20,22,20,28],[0,0,1,29],[2,0,3,29],[17,22,17,28],[18,15,18,21],[13,1,13,7],[14,8,14,14],[15,1,15,7],[16,1,16,7],[16,15,16,21],[8,8,8,14],[9,1,9,7],[10,1,10,7],[10,22,10,28],[11,8,11,14]]}
[{"$f":"KATILIM!AC1","v":"TÜRKİYE MASA TENİSİ FEDERASYONU\nYILDIZLAR KUZEYBATI BÖLGE YARIŞMALARI"},null,null,null,null,null,null,null,null,null,null,null,null,null,null,null,null,null,null,null,null,null,null,null,null,null,null,null,null,null,null,null,null,null,null,null,null,null,null,null,null,null,null,null,null,null,null,null,null,null,null,null,null,null,null,null,null,null,null,null,null,null,null,null,null,null,null,null,null,null,null,null,null,null,null,null,null,null,null,null,null,null,null,null,null,null,null,null,null,null,null,null,null,null,null,null,null,null,null,null,null,null,null,"1st Round",1]
[null,null,null,null,null,null,null,null,null,null,null,null,null,null,null,null,null,null,null,null,null,null,null,null,null,null,null,null,null,null,null,null,null,null,null,null,null,null,null,null,null,null,null,null,null,null,null,null,null,null,null,null,null,null,"#","Date","Time","Table","Competition","Player A","Player B","Set1",null,"Set2",null,"Set3",null,"Set4",null,"Set5",null,"Result",null,null,null,null,null,null,null,null,null,null,null,null,null,null,null,null,null,null,null,null,null,null,null,null,null,null,null,null,null,null,null,"2sn Round"]
[{"$f":"KATILIM!AC2&\" \"&KATILIM!AE3","v":"ERKEK TAKIM  [01-02 Mart 2025 BALIKESİR] [ Ana Tablo ]"},null,null,null,null,null,null,null,null,null,null,null,null,null,null,null,null,null,null,null,null,null,null,null,null,null,null,null,null,null,null,null,null,null,null,null,null,null,null,null,null,null,null,null,null,null,null,null,null,null,null,null,null,null,1,null,null,null,null,{"$f":"+B5","v":{"$error":"#REF!"}},{"$f":"+B7","v":{"$error":"#REF!"}},null,null,null,null,null,null,null,null,null,null,null,null,null,null,null,null,null,null,null,null,null,null,null,null,null,null,null,null,null,null,null,null,null,null,null,null,null,null,null,null,null,null,"3th Round"]
[null,null,null,null,null,null,null,null,null,null,null,null,null,null,null,null,null,null,null,null,null,null,null,null,null,null,null,null,null,null,null,null,null,null,null,null,null,null,null,null,null,null,null,null,null,null,null,null,null,null,null,null,null,null,2,null,null,null,null,{"$f":"+B8","v":{"$error":"#REF!"}},{"$f":"+B10","v":{"$error":"#REF!"}}]
[1,{"$f":"IF(#REF!=2,'ERKEK ELEME'!#REF!,IF(#REF!=3,'ERKEK ELEME'!#REF!,IF(#REF!=4,'ERKEK ELEME'!#REF!,IF(#REF!=5,'ERKEK ELEME'!#REF!,IF(#REF!=6,'ERKEK ELEME'!#REF!,IF(#REF!=7,'ERKEK ELEME'!F758))))))","v":{"$error":"#REF!"}},null,null,null,null,null,null,null,null,null,null,null,null,null,null,null,null,null,null,null,null,null,null,null,null,null,null,null,null,null,null,null,null,null,null,null,null,null,null,null,null,null,null,null,null,null,null,null,null,null,null,null,null,3,null,null,null,null,{"$f":"+B11","v":{"$error":"#REF!"}},{"$f":"+B13","v":{"$error":"#REF!"}}]
[null,null,null,{"$f":"+BT3","v":0},{"$f":"+BU3","v":0},"Y-A",null,1,{"$f":"IF(AND(D6=0,E6=0),\"\",IF(D6>E6,B5,B7))","v":""},null,null,null,null,null,null,null,null,null,null,null,null,null,null,null,null,null,null,null,null,null,null,null,null,null,null,null,null,null,null,null,null,null,null,null,null,null,null,null,null,null,null,null,null,null,4,null,null,null,null,{"$f":"+B14","v":{"$error":"#REF!"}},{"$f":"+B16","v":{"$error":"#REF!"}}]
[2,{"$f":"IF(#REF!=2,'ERKEK ELEME'!#REF!,IF(#REF!=3,'ERKEK ELEME'!#REF!,IF(#REF!=4,'ERKEK ELEME'!#REF!,IF(#REF!=5,'ERKEK ELEME'!#REF!,IF(#REF!=6,'ERKEK ELEME'!#REF!,IF(#REF!=7,'ERKEK ELEME'!F760))))))","v":{"$error":"#REF!"}},null,null,null,null,null,null,null,null,null,null,null,null,5,null,null,null,null,null,null,null,null,null,null,null,null,null,null,null,null,null,null,null,null,null,null,null,null,null,null,null,null,null,null,null,null,null,null,null,null,null,null,null,5,null,null,null,null,{"$f":"+I6","v":""},{"$f":"+I9","v":""}]
[3,{"$f":"IF(#REF!=2,'ERKEK ELEME'!#REF!,IF(#REF!=3,'ERKEK ELEME'!#REF!,IF(#REF!=4,'ERKEK ELEME'!#REF!,IF(#REF!=5,'ERKEK ELEME'!#REF!,IF(#REF!=6,'ERKEK ELEME'!#REF!,IF(#REF!=7,'ERKEK ELEME'!F761))))))","v":{"$error":"#REF!"}},null,null,null,null,null,null,null,null,{"$f":"+BT7","v":0},{"$f":"+BU7","v":0},"Y-E",null,null,{"$f":"IF(AND(K8=0,L8=0),\"\",IF(K8>L8,I6,I9))","v":""},null,null,null,null,null,null,null,null,null,null,null,null,null,null,null,null,null,null,null,null,null,null,null,null,null,null,null,null,null,null,null,null,null,null,null,null,null,null,6,null,null,null,null,{"$f":"+I12","v":""},{"$f":"+I15","v":""}]
[null,null,null,{"$f":"+BT4","v":0},{"$f":"+BU4","v":0},"Y-B",null,2,{"$f":"IF(AND(D9=0,E9=0),\"\",IF(D9>E9,B8,B10))","v":""},null,null,null,null,null,null,null,null,null,null,null,null,9,null,null,null,null,null,null,null,null,null,null,null,null,null,null,null,null,null,null,null,null,null,null,null,null,null,null,null,null,null,null,null,null,7,null,null,null,null,{"$f":"+I22","v":""},{"$f":"+I24","v":""}]
[4,{"$f":"IF(#REF!=2,'ERKEK ELEME'!#REF!,IF(#REF!=3,'ERKEK ELEME'!#REF!,IF(#REF!=4,'ERKEK ELEME'!#REF!,IF(#REF!=5,'ERKEK ELEME'!#REF!,IF(#REF!=6,'ERKEK ELEME'!#REF!,IF(#REF!=7,'ERKEK ELEME'!F763))))))","v":{"$error":"#REF!"}},null,null,null,null,null,null,null,null,null,null,null,null,null,null,null,null,null,null,null,null,null,null,null,null,null,null,null,null,null,null,null,null,null,null,null,null,null,null,null,null,null,null,null,null,null,null,null,null,null,null,null,null,8,null,null,null,null,{"$f":"+I25","v":""},{"$f":"+I27","v":""}]
[5,{"$f":"IF(#REF!=2,'ERKEK ELEME'!#REF!,IF(#REF!=3,'ERKEK ELEME'!#REF!,IF(#REF!=4,'ERKEK ELEME'!#REF!,IF(#REF!=5,'ERKEK ELEME'!#REF!,IF(#REF!=6,'ERKEK ELEME'!#REF!,IF(#REF!=7,'ERKEK ELEME'!F764))))))","v":{"$error":"#REF!"}},null,null,null,null,null,null,null,null,null,null,null,null,null,null,null,{"$f":"+BT11","v":0},{"$f":"+BU11","v":0},"Y-I",null,null,{"$f":"IF(AND(R11=0,S11=0),\"\",IF(R11>S11,P8,P13))","v":""},null,null,null,null,null,null,"1.",null,null,null,null,null,null,null,null,null,null,null,null,null,null,null,null,null,null,null,null,null,null,null,null,9,null,null,null,null,{"$f":"+P8","v":""},{"$f":"+P13","v":""}]
[null,null,null,{"$f":"+BT5","v":0},{"$f":"+BU5","v":0},"Y-C",null,3,{"$f":"IF(AND(D12=0,E12=0),\"\",IF(D12>E12,B11,B13))","v":""},null,null,null,null,null,null,null,null,null,null,null,null,null,null,null,null,null,null,null,null,null,null,null,null,null,null,null,null,null,null,null,null,null,null,null,null,null,null,null,null,null,null,null,null,null,10,null,null,null,null,{"$f":"+P17","v":""},{"$f":"+P19","v":""}]
[6,{"$f":"IF(#REF!=2,'ERKEK ELEME'!#REF!,IF(#REF!=3,'ERKEK ELEME'!#REF!,IF(#REF!=4,'ERKEK ELEME'!#REF!,IF(#REF!=5,'ERKEK ELEME'!#REF!,IF(#REF!=6,'ERKEK ELEME'!#REF!,IF(#REF!=7,'ERKEK ELEME'!F766))))))","v":{"$error":"#REF!"}},null,null,null,null,null,null,null,null,null,null,null,null,6,{"$f":"IF(AND(K14=0,L14=0),\"\",IF(K14>L14,I12,I15))","v":""},null,null,null,null,null,null,null,null,null,null,null,null,null,null,null,null,null,null,null,null,null,null,null,null,null,null,null,null,null,null,null,null,null,null,null,null,null,null,11,null,null,null,null,{"$f":"+P23","v":""},{"$f":"+P26","v":""}]
[7,{"$f":"IF(#REF!=2,'ERKEK ELEME'!#REF!,IF(#REF!=3,'ERKEK ELEME'!#REF!,IF(#REF!=4,'ERKEK ELEME'!#REF!,IF(#REF!=5,'ERKEK ELEME'!#REF!,IF(#REF!=6,'ERKEK ELEME'!#REF!,IF(#REF!=7,'ERKEK ELEME'!F767))))))","v":{"$error":"#REF!"}},null,null,null,null,null,null,null,null,{"$f":"+BT8","v":0},{"$f":"+BU8","v":0},"Y-F",null,null,null,null,null,null,null,null,null,null,null,null,null,null,null,null,null,null,null,null,null,null,null,null,null,null,null,null,null,null,null,null,null,null,null,null,null,null,null,null,null,12,null,null,null,null,{"$f":"+P30","v":""},{"$f":"+P32","v":""}]
[null,null,null,{"$f":"+BT6","v":0},{"$f":"+BU6","v":0},"Y-D",null,4,{"$f":"IF(AND(D15=0,E15=0),\"\",IF(D15>E15,B14,B16))","v":""},null,null,null,null,null,null,null,null,null,null,null,null,"I",{"$f":"IF(AND(R11=0,S11=0),\"\",IF(R11<S11,P8,P13))","v":""},null,null,null,null,null,null,"2."]
[8,{"$f":"IF(#REF!=2,'ERKEK ELEME'!#REF!,IF(#REF!=3,'ERKEK ELEME'!#REF!,IF(#REF!=4,'ERKEK ELEME'!#REF!,IF(#REF!=5,'ERKEK ELEME'!#REF!,IF(#REF!=6,'ERKEK ELEME'!#REF!,IF(#REF!=7,'ERKEK ELEME'!F769))))))","v":{"$error":"#REF!"}}]
[null,null,null,null,null,null,null,null,null,null,null,null,null,null,"E",{"$f":"IF(AND(K8=0,L8=0),\"\",IF(K8<L8,I6,I9))","v":""}]
[null,null,null,null,null,null,null,null,null,null,null,null,null,null,null,null,null,{"$f":"+BT12","v":0},{"$f":"+BU12","v":0},"Y-J",null,10,{"$f":"IF(AND(R18=0,S18=0),\"\",IF(R18>S18,P17,P19))","v":""},null,null,null,null,null,null,"3."]
[null,null,null,null,null,null,null,null,null,null,null,null,null,null,"F",{"$f":"IF(AND(K14=0,L14=0),\"\",IF(K14<L14,I12,I15))","v":""}]
[]
[null,null,null,null,null,null,null,null,null,null,null,null,null,null,null,null,null,null,null,null,null,"J",{"$f":"IF(AND(R18=0,S18=0),\"\",IF(R18<S18,P17,P19))","v":""},null,null,null,null,null,null,"4."]
[null,null,null,null,null,null,null,"A",{"$f":"IF(AND(D6=0,E6=0),\"\",IF(D6<E6,B5,B7))","v":""}]
[null,null,null,null,null,null,null,null,null,null,{"$f":"+BT9","v":0},{"$f":"+BU9","v":0},"Y-G",null,7,{"$f":"IF(AND(K23=0,L23=0),\"\",IF(K23>L23,I22,I24))","v":""}]
[null,null,null,null,null,null,null,"B",{"$f":"IF(AND(D9=0,E9=0),\"\",IF(D9<E9,B8,B10))","v":""},null,null,null,null,null,null,null,null,null,null,null,null,11]
[null,null,null,null,null,null,null,"C",{"$f":"IF(AND(D12=0,E12=0),\"\",IF(D12<E12,B11,B13))","v":""},null,null,null,null,null,null,null,null,{"$f":"+BT13","v":0},{"$f":"+BU13","v":0},"Y-K",null,null,{"$f":"IF(AND(R25=0,S25=0),\"\",IF(R25>S25,P23,P26))","v":""},null,null,null,null,null,null,"5."]
[null,null,null,null,null,null,null,null,null,null,{"$f":"+BT10","v":0},{"$f":"+BU10","v":0},"Y-H",null,8,{"$f":"IF(AND(K26=0,L26=0),\"\",IF(K26>L26,I25,I27))","v":""}]
[null,null,null,null,null,null,null,"D",{"$f":"IF(AND(D15=0,E15=0),\"\",IF(D15<E15,B14,B16))","v":""}]
[null,null,null,null,null,null,null,null,null,null,null,null,null,null,null,null,null,null,null,null,null,"K",{"$f":"IF(AND(R25=0,S25=0),\"\",IF(R25<S25,P23,P26))","v":""},null,null,null,null,null,null,"6."]
[]
[null,null,null,null,null,null,null,null,null,null,null,null,null,null,"G",{"$f":"IF(AND(K23=0,L23=0),\"\",IF(K23<L23,I22,I24))","v":""}]
[null,null,null,null,null,null,null,null,null,null,null,null,null,null,null,null,null,{"$f":"+BT14","v":0},{"$f":"+BU14","v":0},"Y-L",null,12,{"$f":"IF(AND(R31=0,S31=0),\"\",IF(R31>S31,P30,P32))","v":""},null,null,null,null,null,null,"7."]
[null,null,null,null,null,null,null,null,null,null,null,null,null,null,"H",{"$f":"IF(AND(K26=0,L26=0),\"\",IF(K26<L26,I25,I27))","v":""}]
[]
[null,null,null,null,null,null,null,null,null,null,null,null,null,null,null,null,null,null,null,null,null,"L",{"$f":"IF(AND(R31=0,S31=0),\"\",IF(R31<S31,P30,P32))","v":""},null,null,null,null,null,null,"8."]

{"sheet":"Cift_Mix","index":12,"n_rows":25,"n_cols":1217,"rows_kept":25,"cut":false,"hidden":true,"merged":[[0,1,0,7],[0,23,2,36],[1,8,1,14],[1,75,1,76],[1,77,1,78],[1,81,1,82],[1,83,1,84],[1,85,1,86],[2,1,2,7],[3,1,3,7],[3,15,3,21],[3,23,4,36],[4,8,4,14],[1,79,1,80],[12,29,12,35],[13,8,13,14],[5,1,5,7],[6,1,6,7],[6,22,6,28],[7,8,7,14],[8,1,8,7],[8,15,8,21],[17,22,17,28],[9,1,9,7],[10,8,10,14],[11,1,11,7],[12,1,12,7],[14,1,14,7],[15,1,15,7],[15,15,15,21],[16,8,16,14],[17,1,17,7],[18,1,18,7],[18,22,18,28],[18,29,18,35],[19,8,19,14],[20,1,20,7],[20,15,20,21],[22,29,22,35],[21,1,21,7],[22,8,22,14],[23,1,23,7],[20,29,20,35]]}
[1,{"$f":"IF(#REF!=2,'ERKEK ELEME'!#REF!,IF(#REF!=3,'ERKEK ELEME'!#REF!,IF(#REF!=4,'ERKEK ELEME'!#REF!,IF(#REF!=5,'ERKEK ELEME'!#REF!,IF(#REF!=6,'ERKEK ELEME'!#REF!)))))","v":{"$error":"#REF!"}},null,null,null,null,null,null,null,null,null,null,null,null,null,null,null,null,null,null,null,null,null,{"$f":"KATILIM!AC1","v":"TÜRKİYE MASA TENİSİ FEDERASYONU\nYILDIZLAR KUZEYBATI BÖLGE YARIŞMALARI"},null,null,null,null,null,null,null,null,null,null,null,null,null,null,null,null,null,null,null,null,null,null,null,null,null,null,null,null,null,null,null,null,null,null,null,null,null,null,null,null,null,null,null,null,null,null,null,null,null,null,null,null,null,null,null,null,null,null,null,null,null,null,null,null,null,null,null,null,null,null,null,null,null,null,null,null,null,null,null,"1st Round",1]
[null,null,null,{"$f":"CH3","v":0},{"$f":"CI3","v":0},null,null,1,{"$f":"IF(AND(D2=0,E2=0),\"\",IF(D2>E2,B1,B3))","v":""},null,null,null,null,null,null,null,null,null,null,null,null,null,null,null,null,null,null,null,null,null,null,null,null,null,null,null,null,null,null,null,null,null,null,null,null,null,null,null,null,null,null,null,null,null,null,null,null,null,null,null,null,null,null,null,null,null,null,null,"#","Date","Time","Table","Competition","Player A","Player B","Set1",null,"Set2",null,"Set3",null,"Set4",null,"Set5",null,"Result",null,null,null,null,null,null,null,null,null,null,null,null,null,null,null,null,null,"2sn Round"]
[2,{"$f":"IF(#REF!=2,'ERKEK ELEME'!#REF!,IF(#REF!=3,'ERKEK ELEME'!#REF!,IF(#REF!=4,'ERKEK ELEME'!#REF!,IF(#REF!=5,'ERKEK ELEME'!#REF!,IF(#REF!=6,'ERKEK ELEME'!#REF!)))))","v":{"$error":"#REF!"}},null,null,null,null,null,null,null,null,null,null,null,null,9,null,null,null,null,null,null,null,null,null,null,null,null,null,null,null,null,null,null,null,null,null,null,null,null,null,null,null,null,null,null,null,null,null,null,null,null,null,null,null,null,null,null,null,null,null,null,null,null,null,null,null,null,null,1,null,null,null,null,{"$f":"B1","v":{"$error":"#REF!"}},{"$f":"B3","v":{"$error":"#REF!"}},null,null,null,null,null,null,null,null,null,null,null,null,null,null,null,null,null,null,null,null,null,null,null,null,null,null,null,null,"3th Round"]
[3,{"$f":"IF(#REF!=2,'ERKEK ELEME'!#REF!,IF(#REF!=3,'ERKEK ELEME'!#REF!,IF(#REF!=4,'ERKEK ELEME'!#REF!,IF(#REF!=5,'ERKEK ELEME'!#REF!,IF(#REF!=6,'ERKEK ELEME'!#REF!)))))","v":{"$error":"#REF!"}},null,null,null,null,null,null,null,null,{"$f":"CH11","v":0},{"$f":"CI11","v":0},null,null,null,{"$f":"IF(AND(K4=0,L4=0),\"\",IF(K4>L4,I2,I5))","v":""},null,null,null,null,null,null,null,{"$f":"KATILIM!AC2&\" \"&KATILIM!AE3","v":"ERKEK TAKIM  [01-02 Mart 2025 BALIKESİR] [ Ana Tablo ]"},null,null,null,null,null,null,null,null,null,null,null,null,null,null,null,null,null,null,null,null,null,null,null,null,null,null,null,null,null,null,null,null,null,null,null,null,null,null,null,null,null,null,null,null,2,null,null,null,null,{"$f":"B4","v":{"$error":"#REF!"}},{"$f":"B6","v":{"$error":"#REF!"}},null,null,null,null,null,null,null,null,null,null,null,null,null,null,null,null,null,null,null,null,null,null,null,null,null,null,null,null,"4th Round"]
[null,null,null,{"$f":"CH4","v":0},{"$f":"CI4","v":0},null,null,2,{"$f":"IF(AND(D5=0,E5=0),\"\",IF(D5>E5,B4,B6))","v":""},null,null,null,null,null,null,null,null,null,null,null,null,13,null,null,null,null,null,null,null,null,null,null,null,null,null,null,null,null,null,null,null,null,null,null,null,null,null,null,null,null,null,null,null,null,null,null,null,null,null,null,null,null,null,null,null,null,null,null,3,null,null,null,null,{"$f":"B7","v":{"$error":"#REF!"}},{"$f":"B9","v":{"$error":"#REF!"}}]
[4,{"$f":"IF(#REF!=2,'ERKEK ELEME'!#REF!,IF(#REF!=3,'ERKEK ELEME'!#REF!,IF(#REF!=4,'ERKEK ELEME'!#REF!,IF(#REF!=5,'ERKEK ELEME'!#REF!,IF(#REF!=6,'ERKEK ELEME'!#REF!)))))","v":{"$error":"#REF!"}},null,null,null,null,null,null,null,null,null,null,null,null,null,null,null,null,null,null,null,null,null,null,null,null,null,null,null,null,null,null,null,null,null,null,null,null,null,null,null,null,null,null,null,null,null,null,null,null,null,null,null,null,null,null,null,null,null,null,null,null,null,null,null,null,null,null,4,null,null,null,null,{"$f":"B10","v":{"$error":"#REF!"}},{"$f":"B12","v":{"$error":"#REF!"}}]
[5,{"$f":"IF(#REF!=2,'ERKEK ELEME'!#REF!,IF(#REF!=3,'ERKEK ELEME'!#REF!,IF(#REF!=4,'ERKEK ELEME'!#REF!,IF(#REF!=5,'ERKEK ELEME'!#REF!,IF(#REF!=6,'ERKEK ELEME'!#REF!)))))","v":{"$error":"#REF!"}},null,null,null,null,null,null,null,null,null,null,null,null,null,null,null,{"$f":"CH15","v":0},{"$f":"CI15","v":0},null,null,null,{"$f":"IF(AND(R7=0,S7=0),\"\",IF(R7>S7,P4,P9))","v":""},null,null,null,null,null,null,null,null,null,null,null,null,null,null,null,null,null,null,null,null,null,null,null,null,null,null,null,null,null,null,null,null,null,null,null,null,null,null,null,null,null,null,null,null,null,5,null,null,null,null,{"$f":"B13","v":{"$error":"#REF!"}},{"$f":"B15","v":{"$error":"#REF!"}}]
[null,null,null,{"$f":"CH5","v":0},{"$f":"CI5","v":0},null,null,3,{"$f":"IF(AND(D8=0,E8=0),\"\",IF(D8>E8,B7,B9))","v":""},null,null,null,null,null,null,null,null,null,null,null,null,null,null,null,null,null,null,null,15,null,null,null,null,null,null,null,null,null,null,null,null,null,null,null,null,null,null,null,null,null,null,null,null,null,null,null,null,null,null,null,null,null,null,null,null,null,null,null,6,null,null,null,null,{"$f":"B16","v":{"$error":"#REF!"}},{"$f":"B18","v":{"$error":"#REF!"}}]
[6,{"$f":"IF(#REF!=2,'ERKEK ELEME'!#REF!,IF(#REF!=3,'ERKEK ELEME'!#REF!,IF(#REF!=4,'ERKEK ELEME'!#REF!,IF(#REF!=5,'ERKEK ELEME'!#REF!,IF(#REF!=6,'ERKEK ELEME'!#REF!)))))","v":{"$error":"#REF!"}},null,null,null,null,null,null,null,null,null,null,null,null,10,{"$f":"IF(AND(K10=0,L10=0),\"\",IF(K10>L10,I8,I11))","v":""},null,null,null,null,null,null,null,null,null,null,null,null,null,null,null,null,null,null,null,null,null,null,null,null,null,null,null,null,null,null,null,null,null,null,null,null,null,null,null,null,null,null,null,null,null,null,null,null,null,null,null,null,7,null,null,null,null,{"$f":"B19","v":{"$error":"#REF!"}},{"$f":"B21","v":{"$error":"#REF!"}}]
[7,{"$f":"IF(#REF!=2,'ERKEK ELEME'!#REF!,IF(#REF!=3,'ERKEK ELEME'!#REF!,IF(#REF!=4,'ERKEK ELEME'!#REF!,IF(#REF!=5,'ERKEK ELEME'!#REF!,IF(#REF!=6,'ERKEK ELEME'!#REF!)))))","v":{"$error":"#REF!"}},null,null,null,null,null,null,null,null,{"$f":"CH12","v":0},{"$f":"CI12","v":0},null,null,null,null,null,null,null,null,null,null,null,null,null,null,null,null,null,null,null,null,null,null,null,null,null,null,null,null,null,null,null,null,null,null,null,null,null,null,null,null,null,null,null,null,null,null,null,null,null,null,null,null,null,null,null,null,8,null,null,null,null,{"$f":"B22","v":{"$error":"#REF!"}},{"$f":"B24","v":{"$error":"#REF!"}}]
[null,null,null,{"$f":"CH6","v":0},{"$f":"CI6","v":0},null,null,4,{"$f":"IF(AND(D11=0,E11=0),\"\",IF(D11>E11,B10,B12))","v":""},null,null,null,null,null,null,null,null,null,null,null,null,null,null,null,null,null,null,null,null,null,null,null,null,null,null,null,null,null,null,null,null,null,null,null,null,null,null,null,null,null,null,null,null,null,null,null,null,null,null,null,null,null,null,null,null,null,null,null,9,null,null,null,null,{"$f":"I2","v":""},{"$f":"I5","v":""}]
[8,{"$f":"IF(#REF!=2,'ERKEK ELEME'!#REF!,IF(#REF!=3,'ERKEK ELEME'!#REF!,IF(#REF!=4,'ERKEK ELEME'!#REF!,IF(#REF!=5,'ERKEK ELEME'!#REF!,IF(#REF!=6,'ERKEK ELEME'!#REF!)))))","v":{"$error":"#REF!"}},null,null,null,null,null,null,null,null,null,null,null,null,null,null,null,null,null,null,null,null,null,null,null,null,null,null,null,null,null,null,null,null,null,null,null,null,null,null,null,null,null,null,null,null,null,null,null,null,null,null,null,null,null,null,null,null,null,null,null,null,null,null,null,null,null,null,10,null,null,null,null,{"$f":"I8","v":""},{"$f":"I11","v":""}]
[9,{"$f":"IF(#REF!=2,'ERKEK ELEME'!#REF!,IF(#REF!=3,'ERKEK ELEME'!#REF!,IF(#REF!=4,'ERKEK ELEME'!#REF!,IF(#REF!=5,'ERKEK ELEME'!#REF!,IF(#REF!=6,'ERKEK ELEME'!#REF!)))))","v":{"$error":"#REF!"}},null,null,null,null,null,null,null,null,null,null,null,null,null,null,null,null,null,null,null,null,null,null,{"$f":"CH17","v":0},{"$f":"+CI17","v":0},null,null,null,{"$f":"IF(AND(Y13=0,Z13=0),\"\",IF(Y13>Z13,W7,W18))","v":""},null,null,null,null,null,null,"1.",null,null,null,null,null,null,null,null,null,null,null,null,null,null,null,null,null,null,null,null,null,null,null,null,null,null,null,null,null,null,null,11,null,null,null,null,{"$f":"I14","v":""},{"$f":"I17","v":""}]
[null,null,null,{"$f":"CH7","v":0},{"$f":"CI7","v":0},null,null,5,{"$f":"IF(AND(D14=0,E14=0),\"\",IF(D14>E14,B13,B15))","v":""},null,null,null,null,null,null,null,null,null,null,null,null,null,null,null,null,null,null,null,null,null,null,null,null,null,null,null,null,null,null,null,null,null,null,null,null,null,null,null,null,null,null,null,null,null,null,null,null,null,null,null,null,null,null,null,null,null,null,null,12,null,null,null,null,{"$f":"I20","v":""},{"$f":"I23","v":""}]
[10,{"$f":"IF(#REF!=2,'ERKEK ELEME'!#REF!,IF(#REF!=3,'ERKEK ELEME'!#REF!,IF(#REF!=4,'ERKEK ELEME'!#REF!,IF(#REF!=5,'ERKEK ELEME'!#REF!,IF(#REF!=6,'ERKEK ELEME'!#REF!)))))","v":{"$error":"#REF!"}},null,null,null,null,null,null,null,null,null,null,null,null,11,null,null,null,null,null,null,null,null,null,null,null,null,null,null,null,null,null,null,null,null,null,null,null,null,null,null,null,null,null,null,null,null,null,null,null,null,null,null,null,null,null,null,null,null,null,null,null,null,null,null,null,null,null,13,null,null,null,null,{"$f":"+P4","v":""},{"$f":"+P9","v":""}]
[11,{"$f":"IF(#REF!=2,'ERKEK ELEME'!#REF!,IF(#REF!=3,'ERKEK ELEME'!#REF!,IF(#REF!=4,'ERKEK ELEME'!#REF!,IF(#REF!=5,'ERKEK ELEME'!#REF!,IF(#REF!=6,'ERKEK ELEME'!#REF!)))))","v":{"$error":"#REF!"}},null,null,null,null,null,null,null,null,{"$f":"CH13","v":0},{"$f":"CI13","v":0},null,null,null,{"$f":"IF(AND(K16=0,L16=0),\"\",IF(K16>L16,I14,I17))","v":""},null,null,null,null,null,null,null,null,null,null,null,null,null,null,null,null,null,null,null,null,null,null,null,null,null,null,null,null,null,null,null,null,null,null,null,null,null,null,null,null,null,null,null,null,null,null,null,null,null,null,null,null,14,null,null,null,null,{"$f":"+P16","v":""},{"$f":"+P21","v":""}]
[null,null,null,{"$f":"CH8","v":0},{"$f":"CI8","v":0},null,null,6,{"$f":"IF(AND(D17=0,E17=0),\"\",IF(D17>E17,B16,B18))","v":""},null,null,null,null,null,null,null,null,null,null,null,null,14,null,null,null,null,null,null,null,null,null,null,null,null,null,null,null,null,null,null,null,null,null,null,null,null,null,null,null,null,null,null,null,null,null,null,null,null,null,null,null,null,null,null,null,null,null,null,15,null,null,null,null,{"$f":"+W7","v":""},{"$f":"+W18","v":""}]
[12,{"$f":"IF(#REF!=2,'ERKEK ELEME'!#REF!,IF(#REF!=3,'ERKEK ELEME'!#REF!,IF(#REF!=4,'ERKEK ELEME'!#REF!,IF(#REF!=5,'ERKEK ELEME'!#REF!,IF(#REF!=6,'ERKEK ELEME'!#REF!)))))","v":{"$error":"#REF!"}},null,null,null,null,null,null,null,null,null,null,null,null,null,null,null,null,null,null,null,null,{"$f":"IF(AND(R19=0,S19=0),\"\",IF(R19>S19,P16,P21))","v":""}]
[13,{"$f":"IF(#REF!=2,'ERKEK ELEME'!#REF!,IF(#REF!=3,'ERKEK ELEME'!#REF!,IF(#REF!=4,'ERKEK ELEME'!#REF!,IF(#REF!=5,'ERKEK ELEME'!#REF!,IF(#REF!=6,'ERKEK ELEME'!#REF!)))))","v":{"$error":"#REF!"}},null,null,null,null,null,null,null,null,null,null,null,null,null,null,null,{"$f":"CH16","v":0},{"$f":"CI16","v":0},null,null,null,null,null,null,null,null,null,null,{"$f":"IF(AND(Y13=0,Z13=0),\"\",IF(Y13<Z13,W7,W18))","v":""},null,null,null,null,null,null,"2."]
[null,null,null,{"$f":"CH9","v":0},{"$f":"CI9","v":0},null,null,7,{"$f":"IF(AND(D20=0,E20=0),\"\",IF(D20>E20,B19,B21))","v":""}]
[14,{"$f":"IF(#REF!=2,'ERKEK ELEME'!#REF!,IF(#REF!=3,'ERKEK ELEME'!#REF!,IF(#REF!=4,'ERKEK ELEME'!#REF!,IF(#REF!=5,'ERKEK ELEME'!#REF!,IF(#REF!=6,'ERKEK ELEME'!#REF!)))))","v":{"$error":"#REF!"}},null,null,null,null,null,null,null,null,null,null,null,null,12,{"$f":"IF(AND(K22=0,L22=0),\"\",IF(K22>L22,I20,I23))","v":""},null,null,null,null,null,null,null,null,null,null,null,null,null,{"$f":"IF(AND(R7=0,S7=0),\"\",IF(R7<S7,P4,P9))","v":""},null,null,null,null,null,null,"3."]
[15,{"$f":"IF(#REF!=2,'ERKEK ELEME'!#REF!,IF(#REF!=3,'ERKEK ELEME'!#REF!,IF(#REF!=4,'ERKEK ELEME'!#REF!,IF(#REF!=5,'ERKEK ELEME'!#REF!,IF(#REF!=6,'ERKEK ELEME'!#REF!)))))","v":{"$error":"#REF!"}},null,null,null,null,null,null,null,null,{"$f":"CH14","v":0},{"$f":"CI14","v":0}]
[null,null,null,{"$f":"CH10","v":0},{"$f":"CI10","v":0},null,null,8,{"$f":"IF(AND(D23=0,E23=0),\"\",IF(D23>E23,B22,B24))","v":""},null,null,null,null,null,null,null,null,null,null,null,null,null,null,null,null,null,null,null,null,{"$f":"IF(AND(R19=0,S19=0),\"\",IF(R19<S19,P16,P21))","v":""},null,null,null,null,null,null,"3."]
[16,{"$f":"IF(#REF!=2,'ERKEK ELEME'!#REF!,IF(#REF!=3,'ERKEK ELEME'!#REF!,IF(#REF!=4,'ERKEK ELEME'!#REF!,IF(#REF!=5,'ERKEK ELEME'!#REF!,IF(#REF!=6,'ERKEK ELEME'!#REF!)))))","v":{"$error":"#REF!"}}]
[null,null,null,null,null,null,null,null,null,null,null,null,null,null,null,null,null,null,null,null,null,null,null,null,null,null,null,null,null,null,null,null,null,null,null,null,null,null,null,null,null,null,null,null,null,null,null,null,null,null,null,null,null,null,null,null,null,null,null,null,null,null,null,null,null,null,null,null,null,null,null,null,null,null,null,null,null,null,null,null,null,null,null,null,null,null,null,null,null,null,null,null,null,null,null,null,null,null,null,null,null,null,null,null,null,null,null,null,null,null,null,null,null,null,null,null,null,null,null,null,null,null,null,null,null,null,null,null,null,null,null,null,null,null,null,null,null,null,null,null,null,null,null,null,null,null,null,null,null,null,null,null,null,null,null,null,null,null,null,null,null,null,null,null,null,null,null,null,null,null,null,null,null,null,null,null,null,null,null,null,null,null,null,null,null,null,null,null,null,null,null,null,null,null,null,null,null,null,null,null,null,null,null,null,null,null,null,null,null,null,null,null,null,null,null,null,null,null,null,null,null,null,null,null,null,null,null,null,null,null,null,null,null,null,null,null,null,null,null,null,null,null,null,null,null,null,null,null,null,null,null,null,null,null,null,null,null,null,null,null,null,null,null,null,null,null,null,null,null,null,null,null,null,null,null,null,null,null,null,null,null,null,null,null,null,null,null,null,null,null,null,null,null,null,null,null,null,null,null,null,null,null,null,null,null,null,null,null,null,null,null,null,null,null,null,null,null,null,null,null,null,null,null,null,null,null,null,null,null,null,null,null,null,null,null,null,null,null,null,null,null,null,null,null,null,null,null,null,null,null,null,null,null,null,null,null,null,null,null,null,null,null,null,null,null,null,null,null,null,null,null,null,null,null,null,null,null,null,null,null,null,null,null,null,null,null,null,null,null,null,null,null,null,null,null,null,null,null,null,null,null,null,null,null,null,null,null,null,null,null,null,null,null,null,null,null,null,null,null,null,null,null,null,null,null,null,null,null,null,null,null,null,null,null,null,null,null,null,null,null,null,null,null,null,null,null,null,null,null,null,null,null,null,null,null,null,null,null,null,null,null,null,null,null,null,null,null,null,null,null,null,null,null,null,null,null,null,null,null,null,null,null,null,null,null,null,null,null,null,null,null,null,null,null,null,null,null,null,null,null,null,null,null,null,null,null,null,null,null,null,null,null,null,null,null,null,null,null,null,null,null,null,null,null,null,null,null,null,null,null,null,null,null,null,null,null,null,null,null,null,null,null,null,null,null,null,null,null,null,null,null,null,null,null,null,null,null,null,null,null,null,null,null,null,null,null,null,null,null,null,null,null,null,null,null,null,null,null,null,null,null,null,null,null,null,null,null,null,null,null,null,null,null,null,null,null,null,null,null,null,null,null,null,null,null,null,null,null,null,null,null,null,null,null,null,null,null,null,null,null,null,null,null,null,null,null,null,null,null,null,null,null,null,null,null,null,null,null,null,null,null,null,null,null,null,null,null,null,null,null,null,null,null,null,null,null,null,null,null,null,null,null,null,null,null,null,null,null,null,null,null,null,null,null,null,null,null,null,null,null,null,null,null,null,null,null,null,null,null,null,null,null,null,null,null,null,null,null,null,null,null,null,null,null,null,null,null,null,null,null,null,null,null,null,null,null,null,null,null,null,null,null,null,null,null,null,null,null,null,null,null,null,null,null,null,null,null,null,null,null,null,null,null,null,null,null,null,null,null,null,null,null,null,null,null,null,null,null,null,null,null,null,null,null,null,null,null,null,null,null,null,null,null,null,null,null,null,null,null,null,null,null,null,null,null,null,null,null,null,null,null,null,null,null,null,null,null,null,null,null,null,null,null,null,null,null,null,null,null,null,null,null,null,null,null,null,null,null,null,null,null,null,null,null,null,null,null,null,null,null,null,null,null,null,null,null,null,null,null,null,null,null,null,null,null,null,null,null,null,null,null,null,null,null,null,null,null,null,null,null,null,null,null,null,null,null,null,null,null,null,null,null,null,null,null,null,null,null,null,null,null,null,null,null,null,null,null,null,null,null,null,null,null,null,null,null,null,null,null,null,null,null,null,null,null,null,null,null,null,null,null,null,null,null,null,null,null,null,null,null,null,null,null,null,null,null,null,null,null,null,null,null,null,null,null,null,null,null,null,null,null,null,null,null,null,null,null,null,null,null,null,null,null,null,null,null,null,null,null,null,null,null,null,null,null,null,null,null,null,null,null,null,null,null,null,null,null,null,null,null,null,null,null,null,null,null,null,null,null,null,null,null,null,null,null,null,null,null,null,null,null,null,null,null,null,null,null,null,null,null,null,null,null,null,null,null,null,null,null,null,null,null,null,null,null,null,null,null,null,null,null,null,null,null,null,null,null,null,null,null,null,null,null,null,null,null,null,null,null,null,null,null,null,null,null,null,null,null,null,null,null,null,null,null,null,null,null,null,null,null,null,null,null,null,null,null,null,null,null,null,null,null,null,null,null,null,null,null,null,null,null,null,null,null,null,null,null,null,null,null,null,null,null,null,null,null,null,null,null,null,null,null,null,null,null,null,null,null,null,null,null,null,null,null,null,null,null,null,null,null,null,null,null,null,null,null,null,null,null,null,null,null,null,null,null,null,null,null,null,null,null,null,null,null,null,null,null,null,null,null,null,null,null,null,null,null,null,null,null,null,null,null,null,null,null,null,null,null,null,null,null,null,null,null,null,null,null,null,null,null,null,null,null,null,null,null,null,null,null,null,null,null,null,null,null,null,null,null,null,null,null,null,null,null,null,null,0]

{"sheet":"SIRALAMA","index":13,"n_rows":41,"n_cols":17,"rows_kept":41,"cut":false,"hidden":false,"merged":[[0,0,0,5],[1,0,1,5]]}
["TÜRKİYE MASA TENİSİ FEDERASYONU\nYILDIZLAR KUZEYBATI BÖLGE YARIŞMALARI",null,null,null,null,null,null,null,null,null,null,null,"32 (DE)",4,"--------",1,1]
["ERKEK TAKIM  [01-02 Mart 2025 BALIKESİR]",null,null,null,null,null,null,null,null,null,null,null,"16 (DE)",null,"Ferdi"]
[null,null,null,null,null,null,null,null,null,null,null,null,"16 (8DE)",null,"Takım"]
[null,null,null,null,null,null,null,null,null,null,null,null,"16 (TE)"]
[null,"Sıra","Takım","Sporcu Adı-Soyadı","İli","İli","Puan",null,null,null,null,null,"8DE"]
[null,1,"FENERBAHÇE (A) (İST)","FENERBAHÇE (A)","İSTANBUL",7,null,null,null,null,null,null,"8TE"]
[null,2,"YALOVA BLD. SPOR (A) (YLV)","YALOVA BLD. SPOR (A)","YALOVA",6,null,null,null,null,null,null,"-------"]
[null,3,"İSTANBUL BBSK (A) (İST)","İSTANBUL BBSK (A)","İSTANBUL",11,null,null,null,null,null,null,16]
[null,4,"İSTANBUL DSİ SPOR (A) (İST)","İSTANBUL DSİ SPOR (A)","İSTANBUL","",null,null,null,null,null,null,"Cift-Mix"]
[null,5,"YILDIZ RAKETLER SPOR (A) (İST)","YILDIZ RAKETLER SPOR (A)","İSTANBUL",8,null,null,null,null,null,null,"16(Okul)"]
[null,6,"İSTANBUL DSİ SPOR (B) (İST)","İSTANBUL DSİ SPOR (B)","İSTANBUL","",null,null,null,null,null,null,"32DE(16)"]
[null,7,"UMUDUMUZ ÖZEL SPORCULAR GSK (A) (BRT)","UMUDUMUZ ÖZEL SPORCULAR GSK (A)","BARTIN",""]
[null,8,"BEYOĞLUSPOR (A) (İST)","BEYOĞLUSPOR (A)","İSTANBUL",""]
[null,9,"YALOVA BLD. SPOR (B) (YLV)","YALOVA BLD. SPOR (B)","YALOVA",""]
[null,9,"GENÇLİKSPOR KIRKLARELİ (B) (KRL)","GENÇLİKSPOR KIRKLARELİ (B)","KIRKLARELİ",""]
[null,9,"BALIKESİR G.SPOR(A) (BLK)","BALIKESİR G.SPOR(A)","BALIKESİR",""]
[null,9,"YALOVA BLD. SPOR (C) (YLV)","YALOVA BLD. SPOR (C)","YALOVA",""]
[null,9,"ÇERKEZKÖY BLD. GSK (A) (TKD)","ÇERKEZKÖY BLD. GSK (A)","TEKİRDAĞ",""]
[null,9,"YILDIZ RAKETLER SPOR (B) (İST)","YILDIZ RAKETLER SPOR (B)","İSTANBUL",0]
[null,9,"PENDİK BLD. SPOR (A) (İST)","PENDİK BLD. SPOR (A)","İSTANBUL",""]
[null,9,"TRAKER SPOR (A) (KRL)","TRAKER SPOR (A)","KIRKLARELİ",""]
[null,null,null,0,0,""]
[null,null,null,0,0,""]
[null,null,null,0,0,""]
[null,null,null,0,0,""]
[null,null,null,0,0,""]
[null,null,null,0,0,""]
[null,null,null,0,0,""]
[null,null,null,0,0,""]
[null,null,null,0,0,""]
[null,null,null,0,0,""]
[null,null,null,0,0,""]
[null,null,null,0,0,""]
[null,null,null,0,0,""]
[null,null,null,0,0,""]
[null,null,null,0,0,""]
[null,null,null,0,0,""]
[null,null,null,0,0,""]
[null,null,null,0,0,""]
[null,null,null,0,0,""]
[null,null,null,0,0,""]

{"sheet":"Ferdi","index":14,"n_rows":31,"n_cols":41,"rows_kept":31,"cut":false,"hidden":true,"merged":[[0,27,0,30],[28,19,28,22],[28,23,28,25],[29,1,29,2],[29,5,29,8],[29,9,29,11],[29,15,29,16],[29,19,29,22],[29,23,29,25],[28,1,28,2],[28,3,28,4],[28,5,28,8],[28,9,28,11],[28,15,28,16],[28,17,28,18],[25,22,26,22],[25,23,26,23],[25,24,26,24],[25,25,26,25],[25,10,26,10],[25,11,26,11],[25,14,26,14],[23,24,24,24],[23,25,24,25],[23,22,24,22],[23,23,24,23],[23,8,24,8],[23,9,24,9],[23,10,24,10],[23,11,24,11],[23,14,24,14],[23,17,24,17],[25,0,26,0],[25,3,26,3],[25,4,26,4],[25,5,26,5],[25,6,26,6],[25,7,26,7],[25,8,26,8],[25,9,26,9],[23,18,24,18],[25,20,26,20],[25,21,26,21],[23,0,24,0],[23,3,24,3],[23,4,24,4],[23,5,24,5],[23,6,24,6],[23,7,24,7],[25,17,26,17],[25,18,26,18],[25,19,26,19],[23,19,24,19],[23,20,24,20],[23,21,24,21],[21,0,22,0],[21,1,22,1],[21,2,22,2],[21,3,21,8],[19,1,19,5],[19,6,19,7],[19,8,19,9],[19,10,19,11],[19,15,19,19],[19,20,19,21],[19,22,19,23],[19,24,19,25],[21,15,22,15],[21,16,22,16],[21,17,21,22],[21,23,21,24],[21,9,21,10],[21,14,22,14],[16,0,16,11],[16,14,16,25],[17,0,17,11],[17,14,17,25],[18,1,18,5],[18,6,18,7],[18,8,18,9],[18,10,18,11],[18,15,18,19],[18,20,18,21],[18,22,18,23],[18,24,18,25],[12,19,12,22],[12,23,12,25],[13,1,13,2],[13,5,13,8],[13,9,13,11],[13,15,13,16],[13,19,13,22],[13,23,13,25],[12,1,12,2],[12,3,12,4],[12,5,12,8],[12,9,12,11],[12,15,12,16],[12,17,12,18],[9,22,10,22],[9,23,10,23],[9,24,10,24],[9,25,10,25],[9,10,10,10],[9,11,10,11],[9,14,10,14],[9,17,10,17],[9,18,10,18],[9,19,10,19],[7,24,8,24],[7,25,8,25],[9,0,10,0],[9,3,10,3],[9,4,10,4],[9,5,10,5],[9,6,10,6],[9,7,10,7],[9,8,10,8],[9,9,10,9],[7,18,8,18],[7,19,8,19],[7,20,8,20],[7,21,8,21],[7,22,8,22],[7,23,8,23],[7,8,8,8],[7,9,8,9],[7,10,8,10],[7,11,8,11],[7,14,8,14],[7,17,8,17],[9,20,10,20],[9,21,10,21],[7,0,8,0],[7,3,8,3],[7,4,8,4],[7,5,8,5],[7,6,8,6],[7,7,8,7],[5,0,6,0],[5,1,6,1],[5,2,6,2],[5,3,5,8],[3,1,3,5],[3,6,3,7],[3,8,3,9],[3,10,3,11],[3,15,3,19],[3,20,3,21],[3,22,3,23],[3,24,3,25],[5,15,6,15],[5,16,6,16],[5,17,5,22],[5,23,5,24],[5,9,5,10],[5,14,6,14],[0,0,0,11],[0,14,0,25],[1,0,1,11],[1,14,1,25],[2,1,2,5],[2,6,2,7],[2,8,2,9],[2,10,2,11],[2,15,2,19],[2,20,2,21],[2,22,2,23],[2,24,2,25]]}
[{"$f":"KATILIM!A1","v":"TÜRKİYE MASA TENİSİ FEDERASYONU\nYILDIZLAR KUZEYBATI BÖLGE YARIŞMALARI"},null,null,null,null,null,null,null,null,null,null,null,null,null,{"$f":"+A1","v":"TÜRKİYE MASA TENİSİ FEDERASYONU\nYILDIZLAR KUZEYBATI BÖLGE YARIŞMALARI"},null,null,null,null,null,null,null,null,null,null,null,null,"Manuel müsabaka çıktısı almak",null,null,null,null,null,null,null,null,null,null,null,"Ön_Eleme",9]
[{"$f":"KATILIM!A2","v":"ERKEK TAKIM  [01-02 Mart 2025 BALIKESİR]"},null,null,null,null,null,null,null,null,null,null,null,null,null,{"$f":"+A2","v":"ERKEK TAKIM  [01-02 Mart 2025 BALIKESİR]"},null,null,null,null,null,null,null,null,null,null,null,null,null,null,null,null,null,null,null,null,null,null,null,null,"Eleme"]
["No","Yarışma",null,null,null,null,"Tarih",null,"Saat",null,"Masa",null,null,null,"No","Yarışma",null,null,null,null,"Tarih",null,"Saat",null,"Masa",null,null,null,null,null,null,null,null,null,null,null,null,null,null,"32DE"]
[null,null,null,null,null,null,null,null,null,null,null,null,null,null,{"$f":"IF(A4=0,0,A4+1)","v":0},null,null,null,null,null,null,null,null,null,null,null,null,null,null,null,null,null,null,null,null,null,null,null,null,"16DE"]
[13,null,null,null,null,null,null,null,null,null,null,null,null,null,{"$f":"O4&\".\"&O4","v":"0.0"},null,null,null,null,null,null,null,null,null,null,null,null,null,null,null,null,null,null,null,null,null,null,null,null,"16(TE)"]
["K","Nr",null,"SETLER",null,null,null,null,null,"Sporcu",null,"Öğ.",null,null,"K","Nr",null,"SETLER",null,null,null,null,null,"Sporcu",null,"Öğ.",null,null,null,null,null,null,null,null,null,null,null,null,null,"16(8DE)"]
[null,null,null,1,2,3,4,5,"N","M","SKK","SK",null,null,null,null,null,1,2,3,4,5,"N","M","SKK","SK",null,null,null,null,null,null,null,null,null,null,null,null,null,"8DE"]
["A","",null,null,null,null,null,null,null,null,null,null,null,null,"A","",null,null,null,null,null,null,null,null,null,null,null,null,null,null,null,null,null,null,null,null,null,null,null,"8TE"]
[null,"FR",null,null,null,null,null,null,null,null,null,null,null,null,null,"FR",null,null,null,null,null,null,null,null,null,null,null,null,null,null,null,null,null,null,null,null,null,null,null,"-----"]
["X","",null,null,null,null,null,null,null,null,null,null,null,null,"X","",null,null,null,null,null,null,null,null,null,null,null,null,null,null,null,null,null,null,null,null,null,null,null,16]
[null,"FR",null,null,null,null,null,null,null,null,null,null,null,null,null,"FR",null,null,null,null,null,null,null,null,null,null,null,null,null,null,null,null,null,null,null,null,null,null,null,"Cift-Mix"]
[null,null,null,null,null,null,null,null,null,null,null,null,null,null,null,null,null,null,null,null,null,null,null,null,null,null,null,null,null,null,null,null,null,null,null,null,null,null,null,"32DE(16)"]
["Nr.","Galip: Adı Soyadı / İmza",null,"SONUÇ",null,"Hakem: Adı Soyadı / İmza",null,null,null,"Başhakem",null,null,null,null,"Nr.","Galip: Adı Soyadı / İmza",null,"SONUÇ",null,"Hakem: Adı Soyadı / İmza",null,null,null,"Başhakem"]
[null,null,null,{"$f":"#REF!","v":{"$error":"#REF!"}},null,null,null,null,null,null,null,null,null,null,null,null,null,{"$f":"#REF!","v":{"$error":"#REF!"}}]
["Başlama Saati:",null,null,"Bitiş Saati:",null,null,null,null,null,null,null,null,null,null,"Başlama Saati:",null,null,"Bitiş Saati:"]
[]
[{"$f":"+A1","v":"TÜRKİYE MASA TENİSİ FEDERASYONU\nYILDIZLAR KUZEYBATI BÖLGE YARIŞMALARI"},null,null,null,null,null,null,null,null,null,null,null,null,null,{"$f":"+A1","v":"TÜRKİYE MASA TENİSİ FEDERASYONU\nYILDIZLAR KUZEYBATI BÖLGE YARIŞMALARI"}]
[{"$f":"+A2","v":"ERKEK TAKIM  [01-02 Mart 2025 BALIKESİR]"},null,null,null,null,null,null,null,null,null,null,null,null,null,{"$f":"+A2","v":"ERKEK TAKIM  [01-02 Mart 2025 BALIKESİR]"}]
["No","Yarışma",null,null,null,null,"Tarih",null,"Saat",null,"Masa",null,null,null,"No","Yarışma",null,null,null,null,"Tarih",null,"Saat",null,"Masa"]
[{"$f":"IF(O4=0,0,O4+1)","v":0},null,null,null,null,null,null,null,null,null,null,null,null,null,{"$f":"IF(A20=0,0,A20+1)","v":0}]
[{"$f":"A20&\".\"&A20","v":"0.0"},null,null,null,null,null,null,null,null,null,null,null,null,null,{"$f":"O20&\".\"&O20","v":"0.0"}]
["K","Nr",null,"SETLER",null,null,null,null,null,"Sporcu",null,"Öğ.",null,null,"K","Nr",null,"SETLER",null,null,null,null,null,"Sporcu",null,"Öğ."]
[null,null,null,1,2,3,4,5,"N","M","SKK","SK",null,null,null,null,null,1,2,3,4,5,"N","M","SKK","SK"]
["A","",null,null,null,null,null,null,null,null,null,null,null,null,"A",""]
[null,"FR",null,null,null,null,null,null,null,null,null,null,null,null,null,"FR"]
["X","",null,null,null,null,null,null,null,null,null,null,null,null,"X",""]
[null,"FR",null,null,null,null,null,null,null,null,null,null,null,null,null,"FR"]
[]
["Nr.","Galip: Adı Soyadı / İmza",null,"SONUÇ",null,"Hakem: Adı Soyadı / İmza",null,null,null,"Başhakem",null,null,null,null,"Nr.","Galip: Adı Soyadı / İmza",null,"SONUÇ",null,"Hakem: Adı Soyadı / İmza",null,null,null,"Başhakem"]
[null,null,null,{"$f":"#REF!","v":{"$error":"#REF!"}},null,null,null,null,null,null,null,null,null,null,null,null,null,{"$f":"#REF!","v":{"$error":"#REF!"}}]
["Başlama Saati:",null,null,"Bitiş Saati:",null,null,null,null,null,null,null,null,null,null,"Başlama Saati:",null,null,"Bitiş Saati:"]

{"sheet":"Puan","index":15,"n_rows":259,"n_cols":5,"rows_kept":259,"cut":false,"hidden":true,"merged":[[1,2,1,3],[1,4,2,4],[1,1,2,1]]}
[]
[null,"Sıra","Sporcunun",null,"Puan"]
[null,null,"Adı - Soyadı","Kulübü"]
[null,1,{"$f":"'32DE'!BT39","v":""},{"$f":"IFERROR(VLOOKUP(C4,KATILIM!D4:F292,3,0),\"\")","v":""},32]
[null,2,{"$f":"+'32DE'!BT57","v":""},{"$f":"IFERROR(VLOOKUP(C5,KATILIM!D5:F293,3,0),\"\")","v":""},31]
[null,3,{"$f":"+'32DE'!BM63","v":""},{"$f":"IFERROR(VLOOKUP(C6,KATILIM!D6:F294,3,0),\"\")","v":""},30]
[null,4,{"$f":"+'32DE'!BF71","v":""},{"$f":"IFERROR(VLOOKUP(C7,KATILIM!D7:F295,3,0),\"\")","v":""},29]
[null,5,{"$f":"+'32DE'!BF75","v":""},{"$f":"IFERROR(VLOOKUP(C8,KATILIM!D8:F296,3,0),\"\")","v":""},28]
[null,6,{"$f":"+'32DE'!BF77","v":""},{"$f":"IFERROR(VLOOKUP(C9,KATILIM!D9:F297,3,0),\"\")","v":""},27]
[null,7,{"$f":"+'32DE'!AY79","v":""},{"$f":"IFERROR(VLOOKUP(C10,KATILIM!D10:F298,3,0),\"\")","v":""},26]
[null,8,{"$f":"+'32DE'!AY81","v":""},{"$f":"IFERROR(VLOOKUP(C11,KATILIM!D11:F299,3,0),\"\")","v":""},25]
[null,9,{"$f":"+'32DE'!AY84","v":""},{"$f":"IFERROR(VLOOKUP(C12,KATILIM!D12:F300,3,0),\"\")","v":""},24]
[null,10,{"$f":"+'32DE'!AY86","v":""},{"$f":"IFERROR(VLOOKUP(C13,KATILIM!D13:F301,3,0),\"\")","v":""},23]
[null,11,{"$f":"+'32DE'!AY88","v":""},{"$f":"IFERROR(VLOOKUP(C14,KATILIM!D14:F302,3,0),\"\")","v":""},22]
[null,12,{"$f":"+'32DE'!AY90","v":""},{"$f":"IFERROR(VLOOKUP(C15,KATILIM!D15:F303,3,0),\"\")","v":""},21]
[null,13,{"$f":"+'32DE'!AR92","v":""},{"$f":"IFERROR(VLOOKUP(C16,KATILIM!D16:F304,3,0),\"\")","v":""},20]
[null,14,{"$f":"+'32DE'!AR94","v":""},{"$f":"IFERROR(VLOOKUP(C17,KATILIM!D17:F305,3,0),\"\")","v":""},19]
[null,15,{"$f":"+'32DE'!AR96","v":""},{"$f":"IFERROR(VLOOKUP(C18,KATILIM!D18:F306,3,0),\"\")","v":""},18]
[null,16,{"$f":"+'32DE'!AR98","v":""},{"$f":"IFERROR(VLOOKUP(C19,KATILIM!D19:F307,3,0),\"\")","v":""},17]
[null,"17-24",{"$f":"IF('32DE'!$R$51<'32DE'!$S$51,'32DE'!$P$50,'32DE'!$P$52)","v":""},{"$f":"IFERROR(VLOOKUP(C20,KATILIM!D20:F308,3,0),\"\")","v":""},16]
[null,"17-24",{"$f":"IF('32DE'!$R$55<'32DE'!$S$55,'32DE'!$P$54,'32DE'!$P$56)","v":""},{"$f":"IFERROR(VLOOKUP(C21,KATILIM!D21:F309,3,0),\"\")","v":""},16]
[null,"17-24",{"$f":"IF('32DE'!$R$59<'32DE'!$S$59,'32DE'!$P$58,'32DE'!$P$60)","v":""},{"$f":"IFERROR(VLOOKUP(C22,KATILIM!D22:F310,3,0),\"\")","v":""},16]
[null,"17-24",{"$f":"IF('32DE'!$R$63<'32DE'!$S$63,'32DE'!$P$62,'32DE'!$P$64)","v":""},{"$f":"IFERROR(VLOOKUP(C23,KATILIM!D23:F311,3,0),\"\")","v":""},16]
[null,"17-24",{"$f":"IF('32DE'!$R$67<'32DE'!$S$67,'32DE'!$P$66,'32DE'!$P$68)","v":""},{"$f":"IFERROR(VLOOKUP(C24,KATILIM!D24:F312,3,0),\"\")","v":""},16]
[null,"17-24",{"$f":"IF('32DE'!$R$71<'32DE'!$S$71,'32DE'!$P$70,'32DE'!$P$72)","v":""},{"$f":"IFERROR(VLOOKUP(C25,KATILIM!D25:F313,3,0),\"\")","v":""},16]
[null,"17-24",{"$f":"IF('32DE'!$R$75<'32DE'!$S$75,'32DE'!$P$74,'32DE'!$P$76)","v":""},{"$f":"IFERROR(VLOOKUP(C26,KATILIM!D26:F314,3,0),\"\")","v":""},16]
[null,"17-24",{"$f":"IF('32DE'!$R$79<'32DE'!$S$79,'32DE'!$P$78,'32DE'!$P$80)","v":""},{"$f":"IFERROR(VLOOKUP(C27,KATILIM!D27:F315,3,0),\"\")","v":""},16]
[null,"25-32",{"$f":"IF('32DE'!$K$52<'32DE'!$L$52,'32DE'!$I$51,'32DE'!$I$53)","v":""},{"$f":"IFERROR(VLOOKUP(C28,KATILIM!D28:F316,3,0),\"\")","v":""},8]
[null,"25-32",{"$f":"IF('32DE'!$K$56<'32DE'!$L$56,'32DE'!$I$55,'32DE'!$I$57)","v":""},{"$f":"IFERROR(VLOOKUP(C29,KATILIM!D29:F317,3,0),\"\")","v":""},8]
[null,"25-32",{"$f":"IF('32DE'!$K$60<'32DE'!$L$60,'32DE'!$I$59,'32DE'!$I$61)","v":""},{"$f":"IFERROR(VLOOKUP(C30,KATILIM!D30:F318,3,0),\"\")","v":""},8]
[null,"25-32",{"$f":"IF('32DE'!$K$64<'32DE'!$L$64,'32DE'!$I$63,'32DE'!$I$65)","v":""},{"$f":"IFERROR(VLOOKUP(C31,KATILIM!D31:F319,3,0),\"\")","v":""},8]
[null,"25-32",{"$f":"IF('32DE'!$K$68<'32DE'!$L$68,'32DE'!$I$67,'32DE'!$I$69)","v":""},{"$f":"IFERROR(VLOOKUP(C32,KATILIM!D32:F320,3,0),\"\")","v":""},8]
[null,"25-32",{"$f":"IF('32DE'!$K$72<'32DE'!$L$72,'32DE'!$I$71,'32DE'!$I$73)","v":""},{"$f":"IFERROR(VLOOKUP(C33,KATILIM!D33:F321,3,0),\"\")","v":""},8]
[null,"25-32",{"$f":"IF('32DE'!$K$76<'32DE'!$L$76,'32DE'!$I$75,'32DE'!$I$77)","v":""},{"$f":"IFERROR(VLOOKUP(C34,KATILIM!D34:F322,3,0),\"\")","v":""},8]
[null,"25-32",{"$f":"IF('32DE'!$K$80<'32DE'!$L$80,'32DE'!$I$79,'32DE'!$I$81)","v":""},{"$f":"IFERROR(VLOOKUP(C35,KATILIM!D35:F323,3,0),\"\")","v":""},8]
[null,"33-64",{"$f":"IF(OR('ERKEK ELEME'!#REF!=\"\",'ERKEK ELEME'!#REF!=0,'ERKEK ELEME'!#REF!=1,'ERKEK ELEME'!#REF!=2),'ERKEK ELEME'!#REF!,'ERKEK ELEME'!#REF!)","v":{"$error":"#REF!"}},{"$f":"IFERROR(VLOOKUP(C36,KATILIM!D36:F324,3,0),\"\")","v":""},4]
[null,"33-64",{"$f":"IF(OR('ERKEK ELEME'!#REF!=\"\",'ERKEK ELEME'!#REF!=0,'ERKEK ELEME'!#REF!=1,'ERKEK ELEME'!#REF!=2),'ERKEK ELEME'!#REF!,'ERKEK ELEME'!#REF!)","v":{"$error":"#REF!"}},{"$f":"IFERROR(VLOOKUP(C37,KATILIM!D37:F325,3,0),\"\")","v":""},4]
[null,"33-64",{"$f":"IF(OR('ERKEK ELEME'!#REF!=\"\",'ERKEK ELEME'!#REF!=0,'ERKEK ELEME'!#REF!=1,'ERKEK ELEME'!#REF!=2),'ERKEK ELEME'!#REF!,'ERKEK ELEME'!#REF!)","v":{"$error":"#REF!"}},{"$f":"IFERROR(VLOOKUP(C38,KATILIM!D38:F326,3,0),\"\")","v":""},4]
[null,"33-64",{"$f":"IF(OR('ERKEK ELEME'!#REF!=\"\",'ERKEK ELEME'!#REF!=0,'ERKEK ELEME'!#REF!=1,'ERKEK ELEME'!#REF!=2),'ERKEK ELEME'!#REF!,'ERKEK ELEME'!#REF!)","v":{"$error":"#REF!"}},{"$f":"IFERROR(VLOOKUP(C39,KATILIM!D39:F327,3,0),\"\")","v":""},4]
[null,"33-64",{"$f":"IF(OR('ERKEK ELEME'!#REF!=\"\",'ERKEK ELEME'!#REF!=0,'ERKEK ELEME'!#REF!=1,'ERKEK ELEME'!#REF!=2),'ERKEK ELEME'!#REF!,'ERKEK ELEME'!#REF!)","v":{"$error":"#REF!"}},{"$f":"IFERROR(VLOOKUP(C40,KATILIM!D40:F328,3,0),\"\")","v":""},4]
[null,"33-64",{"$f":"IF(OR('ERKEK ELEME'!#REF!=\"\",'ERKEK ELEME'!#REF!=0,'ERKEK ELEME'!#REF!=1,'ERKEK ELEME'!#REF!=2),'ERKEK ELEME'!#REF!,'ERKEK ELEME'!#REF!)","v":{"$error":"#REF!"}},{"$f":"IFERROR(VLOOKUP(C41,KATILIM!D41:F329,3,0),\"\")","v":""},4]
[null,"33-64",{"$f":"IF(OR('ERKEK ELEME'!#REF!=\"\",'ERKEK ELEME'!#REF!=0,'ERKEK ELEME'!#REF!=1,'ERKEK ELEME'!#REF!=2),'ERKEK ELEME'!#REF!,'ERKEK ELEME'!#REF!)","v":{"$error":"#REF!"}},{"$f":"IFERROR(VLOOKUP(C42,KATILIM!D42:F330,3,0),\"\")","v":""},4]
[null,"33-64",{"$f":"IF(OR('ERKEK ELEME'!#REF!=\"\",'ERKEK ELEME'!#REF!=0,'ERKEK ELEME'!#REF!=1,'ERKEK ELEME'!#REF!=2),'ERKEK ELEME'!#REF!,'ERKEK ELEME'!#REF!)","v":{"$error":"#REF!"}},{"$f":"IFERROR(VLOOKUP(C43,KATILIM!D43:F331,3,0),\"\")","v":""},4]
[null,"33-64",{"$f":"IF(OR('ERKEK ELEME'!#REF!=\"\",'ERKEK ELEME'!#REF!=0,'ERKEK ELEME'!#REF!=1,'ERKEK ELEME'!#REF!=2),'ERKEK ELEME'!#REF!,'ERKEK ELEME'!#REF!)","v":{"$error":"#REF!"}},{"$f":"IFERROR(VLOOKUP(C44,KATILIM!D44:F332,3,0),\"\")","v":""},4]
[null,"33-64",{"$f":"IF(OR('ERKEK ELEME'!#REF!=\"\",'ERKEK ELEME'!#REF!=0,'ERKEK ELEME'!#REF!=1,'ERKEK ELEME'!#REF!=2),'ERKEK ELEME'!#REF!,'ERKEK ELEME'!#REF!)","v":{"$error":"#REF!"}},{"$f":"IFERROR(VLOOKUP(C45,KATILIM!D45:F333,3,0),\"\")","v":""},4]
[null,"33-64",{"$f":"IF(OR('ERKEK ELEME'!#REF!=\"\",'ERKEK ELEME'!#REF!=0,'ERKEK ELEME'!#REF!=1,'ERKEK ELEME'!#REF!=2),'ERKEK ELEME'!#REF!,'ERKEK ELEME'!#REF!)","v":{"$error":"#REF!"}},{"$f":"IFERROR(VLOOKUP(C46,KATILIM!D46:F334,3,0),\"\")","v":""},4]
[null,"33-64",{"$f":"IF(OR('ERKEK ELEME'!#REF!=\"\",'ERKEK ELEME'!#REF!=0,'ERKEK ELEME'!#REF!=1,'ERKEK ELEME'!#REF!=2),'ERKEK ELEME'!#REF!,'ERKEK ELEME'!#REF!)","v":{"$error":"#REF!"}},{"$f":"IFERROR(VLOOKUP(C47,KATILIM!D47:F335,3,0),\"\")","v":""},4]
[null,"33-64",{"$f":"IF(OR('ERKEK ELEME'!#REF!=\"\",'ERKEK ELEME'!#REF!=0,'ERKEK ELEME'!#REF!=1,'ERKEK ELEME'!#REF!=2),'ERKEK ELEME'!#REF!,'ERKEK ELEME'!#REF!)","v":{"$error":"#REF!"}},{"$f":"IFERROR(VLOOKUP(C48,KATILIM!D48:F336,3,0),\"\")","v":""},4]
[null,"33-64",{"$f":"IF(OR('ERKEK ELEME'!#REF!=\"\",'ERKEK ELEME'!#REF!=0,'ERKEK ELEME'!#REF!=1,'ERKEK ELEME'!#REF!=2),'ERKEK ELEME'!#REF!,'ERKEK ELEME'!#REF!)","v":{"$error":"#REF!"}},{"$f":"IFERROR(VLOOKUP(C49,KATILIM!D49:F337,3,0),\"\")","v":""},4]
[null,"33-64",{"$f":"IF(OR('ERKEK ELEME'!#REF!=\"\",'ERKEK ELEME'!#REF!=0,'ERKEK ELEME'!#REF!=1,'ERKEK ELEME'!#REF!=2),'ERKEK ELEME'!#REF!,'ERKEK ELEME'!#REF!)","v":{"$error":"#REF!"}},{"$f":"IFERROR(VLOOKUP(C50,KATILIM!D50:F338,3,0),\"\")","v":""},4]
[null,"33-64",{"$f":"IF(OR('ERKEK ELEME'!#REF!=\"\",'ERKEK ELEME'!#REF!=0,'ERKEK ELEME'!#REF!=1,'ERKEK ELEME'!#REF!=2),'ERKEK ELEME'!#REF!,'ERKEK ELEME'!#REF!)","v":{"$error":"#REF!"}},{"$f":"IFERROR(VLOOKUP(C51,KATILIM!D51:F339,3,0),\"\")","v":""},4]
[null,"33-64",{"$f":"IF(OR('ERKEK ELEME'!#REF!=\"\",'ERKEK ELEME'!#REF!=0,'ERKEK ELEME'!#REF!=1,'ERKEK ELEME'!#REF!=2),'ERKEK ELEME'!#REF!,'ERKEK ELEME'!#REF!)","v":{"$error":"#REF!"}},{"$f":"IFERROR(VLOOKUP(C52,KATILIM!D52:F340,3,0),\"\")","v":""},4]
[null,"33-64",{"$f":"IF(OR('ERKEK ELEME'!#REF!=\"\",'ERKEK ELEME'!#REF!=0,'ERKEK ELEME'!#REF!=1,'ERKEK ELEME'!#REF!=2),'ERKEK ELEME'!#REF!,'ERKEK ELEME'!#REF!)","v":{"$error":"#REF!"}},{"$f":"IFERROR(VLOOKUP(C53,KATILIM!D53:F341,3,0),\"\")","v":""},4]
[null,"33-64",{"$f":"IF(OR('ERKEK ELEME'!#REF!=\"\",'ERKEK ELEME'!#REF!=0,'ERKEK ELEME'!#REF!=1,'ERKEK ELEME'!#REF!=2),'ERKEK ELEME'!#REF!,'ERKEK ELEME'!#REF!)","v":{"$error":"#REF!"}},{"$f":"IFERROR(VLOOKUP(C54,KATILIM!D54:F342,3,0),\"\")","v":""},4]
[null,"33-64",{"$f":"IF(OR('ERKEK ELEME'!#REF!=\"\",'ERKEK ELEME'!#REF!=0,'ERKEK ELEME'!#REF!=1,'ERKEK ELEME'!#REF!=2),'ERKEK ELEME'!#REF!,'ERKEK ELEME'!#REF!)","v":{"$error":"#REF!"}},{"$f":"IFERROR(VLOOKUP(C55,KATILIM!D55:F343,3,0),\"\")","v":""},4]
[null,"33-64",{"$f":"IF(OR('ERKEK ELEME'!#REF!=\"\",'ERKEK ELEME'!#REF!=0,'ERKEK ELEME'!#REF!=1,'ERKEK ELEME'!#REF!=2),'ERKEK ELEME'!#REF!,'ERKEK ELEME'!#REF!)","v":{"$error":"#REF!"}},{"$f":"IFERROR(VLOOKUP(C56,KATILIM!D56:F344,3,0),\"\")","v":""},4]
[null,"33-64",{"$f":"IF(OR('ERKEK ELEME'!#REF!=\"\",'ERKEK ELEME'!#REF!=0,'ERKEK ELEME'!#REF!=1,'ERKEK ELEME'!#REF!=2),'ERKEK ELEME'!#REF!,'ERKEK ELEME'!#REF!)","v":{"$error":"#REF!"}},{"$f":"IFERROR(VLOOKUP(C57,KATILIM!D57:F345,3,0),\"\")","v":""},4]
[null,"33-64",{"$f":"IF(OR('ERKEK ELEME'!#REF!=\"\",'ERKEK ELEME'!#REF!=0,'ERKEK ELEME'!#REF!=1,'ERKEK ELEME'!#REF!=2),'ERKEK ELEME'!#REF!,'ERKEK ELEME'!#REF!)","v":{"$error":"#REF!"}},{"$f":"IFERROR(VLOOKUP(C58,KATILIM!D58:F346,3,0),\"\")","v":""},4]
[null,"33-64",{"$f":"IF(OR('ERKEK ELEME'!#REF!=\"\",'ERKEK ELEME'!#REF!=0,'ERKEK ELEME'!#REF!=1,'ERKEK ELEME'!#REF!=2),'ERKEK ELEME'!#REF!,'ERKEK ELEME'!#REF!)","v":{"$error":"#REF!"}},{"$f":"IFERROR(VLOOKUP(C59,KATILIM!D59:F347,3,0),\"\")","v":""},4]
[null,"33-64",{"$f":"IF(OR('ERKEK ELEME'!#REF!=\"\",'ERKEK ELEME'!#REF!=0,'ERKEK ELEME'!#REF!=1,'ERKEK ELEME'!#REF!=2),'ERKEK ELEME'!#REF!,'ERKEK ELEME'!#REF!)","v":{"$error":"#REF!"}},{"$f":"IFERROR(VLOOKUP(C60,KATILIM!D60:F348,3,0),\"\")","v":""},4]
[null,"33-64",{"$f":"IF(OR('ERKEK ELEME'!#REF!=\"\",'ERKEK ELEME'!#REF!=0,'ERKEK ELEME'!#REF!=1,'ERKEK ELEME'!#REF!=2),'ERKEK ELEME'!#REF!,'ERKEK ELEME'!#REF!)","v":{"$error":"#REF!"}},{"$f":"IFERROR(VLOOKUP(C61,KATILIM!D61:F349,3,0),\"\")","v":""},4]
[null,"33-64",{"$f":"IF(OR('ERKEK ELEME'!#REF!=\"\",'ERKEK ELEME'!#REF!=0,'ERKEK ELEME'!#REF!=1,'ERKEK ELEME'!#REF!=2),'ERKEK ELEME'!#REF!,'ERKEK ELEME'!#REF!)","v":{"$error":"#REF!"}},{"$f":"IFERROR(VLOOKUP(C62,KATILIM!D62:F350,3,0),\"\")","v":""},4]
[null,"33-64",{"$f":"IF(OR('ERKEK ELEME'!#REF!=\"\",'ERKEK ELEME'!#REF!=0,'ERKEK ELEME'!#REF!=1,'ERKEK ELEME'!#REF!=2),'ERKEK ELEME'!#REF!,'ERKEK ELEME'!#REF!)","v":{"$error":"#REF!"}},{"$f":"IFERROR(VLOOKUP(C63,KATILIM!D63:F351,3,0),\"\")","v":""},4]
[null,"33-64",{"$f":"IF(OR('ERKEK ELEME'!#REF!=\"\",'ERKEK ELEME'!#REF!=0,'ERKEK ELEME'!#REF!=1,'ERKEK ELEME'!#REF!=2),'ERKEK ELEME'!#REF!,'ERKEK ELEME'!#REF!)","v":{"$error":"#REF!"}},{"$f":"IFERROR(VLOOKUP(C64,KATILIM!D64:F352,3,0),\"\")","v":""},4]
[null,"33-64",{"$f":"IF(OR('ERKEK ELEME'!#REF!=\"\",'ERKEK ELEME'!#REF!=0,'ERKEK ELEME'!#REF!=1,'ERKEK ELEME'!#REF!=2),'ERKEK ELEME'!#REF!,'ERKEK ELEME'!#REF!)","v":{"$error":"#REF!"}},{"$f":"IFERROR(VLOOKUP(C65,KATILIM!D65:F353,3,0),\"\")","v":""},4]
[null,"33-64",{"$f":"IF(OR('ERKEK ELEME'!#REF!=\"\",'ERKEK ELEME'!#REF!=0,'ERKEK ELEME'!#REF!=1,'ERKEK ELEME'!#REF!=2),'ERKEK ELEME'!#REF!,'ERKEK ELEME'!#REF!)","v":{"$error":"#REF!"}},{"$f":"IFERROR(VLOOKUP(C66,KATILIM!D66:F354,3,0),\"\")","v":""},4]
[null,"33-64",{"$f":"IF(OR('ERKEK ELEME'!#REF!=\"\",'ERKEK ELEME'!#REF!=0,'ERKEK ELEME'!#REF!=1,'ERKEK ELEME'!#REF!=2),'ERKEK ELEME'!#REF!,'ERKEK ELEME'!#REF!)","v":{"$error":"#REF!"}},{"$f":"IFERROR(VLOOKUP(C67,KATILIM!D67:F355,3,0),\"\")","v":""},4]
[null,"65-128",{"$f":"IF(OR('ERKEK ELEME'!#REF!=\"\",'ERKEK ELEME'!#REF!=0,'ERKEK ELEME'!#REF!=1,'ERKEK ELEME'!#REF!=2),'ERKEK ELEME'!#REF!,'ERKEK ELEME'!#REF!)","v":{"$error":"#REF!"}},{"$f":"IFERROR(VLOOKUP(C68,KATILIM!D68:F356,3,0),\"\")","v":""},2]
[null,"65-128",{"$f":"IF(OR('ERKEK ELEME'!#REF!=\"\",'ERKEK ELEME'!#REF!=0,'ERKEK ELEME'!#REF!=1,'ERKEK ELEME'!#REF!=2),'ERKEK ELEME'!#REF!,'ERKEK ELEME'!#REF!)","v":{"$error":"#REF!"}},{"$f":"IFERROR(VLOOKUP(C69,KATILIM!D69:F357,3,0),\"\")","v":""},2]
[null,"65-128",{"$f":"IF(OR('ERKEK ELEME'!#REF!=\"\",'ERKEK ELEME'!#REF!=0,'ERKEK ELEME'!#REF!=1,'ERKEK ELEME'!#REF!=2),'ERKEK ELEME'!#REF!,'ERKEK ELEME'!#REF!)","v":{"$error":"#REF!"}},{"$f":"IFERROR(VLOOKUP(C70,KATILIM!D70:F358,3,0),\"\")","v":""},2]
[null,"65-128",{"$f":"IF(OR('ERKEK ELEME'!#REF!=\"\",'ERKEK ELEME'!#REF!=0,'ERKEK ELEME'!#REF!=1,'ERKEK ELEME'!#REF!=2),'ERKEK ELEME'!#REF!,'ERKEK ELEME'!#REF!)","v":{"$error":"#REF!"}},{"$f":"IFERROR(VLOOKUP(C71,KATILIM!D71:F359,3,0),\"\")","v":""},2]
[null,"65-128",{"$f":"IF(OR('ERKEK ELEME'!#REF!=\"\",'ERKEK ELEME'!#REF!=0,'ERKEK ELEME'!#REF!=1,'ERKEK ELEME'!#REF!=2),'ERKEK ELEME'!#REF!,'ERKEK ELEME'!#REF!)","v":{"$error":"#REF!"}},{"$f":"IFERROR(VLOOKUP(C72,KATILIM!D72:F360,3,0),\"\")","v":""},2]
[null,"65-128",{"$f":"IF(OR('ERKEK ELEME'!#REF!=\"\",'ERKEK ELEME'!#REF!=0,'ERKEK ELEME'!#REF!=1,'ERKEK ELEME'!#REF!=2),'ERKEK ELEME'!#REF!,'ERKEK ELEME'!#REF!)","v":{"$error":"#REF!"}},{"$f":"IFERROR(VLOOKUP(C73,KATILIM!D73:F361,3,0),\"\")","v":""},2]
[null,"65-128",{"$f":"IF(OR('ERKEK ELEME'!#REF!=\"\",'ERKEK ELEME'!#REF!=0,'ERKEK ELEME'!#REF!=1,'ERKEK ELEME'!#REF!=2),'ERKEK ELEME'!#REF!,'ERKEK ELEME'!#REF!)","v":{"$error":"#REF!"}},{"$f":"IFERROR(VLOOKUP(C74,KATILIM!D74:F362,3,0),\"\")","v":""},2]
[null,"65-128",{"$f":"IF(OR('ERKEK ELEME'!#REF!=\"\",'ERKEK ELEME'!#REF!=0,'ERKEK ELEME'!#REF!=1,'ERKEK ELEME'!#REF!=2),'ERKEK ELEME'!#REF!,'ERKEK ELEME'!#REF!)","v":{"$error":"#REF!"}},{"$f":"IFERROR(VLOOKUP(C75,KATILIM!D75:F363,3,0),\"\")","v":""},2]
[null,"65-128",{"$f":"IF(OR('ERKEK ELEME'!#REF!=\"\",'ERKEK ELEME'!#REF!=0,'ERKEK ELEME'!#REF!=1,'ERKEK ELEME'!#REF!=2),'ERKEK ELEME'!#REF!,'ERKEK ELEME'!#REF!)","v":{"$error":"#REF!"}},{"$f":"IFERROR(VLOOKUP(C76,KATILIM!D76:F364,3,0),\"\")","v":""},2]
[null,"65-128",{"$f":"IF(OR('ERKEK ELEME'!#REF!=\"\",'ERKEK ELEME'!#REF!=0,'ERKEK ELEME'!#REF!=1,'ERKEK ELEME'!#REF!=2),'ERKEK ELEME'!#REF!,'ERKEK ELEME'!#REF!)","v":{"$error":"#REF!"}},{"$f":"IFERROR(VLOOKUP(C77,KATILIM!D77:F365,3,0),\"\")","v":""},2]
[null,"65-128",{"$f":"IF(OR('ERKEK ELEME'!#REF!=\"\",'ERKEK ELEME'!#REF!=0,'ERKEK ELEME'!#REF!=1,'ERKEK ELEME'!#REF!=2),'ERKEK ELEME'!#REF!,'ERKEK ELEME'!#REF!)","v":{"$error":"#REF!"}},{"$f":"IFERROR(VLOOKUP(C78,KATILIM!D78:F366,3,0),\"\")","v":""},2]
[null,"65-128",{"$f":"IF(OR('ERKEK ELEME'!#REF!=\"\",'ERKEK ELEME'!#REF!=0,'ERKEK ELEME'!#REF!=1,'ERKEK ELEME'!#REF!=2),'ERKEK ELEME'!#REF!,'ERKEK ELEME'!#REF!)","v":{"$error":"#REF!"}},{"$f":"IFERROR(VLOOKUP(C79,KATILIM!D79:F367,3,0),\"\")","v":""},2]
[null,"65-128",{"$f":"IF(OR('ERKEK ELEME'!#REF!=\"\",'ERKEK ELEME'!#REF!=0,'ERKEK ELEME'!#REF!=1,'ERKEK ELEME'!#REF!=2),'ERKEK ELEME'!#REF!,'ERKEK ELEME'!#REF!)","v":{"$error":"#REF!"}},{"$f":"IFERROR(VLOOKUP(C80,KATILIM!D80:F368,3,0),\"\")","v":""},2]
[null,"65-128",{"$f":"IF(OR('ERKEK ELEME'!#REF!=\"\",'ERKEK ELEME'!#REF!=0,'ERKEK ELEME'!#REF!=1,'ERKEK ELEME'!#REF!=2),'ERKEK ELEME'!#REF!,'ERKEK ELEME'!#REF!)","v":{"$error":"#REF!"}},{"$f":"IFERROR(VLOOKUP(C81,KATILIM!D81:F369,3,0),\"\")","v":""},2]
[null,"65-128",{"$f":"IF(OR('ERKEK ELEME'!#REF!=\"\",'ERKEK ELEME'!#REF!=0,'ERKEK ELEME'!#REF!=1,'ERKEK ELEME'!#REF!=2),'ERKEK ELEME'!#REF!,'ERKEK ELEME'!#REF!)","v":{"$error":"#REF!"}},{"$f":"IFERROR(VLOOKUP(C82,KATILIM!D82:F370,3,0),\"\")","v":""},2]
[null,"65-128",{"$f":"IF(OR('ERKEK ELEME'!#REF!=\"\",'ERKEK ELEME'!#REF!=0,'ERKEK ELEME'!#REF!=1,'ERKEK ELEME'!#REF!=2),'ERKEK ELEME'!#REF!,'ERKEK ELEME'!#REF!)","v":{"$error":"#REF!"}},{"$f":"IFERROR(VLOOKUP(C83,KATILIM!D83:F371,3,0),\"\")","v":""},2]
[null,"65-128",{"$f":"IF(OR('ERKEK ELEME'!#REF!=\"\",'ERKEK ELEME'!#REF!=0,'ERKEK ELEME'!#REF!=1,'ERKEK ELEME'!#REF!=2),'ERKEK ELEME'!#REF!,'ERKEK ELEME'!#REF!)","v":{"$error":"#REF!"}},{"$f":"IFERROR(VLOOKUP(C84,KATILIM!D84:F372,3,0),\"\")","v":""},2]
[null,"65-128",{"$f":"IF(OR('ERKEK ELEME'!#REF!=\"\",'ERKEK ELEME'!#REF!=0,'ERKEK ELEME'!#REF!=1,'ERKEK ELEME'!#REF!=2),'ERKEK ELEME'!#REF!,'ERKEK ELEME'!#REF!)","v":{"$error":"#REF!"}},{"$f":"IFERROR(VLOOKUP(C85,KATILIM!D85:F373,3,0),\"\")","v":""},2]
[null,"65-128",{"$f":"IF(OR('ERKEK ELEME'!#REF!=\"\",'ERKEK ELEME'!#REF!=0,'ERKEK ELEME'!#REF!=1,'ERKEK ELEME'!#REF!=2),'ERKEK ELEME'!#REF!,'ERKEK ELEME'!#REF!)","v":{"$error":"#REF!"}},{"$f":"IFERROR(VLOOKUP(C86,KATILIM!D86:F374,3,0),\"\")","v":""},2]
[null,"65-128",{"$f":"IF(OR('ERKEK ELEME'!#REF!=\"\",'ERKEK ELEME'!#REF!=0,'ERKEK ELEME'!#REF!=1,'ERKEK ELEME'!#REF!=2),'ERKEK ELEME'!#REF!,'ERKEK ELEME'!#REF!)","v":{"$error":"#REF!"}},{"$f":"IFERROR(VLOOKUP(C87,KATILIM!D87:F375,3,0),\"\")","v":""},2]
[null,"65-128",{"$f":"IF(OR('ERKEK ELEME'!#REF!=\"\",'ERKEK ELEME'!#REF!=0,'ERKEK ELEME'!#REF!=1,'ERKEK ELEME'!#REF!=2),'ERKEK ELEME'!#REF!,'ERKEK ELEME'!#REF!)","v":{"$error":"#REF!"}},{"$f":"IFERROR(VLOOKUP(C88,KATILIM!D88:F376,3,0),\"\")","v":""},2]
[null,"65-128",{"$f":"IF(OR('ERKEK ELEME'!#REF!=\"\",'ERKEK ELEME'!#REF!=0,'ERKEK ELEME'!#REF!=1,'ERKEK ELEME'!#REF!=2),'ERKEK ELEME'!#REF!,'ERKEK ELEME'!#REF!)","v":{"$error":"#REF!"}},{"$f":"IFERROR(VLOOKUP(C89,KATILIM!D89:F377,3,0),\"\")","v":""},2]
[null,"65-128",{"$f":"IF(OR('ERKEK ELEME'!#REF!=\"\",'ERKEK ELEME'!#REF!=0,'ERKEK ELEME'!#REF!=1,'ERKEK ELEME'!#REF!=2),'ERKEK ELEME'!#REF!,'ERKEK ELEME'!#REF!)","v":{"$error":"#REF!"}},{"$f":"IFERROR(VLOOKUP(C90,KATILIM!D90:F378,3,0),\"\")","v":""},2]
[null,"65-128",{"$f":"IF(OR('ERKEK ELEME'!#REF!=\"\",'ERKEK ELEME'!#REF!=0,'ERKEK ELEME'!#REF!=1,'ERKEK ELEME'!#REF!=2),'ERKEK ELEME'!#REF!,'ERKEK ELEME'!#REF!)","v":{"$error":"#REF!"}},{"$f":"IFERROR(VLOOKUP(C91,KATILIM!D91:F379,3,0),\"\")","v":""},2]
[null,"65-128",{"$f":"IF(OR('ERKEK ELEME'!#REF!=\"\",'ERKEK ELEME'!#REF!=0,'ERKEK ELEME'!#REF!=1,'ERKEK ELEME'!#REF!=2),'ERKEK ELEME'!#REF!,'ERKEK ELEME'!#REF!)","v":{"$error":"#REF!"}},{"$f":"IFERROR(VLOOKUP(C92,KATILIM!D92:F380,3,0),\"\")","v":""},2]
[null,"65-128",{"$f":"IF(OR('ERKEK ELEME'!#REF!=\"\",'ERKEK ELEME'!#REF!=0,'ERKEK ELEME'!#REF!=1,'ERKEK ELEME'!#REF!=2),'ERKEK ELEME'!#REF!,'ERKEK ELEME'!#REF!)","v":{"$error":"#REF!"}},{"$f":"IFERROR(VLOOKUP(C93,KATILIM!D93:F381,3,0),\"\")","v":""},2]
[null,"65-128",{"$f":"IF(OR('ERKEK ELEME'!#REF!=\"\",'ERKEK ELEME'!#REF!=0,'ERKEK ELEME'!#REF!=1,'ERKEK ELEME'!#REF!=2),'ERKEK ELEME'!#REF!,'ERKEK ELEME'!#REF!)","v":{"$error":"#REF!"}},{"$f":"IFERROR(VLOOKUP(C94,KATILIM!D94:F382,3,0),\"\")","v":""},2]
[null,"65-128",{"$f":"IF(OR('ERKEK ELEME'!#REF!=\"\",'ERKEK ELEME'!#REF!=0,'ERKEK ELEME'!#REF!=1,'ERKEK ELEME'!#REF!=2),'ERKEK ELEME'!#REF!,'ERKEK ELEME'!#REF!)","v":{"$error":"#REF!"}},{"$f":"IFERROR(VLOOKUP(C95,KATILIM!D95:F383,3,0),\"\")","v":""},2]
[null,"65-128",{"$f":"IF(OR('ERKEK ELEME'!#REF!=\"\",'ERKEK ELEME'!#REF!=0,'ERKEK ELEME'!#REF!=1,'ERKEK ELEME'!#REF!=2),'ERKEK ELEME'!#REF!,'ERKEK ELEME'!#REF!)","v":{"$error":"#REF!"}},{"$f":"IFERROR(VLOOKUP(C96,KATILIM!D96:F384,3,0),\"\")","v":""},2]
[null,"65-128",{"$f":"IF(OR('ERKEK ELEME'!#REF!=\"\",'ERKEK ELEME'!#REF!=0,'ERKEK ELEME'!#REF!=1,'ERKEK ELEME'!#REF!=2),'ERKEK ELEME'!#REF!,'ERKEK ELEME'!#REF!)","v":{"$error":"#REF!"}},{"$f":"IFERROR(VLOOKUP(C97,KATILIM!D97:F385,3,0),\"\")","v":""},2]
[null,"65-128",{"$f":"IF(OR('ERKEK ELEME'!#REF!=\"\",'ERKEK ELEME'!#REF!=0,'ERKEK ELEME'!#REF!=1,'ERKEK ELEME'!#REF!=2),'ERKEK ELEME'!#REF!,'ERKEK ELEME'!#REF!)","v":{"$error":"#REF!"}},{"$f":"IFERROR(VLOOKUP(C98,KATILIM!D98:F386,3,0),\"\")","v":""},2]
[null,"65-128",{"$f":"IF(OR('ERKEK ELEME'!#REF!=\"\",'ERKEK ELEME'!#REF!=0,'ERKEK ELEME'!#REF!=1,'ERKEK ELEME'!#REF!=2),'ERKEK ELEME'!#REF!,'ERKEK ELEME'!#REF!)","v":{"$error":"#REF!"}},{"$f":"IFERROR(VLOOKUP(C99,KATILIM!D99:F387,3,0),\"\")","v":""},2]
[null,"65-128",{"$f":"IF(OR('ERKEK ELEME'!#REF!=\"\",'ERKEK ELEME'!#REF!=0,'ERKEK ELEME'!#REF!=1,'ERKEK ELEME'!#REF!=2),'ERKEK ELEME'!#REF!,'ERKEK ELEME'!#REF!)","v":{"$error":"#REF!"}},{"$f":"IFERROR(VLOOKUP(C100,KATILIM!D100:F388,3,0),\"\")","v":""},2]
[null,"65-128",{"$f":"IF(OR('ERKEK ELEME'!#REF!=\"\",'ERKEK ELEME'!#REF!=0,'ERKEK ELEME'!#REF!=1,'ERKEK ELEME'!#REF!=2),'ERKEK ELEME'!#REF!,'ERKEK ELEME'!#REF!)","v":{"$error":"#REF!"}},{"$f":"IFERROR(VLOOKUP(C101,KATILIM!D101:F389,3,0),\"\")","v":""},2]
[null,"65-128",{"$f":"IF(OR('ERKEK ELEME'!#REF!=\"\",'ERKEK ELEME'!#REF!=0,'ERKEK ELEME'!#REF!=1,'ERKEK ELEME'!#REF!=2),'ERKEK ELEME'!#REF!,'ERKEK ELEME'!#REF!)","v":{"$error":"#REF!"}},{"$f":"IFERROR(VLOOKUP(C102,KATILIM!D102:F390,3,0),\"\")","v":""},2]
[null,"65-128",{"$f":"IF(OR('ERKEK ELEME'!#REF!=\"\",'ERKEK ELEME'!#REF!=0,'ERKEK ELEME'!#REF!=1,'ERKEK ELEME'!#REF!=2),'ERKEK ELEME'!#REF!,'ERKEK ELEME'!#REF!)","v":{"$error":"#REF!"}},{"$f":"IFERROR(VLOOKUP(C103,KATILIM!D103:F391,3,0),\"\")","v":""},2]
[null,"65-128",{"$f":"IF(OR('ERKEK ELEME'!#REF!=\"\",'ERKEK ELEME'!#REF!=0,'ERKEK ELEME'!#REF!=1,'ERKEK ELEME'!#REF!=2),'ERKEK ELEME'!#REF!,'ERKEK ELEME'!#REF!)","v":{"$error":"#REF!"}},{"$f":"IFERROR(VLOOKUP(C104,KATILIM!D104:F392,3,0),\"\")","v":""},2]
[null,"65-128",{"$f":"IF(OR('ERKEK ELEME'!#REF!=\"\",'ERKEK ELEME'!#REF!=0,'ERKEK ELEME'!#REF!=1,'ERKEK ELEME'!#REF!=2),'ERKEK ELEME'!#REF!,'ERKEK ELEME'!#REF!)","v":{"$error":"#REF!"}},{"$f":"IFERROR(VLOOKUP(C105,KATILIM!D105:F393,3,0),\"\")","v":""},2]
[null,"65-128",{"$f":"IF(OR('ERKEK ELEME'!#REF!=\"\",'ERKEK ELEME'!#REF!=0,'ERKEK ELEME'!#REF!=1,'ERKEK ELEME'!#REF!=2),'ERKEK ELEME'!#REF!,'ERKEK ELEME'!#REF!)","v":{"$error":"#REF!"}},{"$f":"IFERROR(VLOOKUP(C106,KATILIM!D106:F394,3,0),\"\")","v":""},2]
[null,"65-128",{"$f":"IF(OR('ERKEK ELEME'!#REF!=\"\",'ERKEK ELEME'!#REF!=0,'ERKEK ELEME'!#REF!=1,'ERKEK ELEME'!#REF!=2),'ERKEK ELEME'!#REF!,'ERKEK ELEME'!#REF!)","v":{"$error":"#REF!"}},{"$f":"IFERROR(VLOOKUP(C107,KATILIM!D107:F395,3,0),\"\")","v":""},2]
[null,"65-128",{"$f":"IF(OR('ERKEK ELEME'!#REF!=\"\",'ERKEK ELEME'!#REF!=0,'ERKEK ELEME'!#REF!=1,'ERKEK ELEME'!#REF!=2),'ERKEK ELEME'!#REF!,'ERKEK ELEME'!#REF!)","v":{"$error":"#REF!"}},{"$f":"IFERROR(VLOOKUP(C108,KATILIM!D108:F396,3,0),\"\")","v":""},2]
[null,"65-128",{"$f":"IF(OR('ERKEK ELEME'!#REF!=\"\",'ERKEK ELEME'!#REF!=0,'ERKEK ELEME'!#REF!=1,'ERKEK ELEME'!#REF!=2),'ERKEK ELEME'!#REF!,'ERKEK ELEME'!#REF!)","v":{"$error":"#REF!"}},{"$f":"IFERROR(VLOOKUP(C109,KATILIM!D109:F397,3,0),\"\")","v":""},2]
[null,"65-128",{"$f":"IF(OR('ERKEK ELEME'!#REF!=\"\",'ERKEK ELEME'!#REF!=0,'ERKEK ELEME'!#REF!=1,'ERKEK ELEME'!#REF!=2),'ERKEK ELEME'!#REF!,'ERKEK ELEME'!#REF!)","v":{"$error":"#REF!"}},{"$f":"IFERROR(VLOOKUP(C110,KATILIM!D110:F398,3,0),\"\")","v":""},2]
[null,"65-128",{"$f":"IF(OR('ERKEK ELEME'!#REF!=\"\",'ERKEK ELEME'!#REF!=0,'ERKEK ELEME'!#REF!=1,'ERKEK ELEME'!#REF!=2),'ERKEK ELEME'!#REF!,'ERKEK ELEME'!#REF!)","v":{"$error":"#REF!"}},{"$f":"IFERROR(VLOOKUP(C111,KATILIM!D111:F399,3,0),\"\")","v":""},2]
[null,"65-128",{"$f":"IF(OR('ERKEK ELEME'!#REF!=\"\",'ERKEK ELEME'!#REF!=0,'ERKEK ELEME'!#REF!=1,'ERKEK ELEME'!#REF!=2),'ERKEK ELEME'!#REF!,'ERKEK ELEME'!#REF!)","v":{"$error":"#REF!"}},{"$f":"IFERROR(VLOOKUP(C112,KATILIM!D112:F400,3,0),\"\")","v":""},2]
[null,"65-128",{"$f":"IF(OR('ERKEK ELEME'!#REF!=\"\",'ERKEK ELEME'!#REF!=0,'ERKEK ELEME'!#REF!=1,'ERKEK ELEME'!#REF!=2),'ERKEK ELEME'!#REF!,'ERKEK ELEME'!#REF!)","v":{"$error":"#REF!"}},{"$f":"IFERROR(VLOOKUP(C113,KATILIM!D113:F401,3,0),\"\")","v":""},2]
[null,"65-128",{"$f":"IF(OR('ERKEK ELEME'!#REF!=\"\",'ERKEK ELEME'!#REF!=0,'ERKEK ELEME'!#REF!=1,'ERKEK ELEME'!#REF!=2),'ERKEK ELEME'!#REF!,'ERKEK ELEME'!#REF!)","v":{"$error":"#REF!"}},{"$f":"IFERROR(VLOOKUP(C114,KATILIM!D114:F402,3,0),\"\")","v":""},2]
[null,"65-128",{"$f":"IF(OR('ERKEK ELEME'!#REF!=\"\",'ERKEK ELEME'!#REF!=0,'ERKEK ELEME'!#REF!=1,'ERKEK ELEME'!#REF!=2),'ERKEK ELEME'!#REF!,'ERKEK ELEME'!#REF!)","v":{"$error":"#REF!"}},{"$f":"IFERROR(VLOOKUP(C115,KATILIM!D115:F403,3,0),\"\")","v":""},2]
[null,"65-128",{"$f":"IF(OR('ERKEK ELEME'!#REF!=\"\",'ERKEK ELEME'!#REF!=0,'ERKEK ELEME'!#REF!=1,'ERKEK ELEME'!#REF!=2),'ERKEK ELEME'!#REF!,'ERKEK ELEME'!#REF!)","v":{"$error":"#REF!"}},{"$f":"IFERROR(VLOOKUP(C116,KATILIM!D116:F404,3,0),\"\")","v":""},2]
[null,"65-128",{"$f":"IF(OR('ERKEK ELEME'!#REF!=\"\",'ERKEK ELEME'!#REF!=0,'ERKEK ELEME'!#REF!=1,'ERKEK ELEME'!#REF!=2),'ERKEK ELEME'!#REF!,'ERKEK ELEME'!#REF!)","v":{"$error":"#REF!"}},{"$f":"IFERROR(VLOOKUP(C117,KATILIM!D117:F405,3,0),\"\")","v":""},2]
[null,"65-128",{"$f":"IF(OR('ERKEK ELEME'!#REF!=\"\",'ERKEK ELEME'!#REF!=0,'ERKEK ELEME'!#REF!=1,'ERKEK ELEME'!#REF!=2),'ERKEK ELEME'!#REF!,'ERKEK ELEME'!#REF!)","v":{"$error":"#REF!"}},{"$f":"IFERROR(VLOOKUP(C118,KATILIM!D118:F406,3,0),\"\")","v":""},2]
[null,"65-128",{"$f":"IF(OR('ERKEK ELEME'!#REF!=\"\",'ERKEK ELEME'!#REF!=0,'ERKEK ELEME'!#REF!=1,'ERKEK ELEME'!#REF!=2),'ERKEK ELEME'!#REF!,'ERKEK ELEME'!#REF!)","v":{"$error":"#REF!"}},{"$f":"IFERROR(VLOOKUP(C119,KATILIM!D119:F407,3,0),\"\")","v":""},2]
[null,"65-128",{"$f":"IF(OR('ERKEK ELEME'!#REF!=\"\",'ERKEK ELEME'!#REF!=0,'ERKEK ELEME'!#REF!=1,'ERKEK ELEME'!#REF!=2),'ERKEK ELEME'!#REF!,'ERKEK ELEME'!#REF!)","v":{"$error":"#REF!"}},{"$f":"IFERROR(VLOOKUP(C120,KATILIM!D120:F408,3,0),\"\")","v":""},2]
[null,"65-128",{"$f":"IF(OR('ERKEK ELEME'!#REF!=\"\",'ERKEK ELEME'!#REF!=0,'ERKEK ELEME'!#REF!=1,'ERKEK ELEME'!#REF!=2),'ERKEK ELEME'!#REF!,'ERKEK ELEME'!#REF!)","v":{"$error":"#REF!"}},{"$f":"IFERROR(VLOOKUP(C121,KATILIM!D121:F409,3,0),\"\")","v":""},2]
[null,"65-128",{"$f":"IF(OR('ERKEK ELEME'!#REF!=\"\",'ERKEK ELEME'!#REF!=0,'ERKEK ELEME'!#REF!=1,'ERKEK ELEME'!#REF!=2),'ERKEK ELEME'!#REF!,'ERKEK ELEME'!#REF!)","v":{"$error":"#REF!"}},{"$f":"IFERROR(VLOOKUP(C122,KATILIM!D122:F410,3,0),\"\")","v":""},2]
[null,"65-128",{"$f":"IF(OR('ERKEK ELEME'!#REF!=\"\",'ERKEK ELEME'!#REF!=0,'ERKEK ELEME'!#REF!=1,'ERKEK ELEME'!#REF!=2),'ERKEK ELEME'!#REF!,'ERKEK ELEME'!#REF!)","v":{"$error":"#REF!"}},{"$f":"IFERROR(VLOOKUP(C123,KATILIM!D123:F411,3,0),\"\")","v":""},2]
[null,"65-128",{"$f":"IF(OR('ERKEK ELEME'!#REF!=\"\",'ERKEK ELEME'!#REF!=0,'ERKEK ELEME'!#REF!=1,'ERKEK ELEME'!#REF!=2),'ERKEK ELEME'!#REF!,'ERKEK ELEME'!#REF!)","v":{"$error":"#REF!"}},{"$f":"IFERROR(VLOOKUP(C124,KATILIM!D124:F412,3,0),\"\")","v":""},2]
[null,"65-128",{"$f":"IF(OR('ERKEK ELEME'!#REF!=\"\",'ERKEK ELEME'!#REF!=0,'ERKEK ELEME'!#REF!=1,'ERKEK ELEME'!#REF!=2),'ERKEK ELEME'!#REF!,'ERKEK ELEME'!#REF!)","v":{"$error":"#REF!"}},{"$f":"IFERROR(VLOOKUP(C125,KATILIM!D125:F413,3,0),\"\")","v":""},2]
[null,"65-128",{"$f":"IF(OR('ERKEK ELEME'!#REF!=\"\",'ERKEK ELEME'!#REF!=0,'ERKEK ELEME'!#REF!=1,'ERKEK ELEME'!#REF!=2),'ERKEK ELEME'!#REF!,'ERKEK ELEME'!#REF!)","v":{"$error":"#REF!"}},{"$f":"IFERROR(VLOOKUP(C126,KATILIM!D126:F414,3,0),\"\")","v":""},2]
[null,"65-128",{"$f":"IF(OR('ERKEK ELEME'!#REF!=\"\",'ERKEK ELEME'!#REF!=0,'ERKEK ELEME'!#REF!=1,'ERKEK ELEME'!#REF!=2),'ERKEK ELEME'!#REF!,'ERKEK ELEME'!#REF!)","v":{"$error":"#REF!"}},{"$f":"IFERROR(VLOOKUP(C127,KATILIM!D127:F415,3,0),\"\")","v":""},2]
[null,"65-128",{"$f":"IF(OR('ERKEK ELEME'!#REF!=\"\",'ERKEK ELEME'!#REF!=0,'ERKEK ELEME'!#REF!=1,'ERKEK ELEME'!#REF!=2),'ERKEK ELEME'!#REF!,'ERKEK ELEME'!#REF!)","v":{"$error":"#REF!"}},{"$f":"IFERROR(VLOOKUP(C128,KATILIM!D128:F416,3,0),\"\")","v":""},2]
[null,"65-128",{"$f":"IF(OR('ERKEK ELEME'!#REF!=\"\",'ERKEK ELEME'!#REF!=0,'ERKEK ELEME'!#REF!=1,'ERKEK ELEME'!#REF!=2),'ERKEK ELEME'!#REF!,'ERKEK ELEME'!#REF!)","v":{"$error":"#REF!"}},{"$f":"IFERROR(VLOOKUP(C129,KATILIM!D129:F417,3,0),\"\")","v":""},2]
[null,"65-128",{"$f":"IF(OR('ERKEK ELEME'!#REF!=\"\",'ERKEK ELEME'!#REF!=0,'ERKEK ELEME'!#REF!=1,'ERKEK ELEME'!#REF!=2),'ERKEK ELEME'!#REF!,'ERKEK ELEME'!#REF!)","v":{"$error":"#REF!"}},{"$f":"IFERROR(VLOOKUP(C130,KATILIM!D130:F418,3,0),\"\")","v":""},2]
[null,"65-128",{"$f":"IF(OR('ERKEK ELEME'!#REF!=\"\",'ERKEK ELEME'!#REF!=0,'ERKEK ELEME'!#REF!=1,'ERKEK ELEME'!#REF!=2),'ERKEK ELEME'!#REF!,'ERKEK ELEME'!#REF!)","v":{"$error":"#REF!"}},{"$f":"IFERROR(VLOOKUP(C131,KATILIM!D131:F419,3,0),\"\")","v":""},2]
["G1.3","129-256",{"$f":"IFERROR(VLOOKUP(A132,'ERKEK GRUP'!$N$5:$AF$1000,3,0),\"\")","v":""},{"$f":"IFERROR(VLOOKUP(C132,KATILIM!D132:F420,3,0),\"\")","v":""},1]
["G1.4","129-256",{"$f":"IFERROR(VLOOKUP(A133,'ERKEK GRUP'!$N$5:$AF$1000,3,0),\"\")","v":""},{"$f":"IFERROR(VLOOKUP(C133,KATILIM!D133:F421,3,0),\"\")","v":""},1]
["G2.3","129-256",{"$f":"IFERROR(VLOOKUP(A134,'ERKEK GRUP'!$N$5:$AF$1000,3,0),\"\")","v":""},{"$f":"IFERROR(VLOOKUP(C134,KATILIM!D134:F422,3,0),\"\")","v":""},1]
["G2.4","129-256",{"$f":"IFERROR(VLOOKUP(A135,'ERKEK GRUP'!$N$5:$AF$1000,3,0),\"\")","v":""},{"$f":"IFERROR(VLOOKUP(C135,KATILIM!D135:F423,3,0),\"\")","v":""},1]
["G3.3","129-256",{"$f":"IFERROR(VLOOKUP(A136,'ERKEK GRUP'!$N$5:$AF$1000,3,0),\"\")","v":""},{"$f":"IFERROR(VLOOKUP(C136,KATILIM!D136:F424,3,0),\"\")","v":""},1]
["G3.4","129-256",{"$f":"IFERROR(VLOOKUP(A137,'ERKEK GRUP'!$N$5:$AF$1000,3,0),\"\")","v":""},{"$f":"IFERROR(VLOOKUP(C137,KATILIM!D137:F425,3,0),\"\")","v":""},1]
["G4.3","129-256",{"$f":"IFERROR(VLOOKUP(A138,'ERKEK GRUP'!$N$5:$AF$1000,3,0),\"\")","v":""},{"$f":"IFERROR(VLOOKUP(C138,KATILIM!D138:F426,3,0),\"\")","v":""},1]
["G4.4","129-256",{"$f":"IFERROR(VLOOKUP(A139,'ERKEK GRUP'!$N$5:$AF$1000,3,0),\"\")","v":""},{"$f":"IFERROR(VLOOKUP(C139,KATILIM!D139:F427,3,0),\"\")","v":""},1]
["G5.3","129-256",{"$f":"IFERROR(VLOOKUP(A140,'ERKEK GRUP'!$N$5:$AF$1000,3,0),\"\")","v":""},{"$f":"IFERROR(VLOOKUP(C140,KATILIM!D140:F428,3,0),\"\")","v":""},1]
["G5.4","129-256",{"$f":"IFERROR(VLOOKUP(A141,'ERKEK GRUP'!$N$5:$AF$1000,3,0),\"\")","v":""},{"$f":"IFERROR(VLOOKUP(C141,KATILIM!D141:F429,3,0),\"\")","v":""},1]
["G6.3","129-256",{"$f":"IFERROR(VLOOKUP(A142,'ERKEK GRUP'!$N$5:$AF$1000,3,0),\"\")","v":""},{"$f":"IFERROR(VLOOKUP(C142,KATILIM!D142:F430,3,0),\"\")","v":""},1]
["G6.4","129-256",{"$f":"IFERROR(VLOOKUP(A143,'ERKEK GRUP'!$N$5:$AF$1000,3,0),\"\")","v":""},{"$f":"IFERROR(VLOOKUP(C143,KATILIM!D143:F431,3,0),\"\")","v":""},1]
["G7.3","129-256",{"$f":"IFERROR(VLOOKUP(A144,'ERKEK GRUP'!$N$5:$AF$1000,3,0),\"\")","v":""},{"$f":"IFERROR(VLOOKUP(C144,KATILIM!D144:F432,3,0),\"\")","v":""},1]
["G7.4","129-256",{"$f":"IFERROR(VLOOKUP(A145,'ERKEK GRUP'!$N$5:$AF$1000,3,0),\"\")","v":""},{"$f":"IFERROR(VLOOKUP(C145,KATILIM!D145:F433,3,0),\"\")","v":""},1]
["G8.3","129-256",{"$f":"IFERROR(VLOOKUP(A146,'ERKEK GRUP'!$N$5:$AF$1000,3,0),\"\")","v":""},{"$f":"IFERROR(VLOOKUP(C146,KATILIM!D146:F434,3,0),\"\")","v":""},1]
["G8.4","129-256",{"$f":"IFERROR(VLOOKUP(A147,'ERKEK GRUP'!$N$5:$AF$1000,3,0),\"\")","v":""},{"$f":"IFERROR(VLOOKUP(C147,KATILIM!D147:F435,3,0),\"\")","v":""},1]
["G9.3","129-256",{"$f":"IFERROR(VLOOKUP(A148,'ERKEK GRUP'!$N$5:$AF$1000,3,0),\"\")","v":""},{"$f":"IFERROR(VLOOKUP(C148,KATILIM!D148:F436,3,0),\"\")","v":""},1]
["G9.4","129-256",{"$f":"IFERROR(VLOOKUP(A149,'ERKEK GRUP'!$N$5:$AF$1000,3,0),\"\")","v":""},{"$f":"IFERROR(VLOOKUP(C149,KATILIM!D149:F437,3,0),\"\")","v":""},1]
["G10.3","129-256",{"$f":"IFERROR(VLOOKUP(A150,'ERKEK GRUP'!$N$5:$AF$1000,3,0),\"\")","v":""},{"$f":"IFERROR(VLOOKUP(C150,KATILIM!D150:F438,3,0),\"\")","v":""},1]
["G10.4","129-256",{"$f":"IFERROR(VLOOKUP(A151,'ERKEK GRUP'!$N$5:$AF$1000,3,0),\"\")","v":""},{"$f":"IFERROR(VLOOKUP(C151,KATILIM!D151:F439,3,0),\"\")","v":""},1]
["G11.3","129-256",{"$f":"IFERROR(VLOOKUP(A152,'ERKEK GRUP'!$N$5:$AF$1000,3,0),\"\")","v":""},{"$f":"IFERROR(VLOOKUP(C152,KATILIM!D152:F440,3,0),\"\")","v":""},1]
["G11.4","129-256",{"$f":"IFERROR(VLOOKUP(A153,'ERKEK GRUP'!$N$5:$AF$1000,3,0),\"\")","v":""},{"$f":"IFERROR(VLOOKUP(C153,KATILIM!D153:F441,3,0),\"\")","v":""},1]
["G12.3","129-256",{"$f":"IFERROR(VLOOKUP(A154,'ERKEK GRUP'!$N$5:$AF$1000,3,0),\"\")","v":""},{"$f":"IFERROR(VLOOKUP(C154,KATILIM!D154:F442,3,0),\"\")","v":""},1]
["G12.4","129-256",{"$f":"IFERROR(VLOOKUP(A155,'ERKEK GRUP'!$N$5:$AF$1000,3,0),\"\")","v":""},{"$f":"IFERROR(VLOOKUP(C155,KATILIM!D155:F443,3,0),\"\")","v":""},1]
["G13.3","129-256",{"$f":"IFERROR(VLOOKUP(A156,'ERKEK GRUP'!$N$5:$AF$1000,3,0),\"\")","v":""},{"$f":"IFERROR(VLOOKUP(C156,KATILIM!D156:F444,3,0),\"\")","v":""},1]
["G13.4","129-256",{"$f":"IFERROR(VLOOKUP(A157,'ERKEK GRUP'!$N$5:$AF$1000,3,0),\"\")","v":""},{"$f":"IFERROR(VLOOKUP(C157,KATILIM!D157:F445,3,0),\"\")","v":""},1]
["G14.3","129-256",{"$f":"IFERROR(VLOOKUP(A158,'ERKEK GRUP'!$N$5:$AF$1000,3,0),\"\")","v":""},{"$f":"IFERROR(VLOOKUP(C158,KATILIM!D158:F446,3,0),\"\")","v":""},1]
["G14.4","129-256",{"$f":"IFERROR(VLOOKUP(A159,'ERKEK GRUP'!$N$5:$AF$1000,3,0),\"\")","v":""},{"$f":"IFERROR(VLOOKUP(C159,KATILIM!D159:F447,3,0),\"\")","v":""},1]
["G15.3","129-256",{"$f":"IFERROR(VLOOKUP(A160,'ERKEK GRUP'!$N$5:$AF$1000,3,0),\"\")","v":""},{"$f":"IFERROR(VLOOKUP(C160,KATILIM!D160:F448,3,0),\"\")","v":""},1]
["G15.4","129-256",{"$f":"IFERROR(VLOOKUP(A161,'ERKEK GRUP'!$N$5:$AF$1000,3,0),\"\")","v":""},{"$f":"IFERROR(VLOOKUP(C161,KATILIM!D161:F449,3,0),\"\")","v":""},1]
["G16.3","129-256",{"$f":"IFERROR(VLOOKUP(A162,'ERKEK GRUP'!$N$5:$AF$1000,3,0),\"\")","v":""},{"$f":"IFERROR(VLOOKUP(C162,KATILIM!D162:F450,3,0),\"\")","v":""},1]
["G16.4","129-256",{"$f":"IFERROR(VLOOKUP(A163,'ERKEK GRUP'!$N$5:$AF$1000,3,0),\"\")","v":""},{"$f":"IFERROR(VLOOKUP(C163,KATILIM!D163:F451,3,0),\"\")","v":""},1]
["G17.3","129-256",{"$f":"IFERROR(VLOOKUP(A164,'ERKEK GRUP'!$N$5:$AF$1000,3,0),\"\")","v":""},{"$f":"IFERROR(VLOOKUP(C164,KATILIM!D164:F452,3,0),\"\")","v":""},1]
["G17.4","129-256",{"$f":"IFERROR(VLOOKUP(A165,'ERKEK GRUP'!$N$5:$AF$1000,3,0),\"\")","v":""},{"$f":"IFERROR(VLOOKUP(C165,KATILIM!D165:F453,3,0),\"\")","v":""},1]
["G18.3","129-256",{"$f":"IFERROR(VLOOKUP(A166,'ERKEK GRUP'!$N$5:$AF$1000,3,0),\"\")","v":""},{"$f":"IFERROR(VLOOKUP(C166,KATILIM!D166:F454,3,0),\"\")","v":""},1]
["G18.4","129-256",{"$f":"IFERROR(VLOOKUP(A167,'ERKEK GRUP'!$N$5:$AF$1000,3,0),\"\")","v":""},{"$f":"IFERROR(VLOOKUP(C167,KATILIM!D167:F455,3,0),\"\")","v":""},1]
["G19.3","129-256",{"$f":"IFERROR(VLOOKUP(A168,'ERKEK GRUP'!$N$5:$AF$1000,3,0),\"\")","v":""},{"$f":"IFERROR(VLOOKUP(C168,KATILIM!D168:F456,3,0),\"\")","v":""},1]
["G19.4","129-256",{"$f":"IFERROR(VLOOKUP(A169,'ERKEK GRUP'!$N$5:$AF$1000,3,0),\"\")","v":""},{"$f":"IFERROR(VLOOKUP(C169,KATILIM!D169:F457,3,0),\"\")","v":""},1]
["G20.3","129-256",{"$f":"IFERROR(VLOOKUP(A170,'ERKEK GRUP'!$N$5:$AF$1000,3,0),\"\")","v":""},{"$f":"IFERROR(VLOOKUP(C170,KATILIM!D170:F458,3,0),\"\")","v":""},1]
["G20.4","129-256",{"$f":"IFERROR(VLOOKUP(A171,'ERKEK GRUP'!$N$5:$AF$1000,3,0),\"\")","v":""},{"$f":"IFERROR(VLOOKUP(C171,KATILIM!D171:F459,3,0),\"\")","v":""},1]
["G21.3","129-256",{"$f":"IFERROR(VLOOKUP(A172,'ERKEK GRUP'!$N$5:$AF$1000,3,0),\"\")","v":""},{"$f":"IFERROR(VLOOKUP(C172,KATILIM!D172:F460,3,0),\"\")","v":""},1]
["G21.4","129-256",{"$f":"IFERROR(VLOOKUP(A173,'ERKEK GRUP'!$N$5:$AF$1000,3,0),\"\")","v":""},{"$f":"IFERROR(VLOOKUP(C173,KATILIM!D173:F461,3,0),\"\")","v":""},1]
["G22.3","129-256",{"$f":"IFERROR(VLOOKUP(A174,'ERKEK GRUP'!$N$5:$AF$1000,3,0),\"\")","v":""},{"$f":"IFERROR(VLOOKUP(C174,KATILIM!D174:F462,3,0),\"\")","v":""},1]
["G22.4","129-256",{"$f":"IFERROR(VLOOKUP(A175,'ERKEK GRUP'!$N$5:$AF$1000,3,0),\"\")","v":""},{"$f":"IFERROR(VLOOKUP(C175,KATILIM!D175:F463,3,0),\"\")","v":""},1]
["G23.3","129-256",{"$f":"IFERROR(VLOOKUP(A176,'ERKEK GRUP'!$N$5:$AF$1000,3,0),\"\")","v":""},{"$f":"IFERROR(VLOOKUP(C176,KATILIM!D176:F464,3,0),\"\")","v":""},1]
["G23.4","129-256",{"$f":"IFERROR(VLOOKUP(A177,'ERKEK GRUP'!$N$5:$AF$1000,3,0),\"\")","v":""},{"$f":"IFERROR(VLOOKUP(C177,KATILIM!D177:F465,3,0),\"\")","v":""},1]
["G24.3","129-256",{"$f":"IFERROR(VLOOKUP(A178,'ERKEK GRUP'!$N$5:$AF$1000,3,0),\"\")","v":""},{"$f":"IFERROR(VLOOKUP(C178,KATILIM!D178:F466,3,0),\"\")","v":""},1]
["G24.4","129-256",{"$f":"IFERROR(VLOOKUP(A179,'ERKEK GRUP'!$N$5:$AF$1000,3,0),\"\")","v":""},{"$f":"IFERROR(VLOOKUP(C179,KATILIM!D179:F467,3,0),\"\")","v":""},1]
["G25.3","129-256",{"$f":"IFERROR(VLOOKUP(A180,'ERKEK GRUP'!$N$5:$AF$1000,3,0),\"\")","v":""},{"$f":"IFERROR(VLOOKUP(C180,KATILIM!D180:F468,3,0),\"\")","v":""},1]
["G25.4","129-256",{"$f":"IFERROR(VLOOKUP(A181,'ERKEK GRUP'!$N$5:$AF$1000,3,0),\"\")","v":""},{"$f":"IFERROR(VLOOKUP(C181,KATILIM!D181:F469,3,0),\"\")","v":""},1]
["G26.3","129-256",{"$f":"IFERROR(VLOOKUP(A182,'ERKEK GRUP'!$N$5:$AF$1000,3,0),\"\")","v":""},{"$f":"IFERROR(VLOOKUP(C182,KATILIM!D182:F470,3,0),\"\")","v":""},1]
["G26.4","129-256",{"$f":"IFERROR(VLOOKUP(A183,'ERKEK GRUP'!$N$5:$AF$1000,3,0),\"\")","v":""},{"$f":"IFERROR(VLOOKUP(C183,KATILIM!D183:F471,3,0),\"\")","v":""},1]
["G27.3","129-256",{"$f":"IFERROR(VLOOKUP(A184,'ERKEK GRUP'!$N$5:$AF$1000,3,0),\"\")","v":""},{"$f":"IFERROR(VLOOKUP(C184,KATILIM!D184:F472,3,0),\"\")","v":""},1]
["G27.4","129-256",{"$f":"IFERROR(VLOOKUP(A185,'ERKEK GRUP'!$N$5:$AF$1000,3,0),\"\")","v":""},{"$f":"IFERROR(VLOOKUP(C185,KATILIM!D185:F473,3,0),\"\")","v":""},1]
["G28.3","129-256",{"$f":"IFERROR(VLOOKUP(A186,'ERKEK GRUP'!$N$5:$AF$1000,3,0),\"\")","v":""},{"$f":"IFERROR(VLOOKUP(C186,KATILIM!D186:F474,3,0),\"\")","v":""},1]
["G28.4","129-256",{"$f":"IFERROR(VLOOKUP(A187,'ERKEK GRUP'!$N$5:$AF$1000,3,0),\"\")","v":""},{"$f":"IFERROR(VLOOKUP(C187,KATILIM!D187:F475,3,0),\"\")","v":""},1]
["G29.3","129-256",{"$f":"IFERROR(VLOOKUP(A188,'ERKEK GRUP'!$N$5:$AF$1000,3,0),\"\")","v":""},{"$f":"IFERROR(VLOOKUP(C188,KATILIM!D188:F476,3,0),\"\")","v":""},1]
["G29.4","129-256",{"$f":"IFERROR(VLOOKUP(A189,'ERKEK GRUP'!$N$5:$AF$1000,3,0),\"\")","v":""},{"$f":"IFERROR(VLOOKUP(C189,KATILIM!D189:F477,3,0),\"\")","v":""},1]
["G30.3","129-256",{"$f":"IFERROR(VLOOKUP(A190,'ERKEK GRUP'!$N$5:$AF$1000,3,0),\"\")","v":""},{"$f":"IFERROR(VLOOKUP(C190,KATILIM!D190:F478,3,0),\"\")","v":""},1]
["G30.4","129-256",{"$f":"IFERROR(VLOOKUP(A191,'ERKEK GRUP'!$N$5:$AF$1000,3,0),\"\")","v":""},{"$f":"IFERROR(VLOOKUP(C191,KATILIM!D191:F479,3,0),\"\")","v":""},1]
["G31.3","129-256",{"$f":"IFERROR(VLOOKUP(A192,'ERKEK GRUP'!$N$5:$AF$1000,3,0),\"\")","v":""},{"$f":"IFERROR(VLOOKUP(C192,KATILIM!D192:F480,3,0),\"\")","v":""},1]
["G31.4","129-256",{"$f":"IFERROR(VLOOKUP(A193,'ERKEK GRUP'!$N$5:$AF$1000,3,0),\"\")","v":""},{"$f":"IFERROR(VLOOKUP(C193,KATILIM!D193:F481,3,0),\"\")","v":""},1]
["G32.3","129-256",{"$f":"IFERROR(VLOOKUP(A194,'ERKEK GRUP'!$N$5:$AF$1000,3,0),\"\")","v":""},{"$f":"IFERROR(VLOOKUP(C194,KATILIM!D194:F482,3,0),\"\")","v":""},1]
["G32.4","129-256",{"$f":"IFERROR(VLOOKUP(A195,'ERKEK GRUP'!$N$5:$AF$1000,3,0),\"\")","v":""},{"$f":"IFERROR(VLOOKUP(C195,KATILIM!D195:F483,3,0),\"\")","v":""},1]
["G33.3","129-256",{"$f":"IFERROR(VLOOKUP(A196,'ERKEK GRUP'!$N$5:$AF$1000,3,0),\"\")","v":""},{"$f":"IFERROR(VLOOKUP(C196,KATILIM!D196:F484,3,0),\"\")","v":""},1]
["G33.4","129-256",{"$f":"IFERROR(VLOOKUP(A197,'ERKEK GRUP'!$N$5:$AF$1000,3,0),\"\")","v":""},{"$f":"IFERROR(VLOOKUP(C197,KATILIM!D197:F485,3,0),\"\")","v":""},1]
["G34.3","129-256",{"$f":"IFERROR(VLOOKUP(A198,'ERKEK GRUP'!$N$5:$AF$1000,3,0),\"\")","v":""},{"$f":"IFERROR(VLOOKUP(C198,KATILIM!D198:F486,3,0),\"\")","v":""},1]
["G34.4","129-256",{"$f":"IFERROR(VLOOKUP(A199,'ERKEK GRUP'!$N$5:$AF$1000,3,0),\"\")","v":""},{"$f":"IFERROR(VLOOKUP(C199,KATILIM!D199:F487,3,0),\"\")","v":""},1]
["G35.3","129-256",{"$f":"IFERROR(VLOOKUP(A200,'ERKEK GRUP'!$N$5:$AF$1000,3,0),\"\")","v":""},{"$f":"IFERROR(VLOOKUP(C200,KATILIM!D200:F488,3,0),\"\")","v":""},1]
["G35.4","129-256",{"$f":"IFERROR(VLOOKUP(A201,'ERKEK GRUP'!$N$5:$AF$1000,3,0),\"\")","v":""},{"$f":"IFERROR(VLOOKUP(C201,KATILIM!D201:F489,3,0),\"\")","v":""},1]
["G36.3","129-256",{"$f":"IFERROR(VLOOKUP(A202,'ERKEK GRUP'!$N$5:$AF$1000,3,0),\"\")","v":""},{"$f":"IFERROR(VLOOKUP(C202,KATILIM!D202:F490,3,0),\"\")","v":""},1]
["G36.4","129-256",{"$f":"IFERROR(VLOOKUP(A203,'ERKEK GRUP'!$N$5:$AF$1000,3,0),\"\")","v":""},{"$f":"IFERROR(VLOOKUP(C203,KATILIM!D203:F491,3,0),\"\")","v":""},1]
["G37.3","129-256",{"$f":"IFERROR(VLOOKUP(A204,'ERKEK GRUP'!$N$5:$AF$1000,3,0),\"\")","v":""},{"$f":"IFERROR(VLOOKUP(C204,KATILIM!D204:F492,3,0),\"\")","v":""},1]
["G37.4","129-256",{"$f":"IFERROR(VLOOKUP(A205,'ERKEK GRUP'!$N$5:$AF$1000,3,0),\"\")","v":""},{"$f":"IFERROR(VLOOKUP(C205,KATILIM!D205:F493,3,0),\"\")","v":""},1]
["G38.3","129-256",{"$f":"IFERROR(VLOOKUP(A206,'ERKEK GRUP'!$N$5:$AF$1000,3,0),\"\")","v":""},{"$f":"IFERROR(VLOOKUP(C206,KATILIM!D206:F494,3,0),\"\")","v":""},1]
["G38.4","129-256",{"$f":"IFERROR(VLOOKUP(A207,'ERKEK GRUP'!$N$5:$AF$1000,3,0),\"\")","v":""},{"$f":"IFERROR(VLOOKUP(C207,KATILIM!D207:F495,3,0),\"\")","v":""},1]
["G39.3","129-256",{"$f":"IFERROR(VLOOKUP(A208,'ERKEK GRUP'!$N$5:$AF$1000,3,0),\"\")","v":""},{"$f":"IFERROR(VLOOKUP(C208,KATILIM!D208:F496,3,0),\"\")","v":""},1]
["G39.4","129-256",{"$f":"IFERROR(VLOOKUP(A209,'ERKEK GRUP'!$N$5:$AF$1000,3,0),\"\")","v":""},{"$f":"IFERROR(VLOOKUP(C209,KATILIM!D209:F497,3,0),\"\")","v":""},1]
["G40.3","129-256",{"$f":"IFERROR(VLOOKUP(A210,'ERKEK GRUP'!$N$5:$AF$1000,3,0),\"\")","v":""},{"$f":"IFERROR(VLOOKUP(C210,KATILIM!D210:F498,3,0),\"\")","v":""},1]
["G40.4","129-256",{"$f":"IFERROR(VLOOKUP(A211,'ERKEK GRUP'!$N$5:$AF$1000,3,0),\"\")","v":""},{"$f":"IFERROR(VLOOKUP(C211,KATILIM!D211:F499,3,0),\"\")","v":""},1]
["G41.3","129-256",{"$f":"IFERROR(VLOOKUP(A212,'ERKEK GRUP'!$N$5:$AF$1000,3,0),\"\")","v":""},{"$f":"IFERROR(VLOOKUP(C212,KATILIM!D212:F500,3,0),\"\")","v":""},1]
["G41.4","129-256",{"$f":"IFERROR(VLOOKUP(A213,'ERKEK GRUP'!$N$5:$AF$1000,3,0),\"\")","v":""},{"$f":"IFERROR(VLOOKUP(C213,KATILIM!D213:F501,3,0),\"\")","v":""},1]
["G42.3","129-256",{"$f":"IFERROR(VLOOKUP(A214,'ERKEK GRUP'!$N$5:$AF$1000,3,0),\"\")","v":""},{"$f":"IFERROR(VLOOKUP(C214,KATILIM!D214:F502,3,0),\"\")","v":""},1]
["G42.4","129-256",{"$f":"IFERROR(VLOOKUP(A215,'ERKEK GRUP'!$N$5:$AF$1000,3,0),\"\")","v":""},{"$f":"IFERROR(VLOOKUP(C215,KATILIM!D215:F503,3,0),\"\")","v":""},1]
["G43.3","129-256",{"$f":"IFERROR(VLOOKUP(A216,'ERKEK GRUP'!$N$5:$AF$1000,3,0),\"\")","v":""},{"$f":"IFERROR(VLOOKUP(C216,KATILIM!D216:F504,3,0),\"\")","v":""},1]
["G43.4","129-256",{"$f":"IFERROR(VLOOKUP(A217,'ERKEK GRUP'!$N$5:$AF$1000,3,0),\"\")","v":""},{"$f":"IFERROR(VLOOKUP(C217,KATILIM!D217:F505,3,0),\"\")","v":""},1]
["G44.3","129-256",{"$f":"IFERROR(VLOOKUP(A218,'ERKEK GRUP'!$N$5:$AF$1000,3,0),\"\")","v":""},{"$f":"IFERROR(VLOOKUP(C218,KATILIM!D218:F506,3,0),\"\")","v":""},1]
["G44.4","129-256",{"$f":"IFERROR(VLOOKUP(A219,'ERKEK GRUP'!$N$5:$AF$1000,3,0),\"\")","v":""},{"$f":"IFERROR(VLOOKUP(C219,KATILIM!D219:F507,3,0),\"\")","v":""},1]
["G45.3","129-256",{"$f":"IFERROR(VLOOKUP(A220,'ERKEK GRUP'!$N$5:$AF$1000,3,0),\"\")","v":""},{"$f":"IFERROR(VLOOKUP(C220,KATILIM!D220:F508,3,0),\"\")","v":""},1]
["G45.4","129-256",{"$f":"IFERROR(VLOOKUP(A221,'ERKEK GRUP'!$N$5:$AF$1000,3,0),\"\")","v":""},{"$f":"IFERROR(VLOOKUP(C221,KATILIM!D221:F509,3,0),\"\")","v":""},1]
["G46.3","129-256",{"$f":"IFERROR(VLOOKUP(A222,'ERKEK GRUP'!$N$5:$AF$1000,3,0),\"\")","v":""},{"$f":"IFERROR(VLOOKUP(C222,KATILIM!D222:F510,3,0),\"\")","v":""},1]
["G46.4","129-256",{"$f":"IFERROR(VLOOKUP(A223,'ERKEK GRUP'!$N$5:$AF$1000,3,0),\"\")","v":""},{"$f":"IFERROR(VLOOKUP(C223,KATILIM!D223:F511,3,0),\"\")","v":""},1]
["G47.3","129-256",{"$f":"IFERROR(VLOOKUP(A224,'ERKEK GRUP'!$N$5:$AF$1000,3,0),\"\")","v":""},{"$f":"IFERROR(VLOOKUP(C224,KATILIM!D224:F512,3,0),\"\")","v":""},1]
["G47.4","129-256",{"$f":"IFERROR(VLOOKUP(A225,'ERKEK GRUP'!$N$5:$AF$1000,3,0),\"\")","v":""},{"$f":"IFERROR(VLOOKUP(C225,KATILIM!D225:F513,3,0),\"\")","v":""},1]
["G48.3","129-256",{"$f":"IFERROR(VLOOKUP(A226,'ERKEK GRUP'!$N$5:$AF$1000,3,0),\"\")","v":""},{"$f":"IFERROR(VLOOKUP(C226,KATILIM!D226:F514,3,0),\"\")","v":""},1]
["G48.4","129-256",{"$f":"IFERROR(VLOOKUP(A227,'ERKEK GRUP'!$N$5:$AF$1000,3,0),\"\")","v":""},{"$f":"IFERROR(VLOOKUP(C227,KATILIM!D227:F515,3,0),\"\")","v":""},1]
["G49.3","129-256",{"$f":"IFERROR(VLOOKUP(A228,'ERKEK GRUP'!$N$5:$AF$1000,3,0),\"\")","v":""},{"$f":"IFERROR(VLOOKUP(C228,KATILIM!D228:F516,3,0),\"\")","v":""},1]
["G49.4","129-256",{"$f":"IFERROR(VLOOKUP(A229,'ERKEK GRUP'!$N$5:$AF$1000,3,0),\"\")","v":""},{"$f":"IFERROR(VLOOKUP(C229,KATILIM!D229:F517,3,0),\"\")","v":""},1]
["G50.3","129-256",{"$f":"IFERROR(VLOOKUP(A230,'ERKEK GRUP'!$N$5:$AF$1000,3,0),\"\")","v":""},{"$f":"IFERROR(VLOOKUP(C230,KATILIM!D230:F518,3,0),\"\")","v":""},1]
["G50.4","129-256",{"$f":"IFERROR(VLOOKUP(A231,'ERKEK GRUP'!$N$5:$AF$1000,3,0),\"\")","v":""},{"$f":"IFERROR(VLOOKUP(C231,KATILIM!D231:F519,3,0),\"\")","v":""},1]
["G51.3","129-256",{"$f":"IFERROR(VLOOKUP(A232,'ERKEK GRUP'!$N$5:$AF$1000,3,0),\"\")","v":""},{"$f":"IFERROR(VLOOKUP(C232,KATILIM!D232:F520,3,0),\"\")","v":""},1]
["G51.4","129-256",{"$f":"IFERROR(VLOOKUP(A233,'ERKEK GRUP'!$N$5:$AF$1000,3,0),\"\")","v":""},{"$f":"IFERROR(VLOOKUP(C233,KATILIM!D233:F521,3,0),\"\")","v":""},1]
["G52.3","129-256",{"$f":"IFERROR(VLOOKUP(A234,'ERKEK GRUP'!$N$5:$AF$1000,3,0),\"\")","v":""},{"$f":"IFERROR(VLOOKUP(C234,KATILIM!D234:F522,3,0),\"\")","v":""},1]
["G52.4","129-256",{"$f":"IFERROR(VLOOKUP(A235,'ERKEK GRUP'!$N$5:$AF$1000,3,0),\"\")","v":""},{"$f":"IFERROR(VLOOKUP(C235,KATILIM!D235:F523,3,0),\"\")","v":""},1]
["G53.3","129-256",{"$f":"IFERROR(VLOOKUP(A236,'ERKEK GRUP'!$N$5:$AF$1000,3,0),\"\")","v":""},{"$f":"IFERROR(VLOOKUP(C236,KATILIM!D236:F524,3,0),\"\")","v":""},1]
["G53.4","129-256",{"$f":"IFERROR(VLOOKUP(A237,'ERKEK GRUP'!$N$5:$AF$1000,3,0),\"\")","v":""},{"$f":"IFERROR(VLOOKUP(C237,KATILIM!D237:F525,3,0),\"\")","v":""},1]
["G54.3","129-256",{"$f":"IFERROR(VLOOKUP(A238,'ERKEK GRUP'!$N$5:$AF$1000,3,0),\"\")","v":""},{"$f":"IFERROR(VLOOKUP(C238,KATILIM!D238:F526,3,0),\"\")","v":""},1]
["G54.4","129-256",{"$f":"IFERROR(VLOOKUP(A239,'ERKEK GRUP'!$N$5:$AF$1000,3,0),\"\")","v":""},{"$f":"IFERROR(VLOOKUP(C239,KATILIM!D239:F527,3,0),\"\")","v":""},1]
["G55.3","129-256",{"$f":"IFERROR(VLOOKUP(A240,'ERKEK GRUP'!$N$5:$AF$1000,3,0),\"\")","v":""},{"$f":"IFERROR(VLOOKUP(C240,KATILIM!D240:F528,3,0),\"\")","v":""},1]
["G55.4","129-256",{"$f":"IFERROR(VLOOKUP(A241,'ERKEK GRUP'!$N$5:$AF$1000,3,0),\"\")","v":""},{"$f":"IFERROR(VLOOKUP(C241,KATILIM!D241:F529,3,0),\"\")","v":""},1]
["G56.3","129-256",{"$f":"IFERROR(VLOOKUP(A242,'ERKEK GRUP'!$N$5:$AF$1000,3,0),\"\")","v":""},{"$f":"IFERROR(VLOOKUP(C242,KATILIM!D242:F530,3,0),\"\")","v":""},1]
["G56.4","129-256",{"$f":"IFERROR(VLOOKUP(A243,'ERKEK GRUP'!$N$5:$AF$1000,3,0),\"\")","v":""},{"$f":"IFERROR(VLOOKUP(C243,KATILIM!D243:F531,3,0),\"\")","v":""},1]
["G57.3","129-256",{"$f":"IFERROR(VLOOKUP(A244,'ERKEK GRUP'!$N$5:$AF$1000,3,0),\"\")","v":""},{"$f":"IFERROR(VLOOKUP(C244,KATILIM!D244:F532,3,0),\"\")","v":""},1]
["G57.4","129-256",{"$f":"IFERROR(VLOOKUP(A245,'ERKEK GRUP'!$N$5:$AF$1000,3,0),\"\")","v":""},{"$f":"IFERROR(VLOOKUP(C245,KATILIM!D245:F533,3,0),\"\")","v":""},1]
["G58.3","129-256",{"$f":"IFERROR(VLOOKUP(A246,'ERKEK GRUP'!$N$5:$AF$1000,3,0),\"\")","v":""},{"$f":"IFERROR(VLOOKUP(C246,KATILIM!D246:F534,3,0),\"\")","v":""},1]
["G58.4","129-256",{"$f":"IFERROR(VLOOKUP(A247,'ERKEK GRUP'!$N$5:$AF$1000,3,0),\"\")","v":""},{"$f":"IFERROR(VLOOKUP(C247,KATILIM!D247:F535,3,0),\"\")","v":""},1]
["G59.3","129-256",{"$f":"IFERROR(VLOOKUP(A248,'ERKEK GRUP'!$N$5:$AF$1000,3,0),\"\")","v":""},{"$f":"IFERROR(VLOOKUP(C248,KATILIM!D248:F536,3,0),\"\")","v":""},1]
["G59.4","129-256",{"$f":"IFERROR(VLOOKUP(A249,'ERKEK GRUP'!$N$5:$AF$1000,3,0),\"\")","v":""},{"$f":"IFERROR(VLOOKUP(C249,KATILIM!D249:F537,3,0),\"\")","v":""},1]
["G60.3","129-256",{"$f":"IFERROR(VLOOKUP(A250,'ERKEK GRUP'!$N$5:$AF$1000,3,0),\"\")","v":""},{"$f":"IFERROR(VLOOKUP(C250,KATILIM!D250:F538,3,0),\"\")","v":""},1]
["G60.4","129-256",{"$f":"IFERROR(VLOOKUP(A251,'ERKEK GRUP'!$N$5:$AF$1000,3,0),\"\")","v":""},{"$f":"IFERROR(VLOOKUP(C251,KATILIM!D251:F539,3,0),\"\")","v":""},1]
["G61.3","129-256",{"$f":"IFERROR(VLOOKUP(A252,'ERKEK GRUP'!$N$5:$AF$1000,3,0),\"\")","v":""},{"$f":"IFERROR(VLOOKUP(C252,KATILIM!D252:F540,3,0),\"\")","v":""},1]
["G61.4","129-256",{"$f":"IFERROR(VLOOKUP(A253,'ERKEK GRUP'!$N$5:$AF$1000,3,0),\"\")","v":""},{"$f":"IFERROR(VLOOKUP(C253,KATILIM!D253:F541,3,0),\"\")","v":""},1]
["G62.3","129-256",{"$f":"IFERROR(VLOOKUP(A254,'ERKEK GRUP'!$N$5:$AF$1000,3,0),\"\")","v":""},{"$f":"IFERROR(VLOOKUP(C254,KATILIM!D254:F542,3,0),\"\")","v":""},1]
["G62.4","129-256",{"$f":"IFERROR(VLOOKUP(A255,'ERKEK GRUP'!$N$5:$AF$1000,3,0),\"\")","v":""},{"$f":"IFERROR(VLOOKUP(C255,KATILIM!D255:F543,3,0),\"\")","v":""},1]
["G63.3","129-256",{"$f":"IFERROR(VLOOKUP(A256,'ERKEK GRUP'!$N$5:$AF$1000,3,0),\"\")","v":""},{"$f":"IFERROR(VLOOKUP(C256,KATILIM!D256:F544,3,0),\"\")","v":""},1]
["G63.4","129-256",{"$f":"IFERROR(VLOOKUP(A257,'ERKEK GRUP'!$N$5:$AF$1000,3,0),\"\")","v":""},{"$f":"IFERROR(VLOOKUP(C257,KATILIM!D257:F545,3,0),\"\")","v":""},1]
["G64.3","129-256",{"$f":"IFERROR(VLOOKUP(A258,'ERKEK GRUP'!$N$5:$AF$1000,3,0),\"\")","v":""},{"$f":"IFERROR(VLOOKUP(C258,KATILIM!D258:F546,3,0),\"\")","v":""},1]
["G64.4","129-256",{"$f":"IFERROR(VLOOKUP(A259,'ERKEK GRUP'!$N$5:$AF$1000,3,0),\"\")","v":""},{"$f":"IFERROR(VLOOKUP(C259,KATILIM!D259:F547,3,0),\"\")","v":""},1]

{"sheet":"5_Mac","index":16,"n_rows":76,"n_cols":44,"rows_kept":76,"cut":false,"hidden":true,"merged":[[0,40,0,41],[0,42,0,43],[1,21,2,28],[1,29,2,31],[1,32,2,34],[1,35,2,37],[1,38,2,39],[1,40,2,41],[1,42,2,43],[0,21,0,28],[0,29,0,31],[0,32,0,34],[0,35,0,37],[0,38,0,39],[4,27,5,41],[4,42,5,42],[4,43,5,43],[6,25,7,26],[6,27,7,41],[6,42,7,42],[3,21,3,22],[3,23,3,24],[3,25,3,26],[3,27,3,41],[6,43,7,43],[0,0,7,20],[8,30,9,39],[8,40,9,41],[8,42,9,43],[10,3,10,13],[10,17,10,28],[10,30,10,31],[10,32,10,33],[10,34,10,35],[10,36,10,37],[10,38,10,39],[8,0,10,0],[8,1,10,1],[8,2,10,2],[8,3,9,13],[8,14,10,14],[8,15,10,15],[8,16,10,16],[8,17,9,28],[8,29,10,29],[3,42,3,43],[4,21,7,22],[4,23,7,24],[4,25,5,26],[10,40,10,41],[10,42,10,43],[11,0,13,0],[11,1,13,1],[11,3,13,13],[11,14,13,14],[11,15,13,15],[11,17,13,28],[11,29,13,29],[17,0,19,0],[17,1,19,1],[17,3,19,13],[17,14,19,14],[17,15,19,15],[17,17,19,28],[17,29,19,29],[14,29,16,29],[14,0,16,0],[14,1,16,1],[14,3,16,13],[14,14,16,14],[14,15,16,15],[14,17,16,28],[23,29,25,29],[20,29,22,29],[20,0,22,0],[20,1,22,1],[26,0,26,4],[26,15,26,19],[26,30,27,39],[27,0,27,4],[27,5,27,6],[27,7,27,8],[27,9,27,10],[27,11,27,12],[20,3,22,13],[20,14,22,14],[20,15,22,15],[20,17,22,28],[23,0,25,0],[23,1,25,1],[23,3,25,13],[23,14,25,14],[23,15,25,15],[23,17,25,28],[29,11,29,12],[29,13,29,14],[27,28,27,29],[28,0,28,4],[28,5,28,6],[28,7,28,8],[28,9,28,10],[28,11,28,12],[28,13,28,14],[28,15,28,19],[28,20,28,21],[28,22,28,23],[27,13,27,14],[27,15,27,19],[27,20,27,21],[27,22,27,23],[27,24,27,25],[27,26,27,27],[29,15,29,19],[29,20,29,21],[29,22,29,23],[29,24,29,25],[29,26,29,27],[29,28,29,29],[28,24,28,25],[28,26,28,27],[28,28,28,29],[30,33,31,43],[31,0,31,4],[31,5,31,7],[31,10,31,12],[31,15,31,19],[31,20,31,22],[31,25,31,27],[30,15,30,19],[30,20,30,21],[30,22,30,23],[30,24,30,25],[30,26,30,27],[30,28,30,29],[30,0,30,4],[30,5,30,6],[30,7,30,8],[30,9,30,10],[30,11,30,12],[30,13,30,14],[28,30,31,32],[29,0,29,4],[29,5,29,6],[29,7,29,8],[29,9,29,10],[32,30,32,36],[32,37,32,43],[33,30,36,36],[33,37,36,43],[39,0,46,20],[39,21,39,28],[39,29,39,31],[39,32,39,34],[39,35,39,37],[39,38,39,39],[39,40,39,41],[39,42,39,43],[40,21,41,28],[40,29,41,31],[40,32,41,34],[40,35,41,37],[40,38,41,39],[40,40,41,41],[40,42,41,43],[42,21,42,22],[42,23,42,24],[42,25,42,26],[42,27,42,41],[42,42,42,43],[43,21,46,22],[43,23,46,24],[43,25,44,26],[43,27,44,41],[43,42,44,42],[43,43,44,43],[45,25,46,26],[45,27,46,41],[45,42,46,42],[45,43,46,43],[47,42,48,43],[49,3,49,13],[49,17,49,28],[49,30,49,31],[49,32,49,33],[49,34,49,35],[49,36,49,37],[49,38,49,39],[49,40,49,41],[49,42,49,43],[47,15,49,15],[47,16,49,16],[47,17,48,28],[47,29,49,29],[47,30,48,39],[47,40,48,41],[53,29,55,29],[50,29,52,29],[50,0,52,0],[50,1,52,1],[50,3,52,13],[50,14,52,14],[50,15,52,15],[50,17,52,28],[47,0,49,0],[47,1,49,1],[47,2,49,2],[47,3,48,13],[47,14,49,14],[59,14,61,14],[59,15,61,15],[59,17,61,28],[53,0,55,0],[53,1,55,1],[53,3,55,13],[53,14,55,14],[53,15,55,15],[53,17,55,28],[59,29,61,29],[56,29,58,29],[56,0,58,0],[56,1,58,1],[65,0,65,4],[65,15,65,19],[65,30,66,39],[66,0,66,4],[66,5,66,6],[66,7,66,8],[62,29,64,29],[62,0,64,0],[62,1,64,1],[62,3,64,13],[62,14,64,14],[62,15,64,15],[62,17,64,28],[56,3,58,13],[56,14,58,14],[56,15,58,15],[56,17,58,28],[59,0,61,0],[59,1,61,1],[59,3,61,13],[67,0,67,4],[67,5,67,6],[67,7,67,8],[67,9,67,10],[67,11,67,12],[67,13,67,14],[67,15,67,19],[66,9,66,10],[66,11,66,12],[66,13,66,14],[66,15,66,19],[67,20,67,21],[67,22,67,23],[67,24,67,25],[67,26,67,27],[67,28,67,29],[67,30,70,32],[66,24,66,25],[66,26,66,27],[66,28,66,29],[66,20,66,21],[66,22,66,23],[68,15,68,19],[68,20,68,21],[68,22,68,23],[68,24,68,25],[68,26,68,27],[68,28,68,29],[68,0,68,4],[68,5,68,6],[68,7,68,8],[68,9,68,10],[68,11,68,12],[68,13,68,14],[71,30,71,36],[71,37,71,43],[72,30,75,36],[72,37,75,43],[69,33,70,43],[70,0,70,4],[70,5,70,7],[70,10,70,12],[70,15,70,19],[70,20,70,22],[70,25,70,27],[69,15,69,19],[69,20,69,21],[69,22,69,23],[69,24,69,25],[69,26,69,27],[69,28,69,29],[69,0,69,4],[69,5,69,6],[69,7,69,8],[69,9,69,10],[69,11,69,12],[69,13,69,14]]}
["TÜRKİYE\nMASA TENİSİ FEDERASYONU\nYARIŞMA CETVELİ 5 Maçlık Sistem\n(Yeni swaythling kupa sistemi, 5 Tek)",null,null,null,null,null,null,null,null,null,null,null,null,null,null,null,null,null,null,null,null,"Yarışma Adı",null,null,null,null,null,null,null,"Yeri",null,null,"Tarih",null,null,"Saat",null,null,"Grup",null,"Maç No",null,"Masa"]
[]
[]
[null,null,null,null,null,null,null,null,null,null,null,null,null,null,null,null,null,null,null,null,null,"Erkek",null,"Kadın",null,"Galip",null,"Takımlar",null,null,null,null,null,null,null,null,null,null,null,null,null,null,"Kura"]
[null,null,null,null,null,null,null,null,null,null,null,null,null,null,null,null,null,null,null,null,null,null,null,null,null,null,null,null,null,null,null,null,null,null,null,null,null,null,null,null,null,null,"A","X"]
[]
[null,null,null,null,null,null,null,null,null,null,null,null,null,null,null,null,null,null,null,null,null,null,null,null,null,null,null,null,null,null,null,null,null,null,null,null,null,null,null,null,null,null,"A","X"]
[]
["Maç No","Kura","Lisans No","A-",null,null,null,null,null,null,null,null,null,null,"Mola","Kura","Lisans No","X-",null,null,null,null,null,null,null,null,null,null,null,"Mola","Sayılar",null,null,null,null,null,null,null,null,null,"Setler",null,"Puan"]
[]
[null,null,null,"Sporcular",null,null,null,null,null,null,null,null,null,null,null,null,null,"Sporcular",null,null,null,null,null,null,null,null,null,null,null,null,"1.Set",null,"2.Set",null,"3.Set",null,"4.Set",null,"5.Set",null,"A / X",null,"A / X"]
[1,"A",null,null,null,null,null,null,null,null,null,null,null,null,null,"X"]
[]
[]
[2,"B",null,null,null,null,null,null,null,null,null,null,null,null,null,"Y"]
[]
[]
[3,"C",null,null,null,null,null,null,null,null,null,null,null,null,null,"Z"]
[]
[]
[4,"A",null,null,null,null,null,null,null,null,null,null,null,null,null,"Y"]
[]
[]
[5,"B",null,null,null,null,null,null,null,null,null,null,null,null,null,"X"]
[]
[]
["Forma Rengi",null,null,null,null,null,null,null,null,null,null,null,null,null,null,"Forma Rengi",null,null,null,null,null,null,null,null,null,null,null,null,null,null,"Toplam"]
["Kart\\Oyuncuya",null,null,null,null,1,null,2,null,3,null,4,null,5,null,"Kart\\Oyuncuya",null,null,null,null,1,null,2,null,3,null,4,null,5]
["Sarı",null,null,null,null,null,null,null,null,null,null,null,null,null,null,"Sarı",null,null,null,null,null,null,null,null,null,null,null,null,null,null,"Galip"]
["1. Sarı + Kırmızı",null,null,null,null,null,null,null,null,null,null,null,null,null,null,"1. Sarı + Kırmızı"]
["2. Sarı + Kırmızı",null,null,null,null,null,null,null,null,null,null,null,null,null,null,"2. Sarı + Kırmızı",null,null,null,null,null,null,null,null,null,null,null,null,null,null,null,null,null,{"$f":"\"(  \"&#REF!&\"  -     )\"","v":{"$error":"#REF!"}}]
["Kart\\Öğütücüye",null,null,null,null,"Sarı",null,null,null,null,"Kırmızı",null,null,null,null,"Kart\\Öğütücüye",null,null,null,null,"Sarı",null,null,null,null,"Kırmızı"]
["Kaptan",null,null,null,null,null,null,null,null,null,null,null,null,null,null,"Kaptan",null,null,null,null,null,null,null,null,null,null,null,null,null,null,"Hakemler",null,null,null,null,null,null,"Baş Hakem"]
["Adı Soyadı",null,null,null,":",null,null,null,null,null,null,null,null,null,null,"Adı Soyadı",null,null,null,":"]
["İmza",null,null,null,":",null,null,null,null,null,null,null,null,null,null,"İmza",null,null,null,":"]
[]
["Başlama Saati",null,null,null,null,":",null,null,null,null,null,null,null,null,null,"Bitiş Saati",null,null,null,null,":"]
[]
[]
["TÜRKİYE\nMASA TENİSİ FEDERASYONU\nYARIŞMA CETVELİ 5 Maçlık Sistem\n(Yeni swaythling kupa sistemi, 5 Tek)",null,null,null,null,null,null,null,null,null,null,null,null,null,null,null,null,null,null,null,null,"Yarışma Adı",null,null,null,null,null,null,null,"Yeri",null,null,"Tarih",null,null,"Saat",null,null,"Grup",null,"Maç No",null,"Masa"]
[]
[]
[null,null,null,null,null,null,null,null,null,null,null,null,null,null,null,null,null,null,null,null,null,"Erkek",null,"Kadın",null,"Galip",null,"Takımlar",null,null,null,null,null,null,null,null,null,null,null,null,null,null,"Kura"]
[null,null,null,null,null,null,null,null,null,null,null,null,null,null,null,null,null,null,null,null,null,null,null,null,null,null,null,null,null,null,null,null,null,null,null,null,null,null,null,null,null,null,"A","X"]
[]
[null,null,null,null,null,null,null,null,null,null,null,null,null,null,null,null,null,null,null,null,null,null,null,null,null,null,null,null,null,null,null,null,null,null,null,null,null,null,null,null,null,null,"A","X"]
[]
["Maç No","Kura","Lisans No","A-",null,null,null,null,null,null,null,null,null,null,"Mola","Kura","Lisans No","X-",null,null,null,null,null,null,null,null,null,null,null,"Mola","Sayılar",null,null,null,null,null,null,null,null,null,"Setler",null,"Puan"]
[]
[null,null,null,"Sporcular",null,null,null,null,null,null,null,null,null,null,null,null,null,"Sporcular",null,null,null,null,null,null,null,null,null,null,null,null,"1.Set",null,"2.Set",null,"3.Set",null,"4.Set",null,"5.Set",null,"A / X",null,"A / X"]
[1,"A",null,null,null,null,null,null,null,null,null,null,null,null,null,"X"]
[]
[]
[2,"B",null,null,null,null,null,null,null,null,null,null,null,null,null,"Y"]
[]
[]
[3,"C",null,null,null,null,null,null,null,null,null,null,null,null,null,"Z"]
[]
[]
[4,"A",null,null,null,null,null,null,null,null,null,null,null,null,null,"Y"]
[]
[]
[5,"B",null,null,null,null,null,null,null,null,null,null,null,null,null,"X"]
[]
[]
["Forma Rengi",null,null,null,null,null,null,null,null,null,null,null,null,null,null,"Forma Rengi",null,null,null,null,null,null,null,null,null,null,null,null,null,null,"Toplam"]
["Kart\\Oyuncuya",null,null,null,null,1,null,2,null,3,null,4,null,5,null,"Kart\\Oyuncuya",null,null,null,null,1,null,2,null,3,null,4,null,5]
["Sarı",null,null,null,null,null,null,null,null,null,null,null,null,null,null,"Sarı",null,null,null,null,null,null,null,null,null,null,null,null,null,null,"Galip"]
["1. Sarı + Kırmızı",null,null,null,null,null,null,null,null,null,null,null,null,null,null,"1. Sarı + Kırmızı"]
["2. Sarı + Kırmızı",null,null,null,null,null,null,null,null,null,null,null,null,null,null,"2. Sarı + Kırmızı",null,null,null,null,null,null,null,null,null,null,null,null,null,null,null,null,null,{"$f":"\"(  \"&#REF!&\"  -     )\"","v":{"$error":"#REF!"}}]
["Kart\\Öğütücüye",null,null,null,null,"Sarı",null,null,null,null,"Kırmızı",null,null,null,null,"Kart\\Öğütücüye",null,null,null,null,"Sarı",null,null,null,null,"Kırmızı"]
["Kaptan",null,null,null,null,null,null,null,null,null,null,null,null,null,null,"Kaptan",null,null,null,null,null,null,null,null,null,null,null,null,null,null,"Hakemler",null,null,null,null,null,null,"Baş Hakem"]
["Adı Soyadı",null,null,null,":",null,null,null,null,null,null,null,null,null,null,"Adı Soyadı",null,null,null,":"]
["İmza",null,null,null,":",null,null,null,null,null,null,null,null,null,null,"İmza",null,null,null,":"]
[]
["Başlama Saati",null,null,null,null,":",null,null,null,null,null,null,null,null,null,"Bitiş Saati",null,null,null,null,":"]

{"sheet":"Olimpik","index":17,"n_rows":75,"n_cols":44,"rows_kept":75,"cut":false,"hidden":true,"merged":[[0,40,0,41],[0,42,0,43],[3,21,3,22],[3,23,3,24],[3,25,3,26],[3,27,3,41],[3,42,3,43],[0,0,7,20],[0,21,0,28],[0,29,0,31],[0,32,0,34],[0,35,0,37],[0,38,0,39],[1,21,2,28],[1,29,2,31],[1,32,2,34],[1,35,2,37],[1,38,2,39],[1,40,2,41],[1,42,2,43],[4,23,7,24],[4,25,5,26],[6,25,7,26],[8,40,9,41],[8,42,9,43],[10,38,10,39],[4,42,5,42],[4,43,5,43],[6,42,7,42],[6,43,7,43],[8,0,10,0],[8,1,10,1],[8,2,10,2],[8,3,9,13],[8,14,10,14],[8,15,10,15],[10,3,10,13],[10,17,10,28],[10,30,10,31],[10,32,10,33],[10,34,10,35],[10,36,10,37],[8,16,10,16],[8,17,9,28],[8,29,10,29],[8,30,9,39],[4,21,7,22],[14,0,16,0],[14,1,16,1],[14,3,16,13],[14,14,16,14],[14,15,16,15],[14,17,16,28],[14,29,16,29],[11,29,13,29],[11,0,13,0],[11,1,13,1],[11,3,13,13],[11,14,13,14],[11,15,13,15],[11,17,13,28],[28,15,28,19],[28,20,28,21],[28,22,28,23],[28,24,28,25],[28,26,28,27],[28,28,28,29],[25,0,25,4],[25,15,25,19],[25,30,26,39],[26,0,26,4],[26,5,26,6],[26,7,26,8],[26,9,26,10],[26,11,26,12],[27,24,27,25],[27,26,27,27],[27,28,27,29],[26,28,26,29],[17,0,18,0],[17,29,18,29],[27,5,27,6],[27,7,27,8],[27,9,27,10],[27,11,27,12],[27,13,27,14],[27,15,27,19],[27,20,27,21],[27,22,27,23],[26,13,26,14],[26,15,26,19],[26,20,26,21],[26,22,26,23],[19,0,21,0],[26,24,26,25],[26,26,26,27],[22,0,24,0],[22,1,24,1],[22,3,24,13],[22,14,24,14],[22,15,24,15],[22,17,24,28],[22,29,24,29],[29,33,30,43],[30,0,30,4],[30,5,30,7],[30,10,30,12],[30,15,30,19],[30,20,30,22],[30,25,30,27],[29,15,29,19],[29,20,29,21],[29,22,29,23],[29,24,29,25],[29,26,29,27],[29,28,29,29],[29,0,29,4],[29,5,29,6],[29,7,29,8],[29,9,29,10],[29,11,29,12],[29,13,29,14],[27,30,30,32],[28,0,28,4],[28,11,28,12],[28,13,28,14],[27,0,27,4],[39,40,39,41],[39,42,39,43],[42,21,42,22],[42,23,42,24],[42,25,42,26],[42,27,42,41],[42,42,42,43],[31,30,31,36],[31,37,31,43],[32,30,35,36],[32,37,35,43],[39,21,39,28],[39,29,39,31],[39,32,39,34],[39,35,39,37],[39,38,39,39],[40,21,41,28],[40,29,41,31],[40,32,41,34],[40,35,41,37],[40,38,41,39],[40,40,41,41],[40,42,41,43],[47,40,48,41],[47,42,48,43],[49,38,49,39],[43,42,44,42],[43,43,44,43],[45,42,46,42],[45,43,46,43],[47,0,49,0],[47,1,49,1],[47,2,49,2],[47,3,48,13],[47,14,49,14],[47,15,49,15],[39,0,46,20],[49,3,49,13],[49,17,49,28],[49,30,49,31],[49,32,49,33],[49,34,49,35],[49,36,49,37],[47,16,49,16],[47,17,48,28],[47,29,49,29],[47,30,48,39],[50,0,52,0],[50,1,52,1],[50,3,52,13],[50,14,52,14],[50,15,52,15],[50,17,52,28],[64,0,64,4],[64,15,64,19],[64,30,65,39],[65,0,65,4],[65,5,65,6],[65,7,65,8],[65,9,65,10],[65,11,65,12],[65,28,65,29],[65,13,65,14],[65,15,65,19],[65,20,65,21],[65,22,65,23],[65,24,65,25],[65,26,65,27],[53,0,55,0],[53,1,55,1],[53,3,55,13],[67,24,67,25],[67,26,67,27],[67,28,67,29],[66,24,66,25],[66,26,66,27],[66,28,66,29],[66,0,66,4],[66,5,66,6],[66,7,66,8],[66,9,66,10],[66,11,66,12],[66,13,66,14],[66,15,66,19],[66,20,66,21],[66,22,66,23],[67,0,67,4],[67,5,67,6],[67,7,67,8],[67,9,67,10],[67,11,67,12],[67,13,67,14],[67,15,67,19],[67,20,67,21],[67,22,67,23],[68,13,68,14],[71,30,74,36],[71,37,74,43],[68,33,69,43],[69,0,69,4],[69,5,69,7],[69,10,69,12],[69,15,69,19],[69,20,69,22],[69,25,69,27],[68,15,68,19],[68,20,68,21],[68,22,68,23],[68,24,68,25],[68,26,68,27],[68,28,68,29],[68,0,68,4],[68,5,68,6],[68,7,68,8],[68,9,68,10],[68,11,68,12],[70,30,70,36],[70,37,70,43],[66,30,69,32],[61,0,63,0],[61,1,63,1],[61,3,63,13],[61,14,63,14],[61,15,63,15],[61,17,63,28],[61,29,63,29],[58,0,60,0],[58,1,60,1],[58,3,60,13],[58,14,60,14],[58,15,60,15],[58,17,60,28],[58,29,60,29],[56,0,57,0],[56,29,57,29],[43,21,46,22],[43,23,46,24],[43,25,44,26],[45,25,46,26],[4,27,5,41],[6,27,7,41],[43,27,44,41],[45,27,46,41],[53,14,55,14],[53,15,55,15],[53,17,55,28],[53,29,55,29],[19,1,21,1],[19,3,21,13],[19,14,21,14],[19,15,21,15],[19,17,21,28],[19,29,21,29],[50,29,52,29],[28,5,28,6],[28,7,28,8],[28,9,28,10]]}
["          TÜRKİYE\n          MASA TENİSİ FEDERASYONU\n          YARIŞMA CETVELİ\n          Olimpik Sistem (4 Tek, 1 Çift)",null,null,null,null,null,null,null,null,null,null,null,null,null,null,null,null,null,null,null,null,"Yarışma Adı",null,null,null,null,null,null,null,"Yeri",null,null,"Tarih",null,null,"Saat",null,null,"Etap",null,"Maç No",null,"Masa"]
[]
[]
[null,null,null,null,null,null,null,null,null,null,null,null,null,null,null,null,null,null,null,null,null,"Erkek",null,"Bayan",null,"Galip",null,"Takımlar",null,null,null,null,null,null,null,null,null,null,null,null,null,null,"Kura"]
[null,null,null,null,null,null,null,null,null,null,null,null,null,null,null,null,null,null,null,null,null,null,null,null,null,null,null,null,null,null,null,null,null,null,null,null,null,null,null,null,null,null,"A","X"]
[]
[null,null,null,null,null,null,null,null,null,null,null,null,null,null,null,null,null,null,null,null,null,null,null,null,null,null,null,null,null,null,null,null,null,null,null,null,null,null,null,null,null,null,"A","X"]
[]
["Maç No","Kura","Lisans No","A-",null,null,null,null,null,null,null,null,null,null,"Mola","Kura","Lisans No","X-",null,null,null,null,null,null,null,null,null,null,null,"Mola","Sayılar",null,null,null,null,null,null,null,null,null,"Setler",null,"Puan"]
[]
[null,null,null,"Sporcular",null,null,null,null,null,null,null,null,null,null,null,null,null,"Sporcular",null,null,null,null,null,null,null,null,null,null,null,null,"1.Set",null,"2.Set",null,"3.Set",null,"4.Set",null,"5.Set",null,"A","X","A","X"]
[1,"A",null,null,null,null,null,null,null,null,null,null,null,null,null,"X"]
[]
[]
[2,"B",null,null,null,null,null,null,null,null,null,null,null,null,null,"Y"]
[]
[]
[3,"C",null,null,null,null,null,null,null,null,null,null,null,null,null,"Z"]
[null,"A\nB",null,null,null,null,null,null,null,null,null,null,null,null,null,"X\nY"]
[4,"B\nA",null,null,null,null,null,null,null,null,null,null,null,null,null,"Z"]
[]
[]
[5,"C",null,null,null,null,null,null,null,null,null,null,null,null,null,"Y\nX"]
[]
[]
["Forma Rengi",null,null,null,null,null,null,null,null,null,null,null,null,null,null,"Forma Rengi",null,null,null,null,null,null,null,null,null,null,null,null,null,null,"Toplam"]
["Kart\\Oyuncuya",null,null,null,null,1,null,2,null,3,null,4,null,5,null,"Kart\\Oyuncuya",null,null,null,null,1,null,2,null,3,null,4,null,5]
["Sarı",null,null,null,null,null,null,null,null,null,null,null,null,null,null,"Sarı",null,null,null,null,null,null,null,null,null,null,null,null,null,null,"Galip"]
["1. Sarı + Kırmızı",null,null,null,null,null,null,null,null,null,null,null,null,null,null,"1. Sarı + Kırmızı"]
["2. Sarı + Kırmızı",null,null,null,null,null,null,null,null,null,null,null,null,null,null,"2. Sarı + Kırmızı",null,null,null,null,null,null,null,null,null,null,null,null,null,null,null,null,null,{"$f":"\"(  \"&#REF!&\"  -     )\"","v":{"$error":"#REF!"}}]
["Kart\\Öğütücüye",null,null,null,null,"Sarı",null,null,null,null,"Kırmızı",null,null,null,null,"Kart\\Öğütücüye",null,null,null,null,"Sarı",null,null,null,null,"Kırmızı"]
["Kaptan",null,null,null,null,null,null,null,null,null,null,null,null,null,null,"Kaptan",null,null,null,null,null,null,null,null,null,null,null,null,null,null,"Hakemler",null,null,null,null,null,null,"Baş Hakem"]
["Adı Soyadı",null,null,null,":",null,null,null,null,null,null,null,null,null,null,"Adı Soyadı",null,null,null,":"]
["İmza",null,null,null,":",null,null,null,null,null,null,null,null,null,null,"İmza",null,null,null,":"]
[]
["Başlama Saati",null,null,null,null,":",null,null,null,null,null,null,null,null,null,"Bitiş Saati",null,null,null,null,":"]
[]
[]
[]
["          TÜRKİYE\n          MASA TENİSİ FEDERASYONU\n          YARIŞMA CETVELİ\n          Olimpik Sistem (4 Tek, 1 Çift)",null,null,null,null,null,null,null,null,null,null,null,null,null,null,null,null,null,null,null,null,"Yarışma Adı",null,null,null,null,null,null,null,"Yeri",null,null,"Tarih",null,null,"Saat",null,null,"Etap",null,"Maç No",null,"Masa"]
[]
[]
[null,null,null,null,null,null,null,null,null,null,null,null,null,null,null,null,null,null,null,null,null,"Erkek",null,"Bayan",null,"Galip",null,"Takımlar",null,null,null,null,null,null,null,null,null,null,null,null,null,null,"Kura"]
[null,null,null,null,null,null,null,null,null,null,null,null,null,null,null,null,null,null,null,null,null,null,null,null,null,null,null,null,null,null,null,null,null,null,null,null,null,null,null,null,null,null,"A","X"]
[]
[null,null,null,null,null,null,null,null,null,null,null,null,null,null,null,null,null,null,null,null,null,null,null,null,null,null,null,null,null,null,null,null,null,null,null,null,null,null,null,null,null,null,"A","X"]
[]
["Maç No","Kura","Lisans No","A-",null,null,null,null,null,null,null,null,null,null,"Mola","Kura","Lisans No","X-",null,null,null,null,null,null,null,null,null,null,null,"Mola","Sayılar",null,null,null,null,null,null,null,null,null,"Setler",null,"Puan"]
[]
[null,null,null,"Sporcular",null,null,null,null,null,null,null,null,null,null,null,null,null,"Sporcular",null,null,null,null,null,null,null,null,null,null,null,null,"1.Set",null,"2.Set",null,"3.Set",null,"4.Set",null,"5.Set",null,"A","X","A","X"]
[1,"A",null,null,null,null,null,null,null,null,null,null,null,null,null,"X"]
[]
[]
[2,"B",null,null,null,null,null,null,null,null,null,null,null,null,null,"Y"]
[]
[]
[3,"C",null,null,null,null,null,null,null,null,null,null,null,null,null,"Z"]
[null,"A\nB",null,null,null,null,null,null,null,null,null,null,null,null,null,"X\nY"]
[4,"B\nA",null,null,null,null,null,null,null,null,null,null,null,null,null,"Z"]
[]
[]
[5,"C",null,null,null,null,null,null,null,null,null,null,null,null,null,"Y\nX"]
[]
[]
["Forma Rengi",null,null,null,null,null,null,null,null,null,null,null,null,null,null,"Forma Rengi",null,null,null,null,null,null,null,null,null,null,null,null,null,null,"Toplam"]
["Kart\\Oyuncuya",null,null,null,null,1,null,2,null,3,null,4,null,5,null,"Kart\\Oyuncuya",null,null,null,null,1,null,2,null,3,null,4,null,5]
["Sarı",null,null,null,null,null,null,null,null,null,null,null,null,null,null,"Sarı",null,null,null,null,null,null,null,null,null,null,null,null,null,null,"Galip"]
["1. Sarı + Kırmızı",null,null,null,null,null,null,null,null,null,null,null,null,null,null,"1. Sarı + Kırmızı"]
["2. Sarı + Kırmızı",null,null,null,null,null,null,null,null,null,null,null,null,null,null,"2. Sarı + Kırmızı",null,null,null,null,null,null,null,null,null,null,null,null,null,null,null,null,null,{"$f":"\"(  \"&#REF!&\"  -     )\"","v":{"$error":"#REF!"}}]
["Kart\\Öğütücüye",null,null,null,null,"Sarı",null,null,null,null,"Kırmızı",null,null,null,null,"Kart\\Öğütücüye",null,null,null,null,"Sarı",null,null,null,null,"Kırmızı"]
["Kaptan",null,null,null,null,null,null,null,null,null,null,null,null,null,null,"Kaptan",null,null,null,null,null,null,null,null,null,null,null,null,null,null,"Hakemler",null,null,null,null,null,null,"Baş Hakem"]
["Adı Soyadı",null,null,null,":",null,null,null,null,null,null,null,null,null,null,"Adı Soyadı",null,null,null,":"]
["İmza",null,null,null,":",null,null,null,null,null,null,null,null,null,null,"İmza",null,null,null,":"]
[]
["Başlama Saati",null,null,null,null,":",null,null,null,null,null,null,null,null,null,"Bitiş Saati",null,null,null,null,":"]

{"sheet":"Yeni_Olimpik","index":18,"n_rows":75,"n_cols":44,"rows_kept":75,"cut":false,"hidden":true,"merged":[[0,40,0,41],[0,42,0,43],[3,21,3,22],[3,23,3,24],[3,25,3,26],[3,27,3,41],[3,42,3,43],[0,0,7,20],[0,21,0,28],[0,29,0,31],[0,32,0,34],[0,35,0,37],[0,38,0,39],[1,32,2,34],[1,35,2,37],[1,38,2,39],[1,40,2,41],[1,42,2,43],[1,29,2,31],[1,21,2,28],[4,21,7,22],[4,23,7,24],[4,25,5,26],[6,25,7,26],[8,0,10,0],[8,1,10,1],[8,2,10,2],[8,3,9,13],[8,14,10,14],[8,15,10,15],[8,40,9,41],[8,42,9,43],[10,38,10,39],[4,42,5,42],[4,43,5,43],[6,42,7,42],[6,43,7,43],[6,27,7,41],[4,27,5,41],[10,36,10,37],[10,3,10,13],[10,17,10,28],[10,30,10,31],[10,32,10,33],[10,34,10,35],[8,16,10,16],[8,17,9,28],[8,29,10,29],[8,30,9,39],[14,0,16,0],[14,1,16,1],[14,3,16,13],[14,14,16,14],[14,15,16,15],[14,17,16,28],[14,29,16,29],[11,29,13,29],[11,0,13,0],[11,1,13,1],[11,3,13,13],[11,14,13,14],[11,15,13,15],[11,17,13,28],[23,0,24,0],[23,1,24,1],[23,14,24,14],[23,15,24,15],[23,29,24,29],[17,0,19,0],[17,1,19,1],[17,3,19,13],[17,14,19,14],[17,15,19,15],[17,17,19,28],[20,0,22,0],[20,1,22,1],[20,3,22,13],[20,14,22,14],[20,15,22,15],[20,17,22,28],[17,29,19,29],[20,29,22,29],[25,0,25,4],[25,15,25,19],[25,30,26,39],[26,0,26,4],[26,5,26,6],[26,7,26,8],[26,9,26,10],[26,11,26,12],[27,30,30,32],[28,0,28,4],[28,5,28,6],[28,7,28,8],[28,9,28,10],[28,11,28,12],[28,13,28,14],[26,28,26,29],[27,0,27,4],[27,5,27,6],[27,7,27,8],[27,9,27,10],[27,11,27,12],[27,13,27,14],[27,15,27,19],[27,20,27,21],[26,13,26,14],[26,15,26,19],[26,20,26,21],[26,22,26,23],[26,24,26,25],[26,26,26,27],[29,13,29,14],[28,15,28,19],[28,20,28,21],[28,22,28,23],[28,24,28,25],[28,26,28,27],[29,24,29,25],[29,26,29,27],[28,28,28,29],[27,24,27,25],[27,26,27,27],[27,28,27,29],[39,0,46,20],[39,21,39,28],[39,29,39,31],[39,32,39,34],[39,35,39,37],[42,21,42,22],[42,23,42,24],[42,25,42,26],[42,27,42,41],[27,22,27,23],[29,33,30,43],[30,0,30,4],[30,5,30,7],[30,10,30,12],[30,15,30,19],[30,20,30,22],[30,25,30,27],[29,15,29,19],[29,20,29,21],[29,22,29,23],[29,28,29,29],[29,0,29,4],[29,5,29,6],[29,7,29,8],[29,9,29,10],[29,11,29,12],[47,0,49,0],[47,1,49,1],[47,2,49,2],[47,3,48,13],[47,14,49,14],[47,15,49,15],[49,3,49,13],[42,42,42,43],[31,30,31,36],[31,37,31,43],[32,30,35,36],[32,37,35,43],[40,21,41,28],[40,29,41,31],[40,32,41,34],[40,35,41,37],[40,38,41,39],[40,40,41,41],[40,42,41,43],[39,38,39,39],[39,40,39,41],[39,42,39,43],[50,29,52,29],[47,16,49,16],[47,17,48,28],[47,29,49,29],[47,30,48,39],[49,32,49,33],[49,34,49,35],[49,17,49,28],[49,30,49,31],[49,36,49,37],[49,38,49,39],[64,30,65,39],[65,0,65,4],[65,5,65,6],[65,7,65,8],[65,9,65,10],[65,11,65,12],[59,14,61,14],[59,15,61,15],[62,0,63,0],[62,1,63,1],[62,14,63,14],[62,15,63,15],[59,0,61,0],[59,1,61,1],[59,3,61,13],[65,28,65,29],[65,13,65,14],[65,15,65,19],[65,20,65,21],[65,22,65,23],[65,24,65,25],[65,26,65,27],[67,0,67,4],[67,5,67,6],[67,7,67,8],[67,9,67,10],[67,11,67,12],[67,13,67,14],[66,0,66,4],[66,5,66,6],[66,7,66,8],[66,9,66,10],[66,11,66,12],[66,13,66,14],[69,0,69,4],[69,5,69,7],[69,10,69,12],[69,15,69,19],[69,20,69,22],[69,25,69,27],[68,15,68,19],[68,20,68,21],[68,22,68,23],[68,24,68,25],[68,26,68,27],[68,0,68,4],[68,5,68,6],[68,7,68,8],[68,9,68,10],[68,11,68,12],[66,20,66,21],[50,0,52,0],[50,1,52,1],[50,3,52,13],[64,0,64,4],[64,15,64,19],[50,14,52,14],[50,15,52,15],[50,17,52,28],[47,40,48,41],[68,13,68,14],[71,30,74,36],[71,37,74,43],[66,30,69,32],[68,33,69,43],[53,29,55,29],[70,30,70,36],[70,37,70,43],[68,28,68,29],[53,17,55,28],[67,22,67,23],[67,24,67,25],[67,26,67,27],[67,28,67,29],[66,24,66,25],[66,26,66,27],[66,28,66,29],[59,17,61,28],[62,29,63,29],[59,29,61,29],[67,15,67,19],[67,20,67,21],[66,15,66,19],[47,42,48,43],[66,22,66,23],[43,42,44,42],[43,43,44,43],[45,42,46,42],[45,43,46,43],[56,0,58,0],[56,1,58,1],[56,3,58,13],[56,14,58,14],[56,15,58,15],[56,17,58,28],[53,0,55,0],[53,1,55,1],[53,3,55,13],[53,14,55,14],[53,15,55,15],[56,29,58,29],[43,27,44,41],[45,27,46,41],[43,21,46,22],[43,23,46,24],[43,25,44,26],[45,25,46,26]]}
["          TÜRKİYE\n          MASA TENİSİ FEDERASYONU\n          YARIŞMA CETVELİ\n          Yeni Olimpik Sistem (4 Tek, 1 Çift)",null,null,null,null,null,null,null,null,null,null,null,null,null,null,null,null,null,null,null,null,"Yarışma Adı",null,null,null,null,null,null,null,"Yeri",null,null,"Tarih",null,null,"Saat",null,null,"Etap",null,"Maç No",null,"Masa"]
[]
[]
[null,null,null,null,null,null,null,null,null,null,null,null,null,null,null,null,null,null,null,null,null,"Erkek",null,"Bayan",null,"Galip",null,"Takımlar",null,null,null,null,null,null,null,null,null,null,null,null,null,null,"Kura"]
[null,null,null,null,null,null,null,null,null,null,null,null,null,null,null,null,null,null,null,null,null,null,null,null,null,null,null,null,null,null,null,null,null,null,null,null,null,null,null,null,null,null,"A","X"]
[]
[null,null,null,null,null,null,null,null,null,null,null,null,null,null,null,null,null,null,null,null,null,null,null,null,null,null,null,null,null,null,null,null,null,null,null,null,null,null,null,null,null,null,"A","X"]
[]
["Maç No","Kura","Lisans No","A-",null,null,null,null,null,null,null,null,null,null,"Mola","Kura","Lisans No","X-",null,null,null,null,null,null,null,null,null,null,null,"Mola","Sayılar",null,null,null,null,null,null,null,null,null,"Setler",null,"Puan"]
[]
[null,null,null,"Sporcular",null,null,null,null,null,null,null,null,null,null,null,null,null,"Sporcular",null,null,null,null,null,null,null,null,null,null,null,null,"1.Set",null,"2.Set",null,"3.Set",null,"4.Set",null,"5.Set",null,"A","X","A","X"]
[1,"A",null,null,null,null,null,null,null,null,null,null,null,null,null,"X"]
[]
[]
[2,"B",null,null,null,null,null,null,null,null,null,null,null,null,null,"Y"]
[]
[]
[3,"C",null,null,null,null,null,null,null,null,null,null,null,null,null,"Z"]
[]
[]
[4,"A",null,null,null,null,null,null,null,null,null,null,null,null,null,"Y"]
[]
[]
[5,"Çift",null,null,null,null,null,null,null,null,null,null,null,null,null,"Çift"]
[]
["Forma Rengi",null,null,null,null,null,null,null,null,null,null,null,null,null,null,"Forma Rengi",null,null,null,null,null,null,null,null,null,null,null,null,null,null,"Toplam"]
["Kart\\Oyuncuya",null,null,null,null,1,null,2,null,3,null,4,null,5,null,"Kart\\Oyuncuya",null,null,null,null,1,null,2,null,3,null,4,null,5]
["Sarı",null,null,null,null,null,null,null,null,null,null,null,null,null,null,"Sarı",null,null,null,null,null,null,null,null,null,null,null,null,null,null,"Galip"]
["1. Sarı + Kırmızı",null,null,null,null,null,null,null,null,null,null,null,null,null,null,"1. Sarı + Kırmızı"]
["2. Sarı + Kırmızı",null,null,null,null,null,null,null,null,null,null,null,null,null,null,"2. Sarı + Kırmızı",null,null,null,null,null,null,null,null,null,null,null,null,null,null,null,null,null,{"$f":"\"(  \"&#REF!&\"  -     )\"","v":{"$error":"#REF!"}}]
["Kart\\Öğütücüye",null,null,null,null,"Sarı",null,null,null,null,"Kırmızı",null,null,null,null,"Kart\\Öğütücüye",null,null,null,null,"Sarı",null,null,null,null,"Kırmızı"]
["Kaptan",null,null,null,null,null,null,null,null,null,null,null,null,null,null,"Kaptan",null,null,null,null,null,null,null,null,null,null,null,null,null,null,"Hakemler",null,null,null,null,null,null,"Baş Hakem"]
["Adı Soyadı",null,null,null,":",null,null,null,null,null,null,null,null,null,null,"Adı Soyadı",null,null,null,":"]
["İmza",null,null,null,":",null,null,null,null,null,null,null,null,null,null,"İmza",null,null,null,":"]
[]
["Başlama Saati",null,null,null,null,":",null,null,null,null,null,null,null,null,null,"Bitiş Saati",null,null,null,null,":"]
[]
[]
[]
["          TÜRKİYE\n          MASA TENİSİ FEDERASYONU\n          YARIŞMA CETVELİ\n          Yeni Olimpik Sistem (4 Tek, 1 Çift)",null,null,null,null,null,null,null,null,null,null,null,null,null,null,null,null,null,null,null,null,"Yarışma Adı",null,null,null,null,null,null,null,"Yeri",null,null,"Tarih",null,null,"Saat",null,null,"Etap",null,"Maç No",null,"Masa"]
[]
[]
[null,null,null,null,null,null,null,null,null,null,null,null,null,null,null,null,null,null,null,null,null,"Erkek",null,"Bayan",null,"Galip",null,"Takımlar",null,null,null,null,null,null,null,null,null,null,null,null,null,null,"Kura"]
[null,null,null,null,null,null,null,null,null,null,null,null,null,null,null,null,null,null,null,null,null,null,null,null,null,null,null,null,null,null,null,null,null,null,null,null,null,null,null,null,null,null,"A","X"]
[]
[null,null,null,null,null,null,null,null,null,null,null,null,null,null,null,null,null,null,null,null,null,null,null,null,null,null,null,null,null,null,null,null,null,null,null,null,null,null,null,null,null,null,"A","X"]
[]
["Maç No","Kura","Lisans No","A-",null,null,null,null,null,null,null,null,null,null,"Mola","Kura","Lisans No","X-",null,null,null,null,null,null,null,null,null,null,null,"Mola","Sayılar",null,null,null,null,null,null,null,null,null,"Setler",null,"Puan"]
[]
[null,null,null,"Sporcular",null,null,null,null,null,null,null,null,null,null,null,null,null,"Sporcular",null,null,null,null,null,null,null,null,null,null,null,null,"1.Set",null,"2.Set",null,"3.Set",null,"4.Set",null,"5.Set",null,"A","X","A","X"]
[1,"A",null,null,null,null,null,null,null,null,null,null,null,null,null,"X"]
[]
[]
[2,"B",null,null,null,null,null,null,null,null,null,null,null,null,null,"Y"]
[]
[]
[3,"C",null,null,null,null,null,null,null,null,null,null,null,null,null,"Z"]
[]
[]
[4,"A",null,null,null,null,null,null,null,null,null,null,null,null,null,"Y"]
[]
[]
[5,"Çift",null,null,null,null,null,null,null,null,null,null,null,null,null,"Çift"]
[]
["Forma Rengi",null,null,null,null,null,null,null,null,null,null,null,null,null,null,"Forma Rengi",null,null,null,null,null,null,null,null,null,null,null,null,null,null,"Toplam"]
["Kart\\Oyuncuya",null,null,null,null,1,null,2,null,3,null,4,null,5,null,"Kart\\Oyuncuya",null,null,null,null,1,null,2,null,3,null,4,null,5]
["Sarı",null,null,null,null,null,null,null,null,null,null,null,null,null,null,"Sarı",null,null,null,null,null,null,null,null,null,null,null,null,null,null,"Galip"]
["1. Sarı + Kırmızı",null,null,null,null,null,null,null,null,null,null,null,null,null,null,"1. Sarı + Kırmızı"]
["2. Sarı + Kırmızı",null,null,null,null,null,null,null,null,null,null,null,null,null,null,"2. Sarı + Kırmızı",null,null,null,null,null,null,null,null,null,null,null,null,null,null,null,null,null,{"$f":"\"(  \"&#REF!&\"  -     )\"","v":{"$error":"#REF!"}}]
["Kart\\Öğütücüye",null,null,null,null,"Sarı",null,null,null,null,"Kırmızı",null,null,null,null,"Kart\\Öğütücüye",null,null,null,null,"Sarı",null,null,null,null,"Kırmızı"]
["Kaptan",null,null,null,null,null,null,null,null,null,null,null,null,null,null,"Kaptan",null,null,null,null,null,null,null,null,null,null,null,null,null,null,"Hakemler",null,null,null,null,null,null,"Baş Hakem"]
["Adı Soyadı",null,null,null,":",null,null,null,null,null,null,null,null,null,null,"Adı Soyadı",null,null,null,":"]
["İmza",null,null,null,":",null,null,null,null,null,null,null,null,null,null,"İmza",null,null,null,":"]
[]
["Başlama Saati",null,null,null,null,":",null,null,null,null,null,null,null,null,null,"Bitiş Saati",null,null,null,null,":"]

{"sheet":"5_Mac_KC","index":19,"n_rows":47,"n_cols":10,"rows_kept":47,"cut":false,"hidden":true,"merged":[[13,0,13,3],[13,6,13,9],[0,0,0,3],[0,6,0,9],[1,0,1,3],[1,6,1,9],[5,2,5,3],[5,8,5,9],[6,2,6,3],[6,8,6,9],[7,8,7,9],[12,0,12,3],[12,6,12,9],[17,2,17,3],[17,8,17,9],[18,2,18,3],[18,8,18,9],[19,8,19,9],[24,0,24,3],[24,6,24,9],[25,0,25,3],[25,6,25,9],[29,2,29,3],[29,8,29,9],[30,2,30,3],[30,8,30,9],[31,8,31,9],[36,0,36,3],[36,6,36,9],[43,8,43,9],[37,0,37,3],[37,6,37,9],[41,2,41,3],[41,8,41,9],[42,2,42,3],[42,8,42,9]]}
["TÜRKİYE",null,null,null,null,null,"TÜRKİYE"]
["MASA TENİSİ FEDERASYONU",null,null,null,null,null,"MASA TENİSİ FEDERASYONU"]
["TAKIM LİSTESİ",null,null,null,null,null,"TAKIM LİSTESİ"]
["Takım Adı",null,null,":",null,null,"Takım Adı",null,null,":"]
["Karşılaşacağı Takım",null,null,":",null,null,"Karşılaşacağı Takım",null,null,":"]
["A",null,": ………………………………..…………………..……….……….",null,null,null,"X",null,": ………………………………..…………………..……….………."]
["B",null,": ………………………………..…………………..……….……….",null,null,null,"Y",null,": ………………………………..…………………..……….………."]
["C",null,": ………………………………..…………………..……….……….",null,null,null,"Z",null,": ………………………………..…………………..……….………."]
["Karşılaşma Tarihi",null,null,":……………………………………...",null,null,"Karşılaşma Tarihi",null,null,":……………………………………..."]
["Takım Kaptanı",null,null,":……………………………………...",null,null,"Takım Kaptanı",null,null,":……………………………………..."]
["İmza",null,null,":……………………………………...",null,null,"İmza",null,null,":……………………………………..."]
[]
["TÜRKİYE",null,null,null,null,null,"TÜRKİYE"]
["MASA TENİSİ FEDERASYONU",null,null,null,null,null,"MASA TENİSİ FEDERASYONU"]
["TAKIM LİSTESİ",null,null,null,null,null,"TAKIM LİSTESİ"]
["Takım Adı",null,null,":",null,null,"Takım Adı",null,null,":"]
["Karşılaşacağı Takım",null,null,":",null,null,"Karşılaşacağı Takım",null,null,":"]
["A",null,": ………………………………..…………………..……….……….",null,null,null,"X",null,": ………………………………..…………………..……….………."]
["B",null,": ………………………………..…………………..……….……….",null,null,null,"Y",null,": ………………………………..…………………..……….………."]
["C",null,": ………………………………..…………………..……….……….",null,null,null,"Z",null,": ………………………………..…………………..……….………."]
["Karşılaşma Tarihi",null,null,":……………………………………...",null,null,"Karşılaşma Tarihi",null,null,":……………………………………..."]
["Takım Kaptanı",null,null,":……………………………………...",null,null,"Takım Kaptanı",null,null,":……………………………………..."]
["İmza",null,null,":……………………………………...",null,null,"İmza",null,null,":……………………………………..."]
[]
["TÜRKİYE",null,null,null,null,null,"TÜRKİYE"]
["MASA TENİSİ FEDERASYONU",null,null,null,null,null,"MASA TENİSİ FEDERASYONU"]
["TAKIM LİSTESİ",null,null,null,null,null,"TAKIM LİSTESİ"]
["Takım Adı",null,null,":",null,null,"Takım Adı",null,null,":"]
["Karşılaşacağı Takım",null,null,":",null,null,"Karşılaşacağı Takım",null,null,":"]
["A",null,": ………………………………..…………………..……….……….",null,null,null,"X",null,": ………………………………..…………………..……….………."]
["B",null,": ………………………………..…………………..……….……….",null,null,null,"Y",null,": ………………………………..…………………..……….………."]
["C",null,": ………………………………..…………………..……….……….",null,null,null,"Z",null,": ………………………………..…………………..……….………."]
["Karşılaşma Tarihi",null,null,":……………………………………...",null,null,"Karşılaşma Tarihi",null,null,":……………………………………..."]
["Takım Kaptanı",null,null,":……………………………………...",null,null,"Takım Kaptanı",null,null,":……………………………………..."]
["İmza",null,null,":……………………………………...",null,null,"İmza",null,null,":……………………………………..."]
[]
["TÜRKİYE",null,null,null,null,null,"TÜRKİYE"]
["MASA TENİSİ FEDERASYONU",null,null,null,null,null,"MASA TENİSİ FEDERASYONU"]
["TAKIM LİSTESİ",null,null,null,null,null,"TAKIM LİSTESİ"]
["Takım Adı",null,null,":",null,null,"Takım Adı",null,null,":"]
["Karşılaşacağı Takım",null,null,":",null,null,"Karşılaşacağı Takım",null,null,":"]
["A",null,": ………………………………..…………………..……….……….",null,null,null,"X",null,": ………………………………..…………………..……….………."]
["B",null,": ………………………………..…………………..……….……….",null,null,null,"Y",null,": ………………………………..…………………..……….………."]
["C",null,": ………………………………..…………………..……….……….",null,null,null,"Z",null,": ………………………………..…………………..……….………."]
["Karşılaşma Tarihi",null,null,":……………………………………...",null,null,"Karşılaşma Tarihi",null,null,":……………………………………..."]
["Takım Kaptanı",null,null,":……………………………………...",null,null,"Takım Kaptanı",null,null,":……………………………………..."]
["İmza",null,null,":……………………………………...",null,null,"İmza",null,null,":……………………………………..."]

{"sheet":"Olimpik_KC","index":20,"n_rows":51,"n_cols":10,"rows_kept":51,"cut":false,"hidden":true,"merged":[[0,0,0,3],[0,6,0,9],[1,0,1,3],[1,6,1,9],[5,2,5,3],[5,8,5,9],[6,2,6,3],[6,8,6,9],[13,0,13,3],[13,6,13,9],[14,0,14,3],[14,6,14,9],[7,0,8,0],[7,6,8,6],[31,2,31,3],[31,8,31,9],[18,2,18,3],[18,8,18,9],[19,2,19,3],[19,8,19,9],[32,2,32,3],[32,8,32,9],[33,0,34,0],[33,6,34,6],[39,0,39,3],[20,0,21,0],[20,6,21,6],[27,0,27,3],[27,6,27,9],[26,0,26,3],[26,6,26,9],[46,0,47,0],[46,6,47,6],[39,6,39,9],[40,0,40,3],[40,6,40,9],[44,2,44,3],[45,2,45,3],[45,8,45,9],[44,8,44,9]]}
["TÜRKİYE",null,null,null,null,null,"TÜRKİYE"]
["MASA TENİSİ FEDERASYONU",null,null,null,null,null,"MASA TENİSİ FEDERASYONU"]
["TAKIM LİSTESİ",null,null,null,null,null,"TAKIM LİSTESİ"]
["Takım Adı",null,null,":",null,null,"Takım Adı",null,null,":"]
["Karşılaşacağı Takım",null,null,":",null,null,"Karşılaşacağı Takım",null,null,":"]
["A",null,": ………………………………..…………………..……….……….",null,null,null,"X",null,": ………………………………..…………………..……….………."]
["B",null,": ………………………………..…………………..……….……….",null,null,null,"Y",null,": ………………………………..…………………..……….………."]
["Çift","C",": ………………………………..…………………..……….……….",null,null,null,"Çift","Z",": ………………………………..…………………..……….………."]
[null,null,": ………………………………..…………………..……….……….",null,null,null,null,null,": ………………………………..…………………..……….………."]
["Karşılaşma Tarihi",null,null,":……………………………………...",null,null,"Karşılaşma Tarihi",null,null,":……………………………………..."]
["Takım Kaptanı",null,null,":……………………………………...",null,null,"Takım Kaptanı",null,null,":……………………………………..."]
["İmza",null,null,":……………………………………...",null,null,"İmza",null,null,":……………………………………..."]
[]
["TÜRKİYE",null,null,null,null,null,"TÜRKİYE"]
["MASA TENİSİ FEDERASYONU",null,null,null,null,null,"MASA TENİSİ FEDERASYONU"]
["TAKIM LİSTESİ",null,null,null,null,null,"TAKIM LİSTESİ"]
["Takım Adı",null,null,":",null,null,"Takım Adı",null,null,":"]
["Karşılaşacağı Takım",null,null,":",null,null,"Karşılaşacağı Takım",null,null,":"]
["A",null,": ………………………………..…………………..……….……….",null,null,null,"X",null,": ………………………………..…………………..……….………."]
["B",null,": ………………………………..…………………..……….……….",null,null,null,"Y",null,": ………………………………..…………………..……….………."]
["Çift","C",": ………………………………..…………………..……….……….",null,null,null,"Çift","Z",": ………………………………..…………………..……….………."]
[null,null,": ………………………………..…………………..……….……….",null,null,null,null,null,": ………………………………..…………………..……….………."]
["Karşılaşma Tarihi",null,null,":……………………………………...",null,null,"Karşılaşma Tarihi",null,null,":……………………………………..."]
["Takım Kaptanı",null,null,":……………………………………...",null,null,"Takım Kaptanı",null,null,":……………………………………..."]
["İmza",null,null,":……………………………………...",null,null,"İmza",null,null,":……………………………………..."]
[]
["TÜRKİYE",null,null,null,null,null,"TÜRKİYE"]
["MASA TENİSİ FEDERASYONU",null,null,null,null,null,"MASA TENİSİ FEDERASYONU"]
["TAKIM LİSTESİ",null,null,null,null,null,"TAKIM LİSTESİ"]
["Takım Adı",null,null,":",null,null,"Takım Adı",null,null,":"]
["Karşılaşacağı Takım",null,null,":",null,null,"Karşılaşacağı Takım",null,null,":"]
["A",null,": ………………………………..…………………..……….……….",null,null,null,"X",null,": ………………………………..…………………..……….………."]
["B",null,": ………………………………..…………………..……….……….",null,null,null,"Y",null,": ………………………………..…………………..……….………."]
["Çift","C",": ………………………………..…………………..……….……….",null,null,null,"Çift","Z",": ………………………………..…………………..……….………."]
[null,null,": ………………………………..…………………..……….……….",null,null,null,null,null,": ………………………………..…………………..……….………."]
["Karşılaşma Tarihi",null,null,":……………………………………...",null,null,"Karşılaşma Tarihi",null,null,":……………………………………..."]
["Takım Kaptanı",null,null,":……………………………………...",null,null,"Takım Kaptanı",null,null,":……………………………………..."]
["İmza",null,null,":……………………………………...",null,null,"İmza",null,null,":……………………………………..."]
[]
["TÜRKİYE",null,null,null,null,null,"TÜRKİYE"]
["MASA TENİSİ FEDERASYONU",null,null,null,null,null,"MASA TENİSİ FEDERASYONU"]
["TAKIM LİSTESİ",null,null,null,null,null,"TAKIM LİSTESİ"]
["Takım Adı",null,null,":",null,null,"Takım Adı",null,null,":"]
["Karşılaşacağı Takım",null,null,":",null,null,"Karşılaşacağı Takım",null,null,":"]
["A",null,": ………………………………..…………………..……….……….",null,null,null,"X",null,": ………………………………..…………………..……….………."]
["B",null,": ………………………………..…………………..……….……….",null,null,null,"Y",null,": ………………………………..…………………..……….………."]
["Çift","C",": ………………………………..…………………..……….……….",null,null,null,"Çift","Z",": ………………………………..…………………..……….………."]
[null,null,": ………………………………..…………………..……….……….",null,null,null,null,null,": ………………………………..…………………..……….………."]
["Karşılaşma Tarihi",null,null,":……………………………………...",null,null,"Karşılaşma Tarihi",null,null,":……………………………………..."]
["Takım Kaptanı",null,null,":……………………………………...",null,null,"Takım Kaptanı",null,null,":……………………………………..."]
["İmza",null,null,":……………………………………...",null,null,"İmza",null,null,":……………………………………..."]

{"sheet":"Yeni_Olimpik_KC","index":21,"n_rows":55,"n_cols":10,"rows_kept":55,"cut":false,"hidden":true,"merged":[[0,0,0,3],[0,6,0,9],[1,0,1,3],[1,6,1,9],[5,2,5,3],[5,8,5,9],[6,2,6,3],[6,8,6,9],[8,0,9,0],[8,6,9,6],[14,0,14,3],[14,6,14,9],[7,2,7,3],[7,8,7,9],[8,2,8,3],[9,2,9,3],[9,8,9,9],[8,8,8,9],[21,2,21,3],[21,8,21,9],[22,0,23,0],[22,2,22,3],[15,0,15,3],[15,6,15,9],[19,2,19,3],[19,8,19,9],[20,2,20,3],[20,8,20,9],[22,6,23,6],[22,8,22,9],[23,2,23,3],[23,8,23,9],[42,0,42,3],[42,6,42,9],[43,0,43,3],[43,6,43,9],[33,2,33,3],[33,8,33,9],[34,2,34,3],[34,8,34,9],[35,2,35,3],[35,8,35,9],[29,0,29,3],[29,6,29,9],[28,0,28,3],[28,6,28,9],[36,0,37,0],[36,2,36,3],[36,6,37,6],[36,8,36,9],[37,2,37,3],[37,8,37,9],[47,2,47,3],[47,8,47,9],[48,2,48,3],[48,8,48,9],[49,2,49,3],[49,8,49,9],[50,0,51,0],[50,2,50,3],[50,6,51,6],[50,8,50,9],[51,2,51,3],[51,8,51,9]]}
["TÜRKİYE",null,null,null,null,null,"TÜRKİYE"]
["MASA TENİSİ FEDERASYONU",null,null,null,null,null,"MASA TENİSİ FEDERASYONU"]
["TAKIM LİSTESİ",null,null,null,null,null,"TAKIM LİSTESİ"]
["Takım Adı",null,null,":",null,null,"Takım Adı",null,null,":"]
["Karşılaşacağı Takım",null,null,":",null,null,"Karşılaşacağı Takım",null,null,":"]
["A",null,": ………………………………..…………………..……….……….",null,null,null,"X",null,": ………………………………..…………………..……….………."]
["B",null,": ………………………………..…………………..……….……….",null,null,null,"Y",null,": ………………………………..…………………..……….………."]
["C",null,": ………………………………..…………………..……….……….",null,null,null,"Z",null,": ………………………………..…………………..……….………."]
["Çift",null,": ………………………………..…………………..……….……….",null,null,null,"Çift",null,": ………………………………..…………………..……….………."]
[null,null,": ………………………………..…………………..……….……….",null,null,null,null,null,": ………………………………..…………………..……….………."]
["Karşılaşma Tarihi",null,null,":……………………………………...",null,null,"Karşılaşma Tarihi",null,null,":……………………………………..."]
["Takım Kaptanı",null,null,":……………………………………...",null,null,"Takım Kaptanı",null,null,":……………………………………..."]
["İmza",null,null,":……………………………………...",null,null,"İmza",null,null,":……………………………………..."]
[]
["TÜRKİYE",null,null,null,null,null,"TÜRKİYE"]
["MASA TENİSİ FEDERASYONU",null,null,null,null,null,"MASA TENİSİ FEDERASYONU"]
["TAKIM LİSTESİ",null,null,null,null,null,"TAKIM LİSTESİ"]
["Takım Adı",null,null,":",null,null,"Takım Adı",null,null,":"]
["Karşılaşacağı Takım",null,null,":",null,null,"Karşılaşacağı Takım",null,null,":"]
["A",null,": ………………………………..…………………..……….……….",null,null,null,"X",null,": ………………………………..…………………..……….………."]
["B",null,": ………………………………..…………………..……….……….",null,null,null,"Y",null,": ………………………………..…………………..……….………."]
["C",null,": ………………………………..…………………..……….……….",null,null,null,"Z",null,": ………………………………..…………………..……….………."]
["Çift",null,": ………………………………..…………………..……….……….",null,null,null,"Çift",null,": ………………………………..…………………..……….………."]
[null,null,": ………………………………..…………………..……….……….",null,null,null,null,null,": ………………………………..…………………..……….………."]
["Karşılaşma Tarihi",null,null,":……………………………………...",null,null,"Karşılaşma Tarihi",null,null,":……………………………………..."]
["Takım Kaptanı",null,null,":……………………………………...",null,null,"Takım Kaptanı",null,null,":……………………………………..."]
["İmza",null,null,":……………………………………...",null,null,"İmza",null,null,":……………………………………..."]
[]
["TÜRKİYE",null,null,null,null,null,"TÜRKİYE"]
["MASA TENİSİ FEDERASYONU",null,null,null,null,null,"MASA TENİSİ FEDERASYONU"]
["TAKIM LİSTESİ",null,null,null,null,null,"TAKIM LİSTESİ"]
["Takım Adı",null,null,":",null,null,"Takım Adı",null,null,":"]
["Karşılaşacağı Takım",null,null,":",null,null,"Karşılaşacağı Takım",null,null,":"]
["A",null,": ………………………………..…………………..……….……….",null,null,null,"X",null,": ………………………………..…………………..……….………."]
["B",null,": ………………………………..…………………..……….……….",null,null,null,"Y",null,": ………………………………..…………………..……….………."]
["C",null,": ………………………………..…………………..……….……….",null,null,null,"Z",null,": ………………………………..…………………..……….………."]
["Çift",null,": ………………………………..…………………..……….……….",null,null,null,"Çift",null,": ………………………………..…………………..……….………."]
[null,null,": ………………………………..…………………..……….……….",null,null,null,null,null,": ………………………………..…………………..……….………."]
["Karşılaşma Tarihi",null,null,":……………………………………...",null,null,"Karşılaşma Tarihi",null,null,":……………………………………..."]
["Takım Kaptanı",null,null,":……………………………………...",null,null,"Takım Kaptanı",null,null,":……………………………………..."]
["İmza",null,null,":……………………………………...",null,null,"İmza",null,null,":……………………………………..."]
[]
["TÜRKİYE",null,null,null,null,null,"TÜRKİYE"]
["MASA TENİSİ FEDERASYONU",null,null,null,null,null,"MASA TENİSİ FEDERASYONU"]
["TAKIM LİSTESİ",null,null,null,null,null,"TAKIM LİSTESİ"]
["Takım Adı",null,null,":",null,null,"Takım Adı",null,null,":"]
["Karşılaşacağı Takım",null,null,":",null,null,"Karşılaşacağı Takım",null,null,":"]
["A",null,": ………………………………..…………………..……….……….",null,null,null,"X",null,": ………………………………..…………………..……….………."]
["B",null,": ………………………………..…………………..……….……….",null,null,null,"Y",null,": ………………………………..…………………..……….………."]
["C",null,": ………………………………..…………………..……….……….",null,null,null,"Z",null,": ………………………………..…………………..……….………."]
["Çift",null,": ………………………………..…………………..……….……….",null,null,null,"Çift",null,": ………………………………..…………………..……….………."]
[null,null,": ………………………………..…………………..……….……….",null,null,null,null,null,": ………………………………..…………………..……….………."]
["Karşılaşma Tarihi",null,null,":……………………………………...",null,null,"Karşılaşma Tarihi",null,null,":……………………………………..."]
["Takım Kaptanı",null,null,":……………………………………...",null,null,"Takım Kaptanı",null,null,":……………………………………..."]
["İmza",null,null,":……………………………………...",null,null,"İmza",null,null,":……………………………………..."]