{"text_format":"1","workbook":"xlsx","n_sheets":23,"sheets":["Katılım","Grup","Ana_Tablo_Kura","On_Eleme","Eleme","32DE","32DE(16)","16","16DE","16(8DE)","Ana Tablo","8DE","8TE","Cift_Mix","SIRALAMA","Ferdi","Puan","5_Mac","Olimpik","Yeni_Olimpik","5_Mac_KC","Olimpik_KC","Yeni_Olimpik_KC"],"not_rendered":{"charts":0,"images":8,"macros":1,"external_links":1,"defined_names":15,"comments":0,"pivot_tables":0},"unopened":[],"bounds":{"document_bytes":16777216,"sheet_cells":100000,"rows_first":2000,"rows_last":500,"rows_between":2000,"halvings":0,"cell_chars":16384,"cell_head_chars":4096},"cells_cut":0,"cells_raw":0,"read":"whole","date_system":"1900"}

{"sheet":"Katılım","index":0,"n_rows":36,"n_cols":32,"rows_kept":36,"cut":false,"hidden":false,"merged":[[1,34,2,35],[0,0,0,8],[1,0,1,8]]}
["TÜRKİYE MASA TENİSİ FEDERASYONU\nKÜÇÜKLER KUZEYBATI BÖLGESİ YARIŞMALARI",null,null,null,null,null,null,null,null,null,null,null,null,null,null,null,null,null,null,null,null,null,null,null,null,null,null,"Ferdi","TÜRKİYE MASA TENİSİ FEDERASYONU\nKÜÇÜKLER KUZEYBATI BÖLGESİ YARIŞMALARI"]
["ERKEK TAKIM  [12-13 Mart 2025 KOCAELİ]",null,null,null,null,null,null,null,null,null,null,null,null,null,null,null,null,null,null,null,null,null,null,null,null,null,null,"Grup","ERKEK TAKIM  [12-13 Mart 2025 KOCAELİ]"]
["No",null,"Puan","Sporcu","İl","İl","TŞ","Grup","Grup",null,null,null,null,null,null,null,null,null,null,null,null,null,null,null,null,null,null,1,"[ Ön Eleme ]","[ Eleme ]","[ Ana Tablo ]","[ Grup ]"]
[1,null,null,"FENERBAHÇE (A)","İST","İSTANBUL",3,1,"Erkek","KBB",null,null,null,null,null,null,null,null,null,null,null,null,null,null,null,"FENERBAHÇE (A) (İST)","FENERBAHÇE (A)"]
[2,null,null,"YALOVA BLD. GENÇLİK SPOR (A)","YLV","YALOVA",8,3,"Erkek","KBB",null,null,null,null,null,null,null,null,null,null,null,null,null,null,null,"YALOVA BLD. GENÇLİK SPOR (A) (YLV)","YALOVA BLD. GENÇLİK SPOR (A)"]
[3,null,null,"İSTANBUL DSİ (A)","İST","İSTANBUL",16,5,"Erkek","KBB",null,null,null,null,null,null,null,null,null,null,null,null,null,null,null,"İSTANBUL DSİ (A) (İST)","İSTANBUL DSİ (A)"]
[4,null,null,"YILDIZ RAKETLER (A)","İST","İSTANBUL","",2,"Erkek","KBB",null,null,null,null,null,null,null,null,null,null,null,null,null,null,null,"YILDIZ RAKETLER (A) (İST)","YILDIZ RAKETLER (A)"]
[5,null,null,"PENDİK BLD. SPOR (A)","İST","İSTANBUL","",6,"Erkek","KBB",null,null,null,null,null,null,null,null,null,null,null,null,null,null,null,"PENDİK BLD. SPOR (A) (İST)","PENDİK BLD. SPOR (A)"]
[6,null,null,"ÇERKEZKÖY BLD. GSK (A)","TKD","TEKİRDAĞ","",7,"Erkek","KBB",null,null,null,null,null,null,null,null,null,null,null,null,null,null,null,"ÇERKEZKÖY BLD. GSK (A) (TKD)","ÇERKEZKÖY BLD. GSK (A)"]
[7,null,null,"PENDİK BLD. SPOR (B)","İST","İSTANBUL","",8,"Erkek","KBB",null,null,null,null,null,null,null,null,null,null,null,null,null,null,null,"PENDİK BLD. SPOR (B) (İST)","PENDİK BLD. SPOR (B)"]
[8,0.22686600685119629,null,"EDİRNE YURDUM SPOR (A)","EDR","EDİRNE","",9,"Erkek","KBB",null,null,null,null,null,null,null,null,null,null,null,null,null,null,null,"EDİRNE YURDUM SPOR (A) (EDR)","EDİRNE YURDUM SPOR (A)"]
[9,0.58916300535202026,null,"İSTANBUL DSİ (B)","İST","İSTANBUL","",9,"Erkek","KBB",null,null,null,null,null,null,null,null,null,null,null,null,null,null,null,"İSTANBUL DSİ (B) (İST)","İSTANBUL DSİ (B)"]
[10,0.91096431016921997,null,"TRAKER SPOR (A)","KRL","KIRKLARELİ","",9,"Erkek","KBB",null,null,null,null,null,null,null,null,null,null,null,null,null,null,null,"TRAKER SPOR (A) (KRL)","TRAKER SPOR (A)"]
[11,0.98609316349029541,null,"YALOVA BLD. GENÇLİK SPOR (B)","YLV","YALOVA","",9,"Erkek","KBB",null,null,null,null,null,null,null,null,null,null,null,null,null,null,null,"YALOVA BLD. GENÇLİK SPOR (B) (YLV)","YALOVA BLD. GENÇLİK SPOR (B)"]
[26,0.15031129121780396,null,"BURSA B. ŞEH. BLD. SPOR (A)","BRS","BURSA","","","Erkek","KBB",null,null,null,null,null,null,null,null,null,null,null,null,null,null,null,"BURSA B. ŞEH. BLD. SPOR (A) (BRS)","BURSA B. ŞEH. BLD. SPOR (A)"]
[24,0.22326177358627319,null,"ULUDAĞ OKSİJEN SPOR (A)","BRS","BURSA","","","Erkek","KBB",null,null,null,null,null,null,null,null,null,null,null,null,null,null,null,"ULUDAĞ OKSİJEN SPOR (A) (BRS)","ULUDAĞ OKSİJEN SPOR (A)"]
[25,0.22778159379959106,null,"ULUDAĞ OKSİJEN SPOR (B)","BRS","BURSA","","","Erkek","KBB",null,null,null,null,null,null,null,null,null,null,null,null,null,null,null,"ULUDAĞ OKSİJEN SPOR (B) (BRS)","ULUDAĞ OKSİJEN SPOR (B)"]
[22,0.29286682605743408,null,"GENÇ TRAKYA SPOR (A)","EDR","EDİRNE","","","Erkek","KBB",null,null,null,null,null,null,null,null,null,null,null,null,null,null,null,"GENÇ TRAKYA SPOR (A) (EDR)","GENÇ TRAKYA SPOR (A)"]
[19,0.30249756574630737,null,"ÇAĞDAŞ KOLEJLİLER (A)","ESK","ESKİŞEHİR","","","Erkek","KBB",null,null,null,null,null,null,null,null,null,null,null,null,null,null,null,"ÇAĞDAŞ KOLEJLİLER (A) (ESK)","ÇAĞDAŞ KOLEJLİLER (A)"]
[12,0.36345869302749634,null,"D.S.İ. BENT SPOR (A)","ESK","ESKİŞEHİR","","","Erkek","KBB",null,null,null,null,null,null,null,null,null,null,null,null,null,null,null,"D.S.İ. BENT SPOR (A) (ESK)","D.S.İ. BENT SPOR (A)"]
[31,0.37051534652709961,null,"ESKİŞEHİR YURDUM SPOR (A)","ESK","ESKİŞEHİR","","","Erkek","KBB",null,null,null,null,null,null,null,null,null,null,null,null,null,null,null,"ESKİŞEHİR YURDUM SPOR (A) (ESK)","ESKİŞEHİR YURDUM SPOR (A)"]
[32,0.42291826009750366,null,"BEYKOZ BLD. SPOR (A)","İST","İSTANBUL","","","Erkek","KBB",null,null,null,null,null,null,null,null,null,null,null,null,null,null,null,"BEYKOZ BLD. SPOR (A) (İST)","BEYKOZ BLD. SPOR (A)"]
[28,0.42753332853317261,null,"İBB SPOR (A)","İST","İSTANBUL","","","Erkek","KBB",null,null,null,null,null,null,null,null,null,null,null,null,null,null,null,"İBB SPOR (A) (İST)","İBB SPOR (A)"]
[23,0.47801417112350464,null,"İBB SPOR (B)","İST","İSTANBUL","","","Erkek","KBB",null,null,null,null,null,null,null,null,null,null,null,null,null,null,null,"İBB SPOR (B) (İST)","İBB SPOR (B)"]
[27,0.48983043432235718,null,"PENDİK BLD. SPOR (C)","İST","İSTANBUL","","","Erkek","KBB",null,null,null,null,null,null,null,null,null,null,null,null,null,null,null,"PENDİK BLD. SPOR (C) (İST)","PENDİK BLD. SPOR (C)"]
[17,0.50906813144683838,null,"YILDIZ RAKETLER (B)","İST","İSTANBUL","","","Erkek","KBB",null,null,null,null,null,null,null,null,null,null,null,null,null,null,null,"YILDIZ RAKETLER (B) (İST)","YILDIZ RAKETLER (B)"]
[15,0.52982115745544434,null,"LÜLEBURGAZ GENÇLİK SPOR  (A)","KRL","KIRKLARELİ","","","Erkek","KBB",null,null,null,null,null,null,null,null,null,null,null,null,null,null,null,"LÜLEBURGAZ GENÇLİK SPOR  (A) (KRL)","LÜLEBURGAZ GENÇLİK SPOR  (A)"]
[29,0.54091358184814453,null,"LÜLEBURGAZ ZİRVE SPOR (A)","KRL","KIRKLARELİ","","","Erkek","KBB",null,null,null,null,null,null,null,null,null,null,null,null,null,null,null,"LÜLEBURGAZ ZİRVE SPOR (A) (KRL)","LÜLEBURGAZ ZİRVE SPOR (A)"]
[13,0.54317700862884521,null,"LÜLEBURGAZ ZİRVE SPOR (B)","KRL","KIRKLARELİ","","","Erkek","KBB",null,null,null,null,null,null,null,null,null,null,null,null,null,null,null,"LÜLEBURGAZ ZİRVE SPOR (B) (KRL)","LÜLEBURGAZ ZİRVE SPOR (B)"]
[16,0.58452928066253662,null,"TRAKER SPOR (B)","KRL","KIRKLARELİ","","","Erkek","KBB",null,null,null,null,null,null,null,null,null,null,null,null,null,null,null,"TRAKER SPOR (B) (KRL)","TRAKER SPOR (B)"]
[30,0.61918759346008301,null,"B.B.KAĞITSPOR (A)","KCL","KOCAELİ","","","Erkek","KBB",null,null,null,null,null,null,null,null,null,null,null,null,null,null,null,"B.B.KAĞITSPOR (A) (KCL)","B.B.KAĞITSPOR (A)"]
[20,0.68081939220428467,null,"DERİNCE GSK (A)","KCL","KOCAELİ","","","Erkek","KBB",null,null,null,null,null,null,null,null,null,null,null,null,null,null,null,"DERİNCE GSK (A) (KCL)","DERİNCE GSK (A)"]
[18,0.81466394662857056,null,"KOCAELİ GSIM (A)","KCL","KOCAELİ","","","Erkek","KBB",null,null,null,null,null,null,null,null,null,null,null,null,null,null,null,"KOCAELİ GSIM (A) (KCL)","KOCAELİ GSIM (A)"]
[14,0.87597465515136719,null,"KOCAELİ GSIM (B)","KCL","KOCAELİ","","","Erkek","KBB",null,null,null,null,null,null,null,null,null,null,null,null,null,null,null,"KOCAELİ GSIM (B) (KCL)","KOCAELİ GSIM (B)"]
[21,0.8866000771522522,null,"BOYBEYİ SPOR (A)","SKR","SAKARYA","","","Erkek","KBB",null,null,null,null,null,null,null,null,null,null,null,null,null,null,null,"BOYBEYİ SPOR (A) (SKR)","BOYBEYİ SPOR (A)"]
[33,null,null,null,null,null,null,null,null,null,null,null,null,null,null,null,null,null,null,null,null,null,null,null,null,0,0]

{"sheet":"Grup","index":1,"n_rows":67,"n_cols":31,"rows_kept":67,"cut":false,"hidden":false,"merged":[[0,1,1,30],[2,1,2,30],[4,1,4,3],[4,4,4,5],[4,6,4,7],[4,8,4,9],[4,10,4,11],[4,22,4,23],[4,24,4,25],[4,26,4,27],[4,28,4,29],[5,1,5,3],[5,4,5,5],[5,6,5,7],[5,8,5,9],[5,10,5,11],[5,26,5,27],[5,28,5,29],[6,26,6,27],[6,28,6,29],[9,1,9,3],[9,4,9,5],[9,6,9,7],[9,8,9,9],[9,10,9,11],[9,26,9,27],[9,28,9,29],[8,1,8,3],[8,4,8,5],[8,6,8,7],[8,8,8,9],[8,10,8,11],[8,22,8,23],[8,24,8,25],[8,26,8,27],[8,28,8,29],[10,26,10,27],[10,28,10,29],[12,1,12,3],[12,4,12,5],[12,6,12,7],[12,8,12,9],[12,10,12,11],[12,22,12,23],[12,24,12,25],[12,26,12,27],[12,28,12,29],[13,1,13,3],[13,4,13,5],[13,6,13,7],[13,8,13,9],[13,10,13,11],[13,26,13,27],[13,28,13,29],[14,26,14,27],[14,28,14,29],[16,1,16,3],[16,4,16,5],[16,6,16,7],[16,8,16,9],[16,10,16,11],[16,22,16,23],[16,24,16,25],[16,26,16,27],[16,28,16,29],[17,1,17,3],[17,4,17,5],[17,6,17,7],[17,8,17,9],[17,10,17,11],[17,26,17,27],[17,28,17,29],[18,26,18,27],[18,28,18,29],[20,1,20,3],[20,4,20,5],[20,6,20,7],[20,8,20,9],[20,10,20,11],[20,22,20,23],[20,24,20,25],[20,26,20,27],[20,28,20,29],[21,1,21,3],[21,4,21,5],[21,6,21,7],[21,8,21,9],[21,10,21,11],[21,26,21,27],[21,28,21,29],[22,26,22,27],[22,28,22,29],[24,1,24,3],[24,4,24,5],[24,6,24,7],[24,8,24,9],[24,10,24,11],[24,22,24,23],[24,24,24,25],[24,26,24,27],[24,28,24,29],[25,1,25,3],[25,4,25,5],[25,6,25,7],[25,8,25,9],[25,10,25,11],[25,26,25,27],[25,28,25,29],[26,26,26,27],[26,28,26,29],[28,1,28,3],[28,4,28,5],[28,6,28,7],[28,8,28,9],[28,10,28,11],[28,22,28,23],[28,24,28,25],[28,26,28,27],[28,28,28,29],[29,1,29,3],[29,4,29,5],[29,6,29,7],[29,8,29,9],[29,10,29,11],[29,26,29,27],[29,28,29,29],[30,26,30,27],[30,28,30,29],[32,1,32,3],[32,4,32,5],[32,6,32,7],[32,8,32,9],[32,10,32,11],[32,22,32,23],[32,24,32,25],[32,26,32,27],[32,28,32,29],[33,1,33,3],[33,4,33,5],[33,6,33,7],[33,8,33,9],[33,10,33,11],[33,26,33,27],[33,28,33,29],[34,26,34,27],[34,28,34,29],[36,1,36,3],[36,4,36,5],[36,6,36,7],[36,8,36,9],[36,10,36,11],[36,22,36,23],[36,24,36,25],[36,26,36,27],[36,28,36,29],[37,1,37,3],[37,4,37,5],[37,6,37,7],[37,8,37,9],[37,10,37,11],[37,26,37,27],[37,28,37,29],[38,26,38,27],[38,28,38,29],[40,1,40,3],[40,4,40,5],[40,6,40,7],[40,8,40,9],[40,10,40,11],[40,22,40,23],[40,24,40,25],[40,26,40,27],[40,28,40,29],[41,1,41,3],[41,4,41,5],[41,6,41,7],[41,8,41,9],[41,10,41,11],[41,26,41,27],[41,28,41,29],[42,26,42,27],[42,28,42,29],[44,1,44,3],[44,4,44,5],[44,6,44,7],[44,8,44,9],[44,10,44,11],[44,22,44,23],[44,24,44,25],[44,26,44,27],[44,28,44,29],[45,1,45,3],[45,4,45,5],[45,6,45,7],[45,8,45,9],[45,10,45,11],[45,26,45,27],[45,28,45,29],[46,26,46,27],[46,28,46,29],[48,1,48,3],[48,4,48,5],[48,6,48,7],[48,8,48,9],[48,10,48,11],[48,22,48,23],[48,24,48,25],[48,26,48,27],[48,28,48,29],[49,1,49,3],[49,4,49,5],[49,6,49,7],[49,8,49,9],[49,10,49,11],[49,26,49,27],[49,28,49,29],[50,26,50,27],[50,28,50,29],[52,1,52,3],[52,4,52,5],[52,6,52,7],[52,8,52,9],[52,10,52,11],[52,22,52,23],[52,24,52,25],[52,26,52,27],[52,28,52,29],[53,1,53,3],[53,4,53,5],[53,6,53,7],[53,8,53,9],[53,10,53,11],[53,26,53,27],[53,28,53,29],[54,26,54,27],[54,28,54,29],[56,1,56,3],[56,4,56,5],[56,6,56,7],[56,8,56,9],[56,10,56,11],[56,22,56,23],[56,24,56,25],[56,26,56,27],[56,28,56,29],[60,28,60,29],[57,1,57,3],[57,4,57,5],[57,6,57,7],[57,8,57,9],[57,10,57,11],[57,26,57,27],[57,28,57,29],[58,26,58,27],[58,28,58,29],[64,22,64,23],[64,24,64,25],[64,26,64,27],[60,1,60,3],[60,4,60,5],[60,6,60,7],[60,8,60,9],[60,10,60,11],[60,22,60,23],[60,24,60,25],[60,26,60,27],[64,28,64,29],[66,26,66,27],[66,28,66,29],[61,1,61,3],[61,4,61,5],[61,6,61,7],[61,8,61,9],[61,10,61,11],[61,26,61,27],[61,28,61,29],[65,1,65,3],[65,4,65,5],[65,6,65,7],[65,8,65,9],[65,10,65,11],[65,26,65,27],[65,28,65,29],[62,26,62,27],[62,28,62,29],[64,1,64,3],[64,4,64,5],[64,6,64,7],[64,8,64,9],[64,10,64,11]]}
[1,"TÜRKİYE MASA TENİSİ FEDERASYONU\nKÜÇÜKLER KUZEYBATI BÖLGESİ YARIŞMALARI"]
[]
[null,"ERKEK TAKIM  [12-13 Mart 2025 KOCAELİ] [ Grup ]"]
[]
[2,"Tarih",null,null,"Saat",null,"Tur",null,"Maç",null,"Masa",null,null,3,"Grup",null,1,null,null,null,null,null,1,null,2,null,"Puan",null,"Sıralama"]
[null,"2025-03-12",null,null,"09:30:00",null,1,null,"1 - 2",null,null,null,1,"G1.1",1,"FENERBAHÇE (A) (İST)",null,null,null,null,null,null,null,null,3,0,2,null,1,null,3]
[null,".",null,null,null,null,null,null,null,null,null,null,32,"G1.2",2,"BEYKOZ BLD. SPOR (A) (İST)",null,null,null,null,null,null,0,3,null,null,1,null,2,null,3]
[]
[2,"Tarih",null,null,"Saat",null,"Tur",null,"Maç",null,"Masa",null,null,3,"Grup",null,2,null,null,null,null,null,1,null,2,null,"Puan",null,"Sıralama"]
[null,"2025-03-12",null,null,"09:30:00",null,1,null,"1 - 2",null,null,null,2,"G2.1",1,"YALOVA BLD. GENÇLİK SPOR (A) (YLV)",null,null,null,null,null,null,null,null,3,0,2,null,1,null,3]
[null,".",null,null,null,null,null,null,null,null,null,null,31,"G2.2",2,"ESKİŞEHİR YURDUM SPOR (A) (ESK)",null,null,null,null,null,null,0,3,null,null,1,null,2,null,3]
[]
[2,"Tarih",null,null,"Saat",null,"Tur",null,"Maç",null,"Masa",null,null,3,"Grup",null,3,null,null,null,null,null,1,null,2,null,"Puan",null,"Sıralama"]
[null,"2025-03-12",null,null,"09:30:00",null,1,null,"1 - 2",null,null,null,3,"G3.1",1,"İSTANBUL DSİ (A) (İST)",null,null,null,null,null,null,null,null,3,0,2,null,1,null,3]
[null,".",null,null,null,null,null,null,null,null,null,null,30,"G3.2",2,"B.B.KAĞITSPOR (A) (KCL)",null,null,null,null,null,null,0,3,null,null,1,null,2,null,3]
[]
[2,"Tarih",null,null,"Saat",null,"Tur",null,"Maç",null,"Masa",null,null,3,"Grup",null,4,null,null,null,null,null,1,null,2,null,"Puan",null,"Sıralama"]
[null,"2025-03-12",null,null,"09:30:00",null,1,null,"1 - 2",null,null,null,4,"G4.1",1,"YILDIZ RAKETLER (A) (İST)",null,null,null,null,null,null,null,null,3,0,2,null,1,null,3]
[null,".",null,null,null,null,null,null,null,null,null,null,29,"G4.2",2,"LÜLEBURGAZ ZİRVE SPOR (A) (KRL)",null,null,null,null,null,null,0,3,null,null,1,null,2,null,3]
[]
[2,"Tarih",null,null,"Saat",null,"Tur",null,"Maç",null,"Masa",null,null,3,"Grup",null,5,null,null,null,null,null,1,null,2,null,"Puan",null,"Sıralama"]
[null,"2025-03-12",null,null,"09:30:00",null,1,null,"1 - 2",null,null,null,5,"G5.1",1,"PENDİK BLD. SPOR (A) (İST)",null,null,null,null,null,null,null,null,3,2,2,null,1,null,5]
[null,".",null,null,null,null,null,null,null,null,null,null,28,"G5.2",2,"İBB SPOR (A) (İST)",null,null,null,null,null,null,2,3,null,null,1,null,2,null,5]
[]
[2,"Tarih",null,null,"Saat",null,"Tur",null,"Maç",null,"Masa",null,null,3,"Grup",null,6,null,null,null,null,null,1,null,2,null,"Puan",null,"Sıralama"]
[null,"2025-03-12",null,null,"09:30:00",null,1,null,"1 - 2",null,null,null,6,"G6.1",1,"ÇERKEZKÖY BLD. GSK (A) (TKD)",null,null,null,null,null,null,null,null,3,2,2,null,1,null,5]
[null,".",null,null,null,null,null,null,null,null,null,null,27,"G6.2",2,"PENDİK BLD. SPOR (C) (İST)",null,null,null,null,null,null,2,3,null,null,1,null,2,null,5]
[]
[2,"Tarih",null,null,"Saat",null,"Tur",null,"Maç",null,"Masa",null,null,3,"Grup",null,7,null,null,null,null,null,1,null,2,null,"Puan",null,"Sıralama"]
[null,"2025-03-12",null,null,"09:30:00",null,1,null,"1 - 2",null,null,null,7,"G7.2",1,"PENDİK BLD. SPOR (B) (İST)",null,null,null,null,null,null,null,null,1,3,1,null,2,null,4]
[null,".",null,null,null,null,null,null,null,null,null,null,26,"G7.1",2,"BURSA B. ŞEH. BLD. SPOR (A) (BRS)",null,null,null,null,null,null,3,1,null,null,2,null,1,null,4]
[]
[2,"Tarih",null,null,"Saat",null,"Tur",null,"Maç",null,"Masa",null,null,3,"Grup",null,8,null,null,null,null,null,1,null,2,null,"Puan",null,"Sıralama"]
[null,"2025-03-12",null,null,"09:30:00",null,1,null,"1 - 2",null,null,null,8,"G8.1",1,"EDİRNE YURDUM SPOR (A) (EDR)",null,null,null,null,null,null,null,null,3,0,2,null,1,null,3]
[null,".",null,null,null,null,null,null,null,null,null,null,25,"G8.2",2,"ULUDAĞ OKSİJEN SPOR (B) (BRS)",null,null,null,null,null,null,0,3,null,null,1,null,2,null,3]
[]
[2,"Tarih",null,null,"Saat",null,"Tur",null,"Maç",null,"Masa",null,null,3,"Grup",null,9,null,null,null,null,null,1,null,2,null,"Puan",null,"Sıralama"]
[null,"2025-03-12",null,null,"09:30:00",null,1,null,"1 - 2",null,null,null,9,"G9.1",1,"İSTANBUL DSİ (B) (İST)",null,null,null,null,null,null,null,null,3,1,2,null,1,null,4]
[null,".",null,null,null,null,null,null,null,null,null,null,24,"G9.2",2,"ULUDAĞ OKSİJEN SPOR (A) (BRS)",null,null,null,null,null,null,1,3,null,null,1,null,2,null,4]
[]
[2,"Tarih",null,null,"Saat",null,"Tur",null,"Maç",null,"Masa",null,null,3,"Grup",null,10,null,null,null,null,null,1,null,2,null,"Puan",null,"Sıralama"]
[null,"2025-03-12",null,null,"09:30:00",null,1,null,"1 - 2",null,null,null,10,"G10.1",1,"TRAKER SPOR (A) (KRL)",null,null,null,null,null,null,null,null,3,0,2,null,1,null,3]
[null,".",null,null,null,null,null,null,null,null,null,null,23,"G10.2",2,"İBB SPOR (B) (İST)",null,null,null,null,null,null,0,3,null,null,1,null,2,null,3]
[]
[2,"Tarih",null,null,"Saat",null,"Tur",null,"Maç",null,"Masa",null,null,3,"Grup",null,11,null,null,null,null,null,1,null,2,null,"Puan",null,"Sıralama"]
[null,"2025-03-12",null,null,"09:30:00",null,1,null,"1 - 2",null,null,null,11,"G11.1",1,"YALOVA BLD. GENÇLİK SPOR (B) (YLV)",null,null,null,null,null,null,null,null,3,0,2,null,1,null,3]
[null,".",null,null,null,null,null,null,null,null,null,null,22,"G11.2",2,"GENÇ TRAKYA SPOR (A) (EDR)",null,null,null,null,null,null,0,3,null,null,1,null,2,null,3]
[]
[2,"Tarih",null,null,"Saat",null,"Tur",null,"Maç",null,"Masa",null,null,3,"Grup",null,12,null,null,null,null,null,1,null,2,null,"Puan",null,"Sıralama"]
[null,"2025-03-12",null,null,"09:30:00",null,1,null,"1 - 2",null,null,null,12,"G12.1",1,"D.S.İ. BENT SPOR (A) (ESK)",null,null,null,null,null,null,null,null,3,0,2,null,1,null,3]
[null,".",null,null,null,null,null,null,null,null,null,null,21,"G12.2",2,"BOYBEYİ SPOR (A) (SKR)",null,null,null,null,null,null,0,3,null,null,1,null,2,null,3]
[]
[2,"Tarih",null,null,"Saat",null,"Tur",null,"Maç",null,"Masa",null,null,3,"Grup",null,13,null,null,null,null,null,1,null,2,null,"Puan",null,"Sıralama"]
[null,"2025-03-12",null,null,"09:30:00",null,1,null,"1 - 2",null,null,null,13,"G13.1",1,"LÜLEBURGAZ ZİRVE SPOR (B) (KRL)",null,null,null,null,null,null,null,null,3,0,2,null,1,null,3]
[null,".",null,null,null,null,null,null,null,null,null,null,20,"G13.2",2,"DERİNCE GSK (A) (KCL)",null,null,null,null,null,null,0,3,null,null,1,null,2,null,3]
[]
[2,"Tarih",null,null,"Saat",null,"Tur",null,"Maç",null,"Masa",null,null,3,"Grup",null,14,null,null,null,null,null,1,null,2,null,"Puan",null,"Sıralama"]
[null,"2025-03-12",null,null,"09:30:00",null,1,null,"1 - 2",null,null,null,14,"G14.2",1,"KOCAELİ GSIM (B) (KCL)",null,null,null,null,null,null,null,null,0,3,1,null,2,null,3]
[null,".",null,null,null,null,null,null,null,null,null,null,19,"G14.1",2,"ÇAĞDAŞ KOLEJLİLER (A) (ESK)",null,null,null,null,null,null,3,0,null,null,2,null,1,null,3]
[]
[2,"Tarih",null,null,"Saat",null,"Tur",null,"Maç",null,"Masa",null,null,3,"Grup",null,15,null,null,null,null,null,1,null,2,null,"Puan",null,"Sıralama"]
[null,"2025-03-12",null,null,"09:30:00",null,1,null,"1 - 2",null,null,null,15,"G15.1",1,"LÜLEBURGAZ GENÇLİK SPOR  (A) (KRL)",null,null,null,null,null,null,null,null,3,0,2,null,1,null,3]
[null,".",null,null,null,null,null,null,null,null,null,null,18,"G15.2",2,"KOCAELİ GSIM (A) (KCL)",null,null,null,null,null,null,0,3,null,null,1,null,2,null,3]
[]
[2,"Tarih",null,null,"Saat",null,"Tur",null,"Maç",null,"Masa",null,null,3,"Grup",null,16,null,null,null,null,null,1,null,2,null,"Puan",null,"Sıralama"]
[null,"2025-03-12",null,null,"09:30:00",null,1,null,"1 - 2",null,null,null,16,"G16.2",1,"TRAKER SPOR (B) (KRL)",null,null,null,null,null,null,null,null,2,3,1,null,2,null,5]
[null,".",null,null,null,null,null,null,null,null,null,null,17,"G16.1",2,"YILDIZ RAKETLER (B) (İST)",null,null,null,null,null,null,3,2,null,null,2,null,1,null,5]

{"sheet":"Ana_Tablo_Kura","index":2,"n_rows":562,"n_cols":14,"rows_kept":562,"cut":false,"hidden":false,"merged":[[555,1,555,5],[533,1,533,5],[0,0,1,10],[2,0,2,10],[559,1,559,5],[539,1,539,5],[4,1,4,5],[269,1,269,5],[406,1,406,5],[479,1,479,5],[520,1,520,5],[371,1,371,5],[136,1,136,5],[202,1,202,5],[499,1,499,5],[509,1,509,5],[460,1,460,5],[442,1,442,5],[337,1,337,5],[546,1,546,5]]}
["TÜRKİYE MASA TENİSİ FEDERASYONU\nKÜÇÜKLER KUZEYBATI BÖLGESİ YARIŞMALARI"]
[]
["ERKEK TAKIM  [12-13 Mart 2025 KOCAELİ]"]
[]
[null,256]
[]
[null,"Place",null,"#","Group","Player",null,"Manuel",null,null,"S.No","Main table"]
[1,1,null,null,"G1.1","FENERBAHÇE (A) (İST)",null,null,1,"1.1",1,"FENERBAHÇE (A) (İST)","G1.1","İSTANBUL"]
[2,256,null,null,"G2.1","YALOVA BLD. GENÇLİK SPOR (A) (YLV)",null,null,2,null,32,"BEYKOZ BLD. SPOR (A) (İST)","G1.2","İSTANBUL"]
["3-4",128,null,null,"G3.1","İSTANBUL DSİ (A) (İST)",9.7973823547363281E-2,null,3,null,29,"LÜLEBURGAZ ZİRVE SPOR (A) (KRL)","G4.2","KIRKLARELİ"]
["3-4",129,null,null,"G4.1","YILDIZ RAKETLER (A) (İST)",0.42845636606216431,null,4,"33/128",{"$error":"#N/A"},{"$error":"#N/A"},"G128.1",0]
["5-6",65,null,null,"G5.1","PENDİK BLD. SPOR (A) (İST)",null,null,5,"33/128",{"$error":"#N/A"},{"$error":"#N/A"},"G65.1",0]
["5-6",192,null,null,"G6.1","ÇERKEZKÖY BLD. GSK (A) (TKD)",null,null,6,null,28,"İBB SPOR (A) (İST)","G5.2","İSTANBUL"]
["7-8",64,null,null,"G8.1","EDİRNE YURDUM SPOR (A) (EDR)",null,null,7,null,7,"PENDİK BLD. SPOR (B) (İST)","G7.2","İSTANBUL"]
["7-8",193,null,null,"G7.1","BURSA B. ŞEH. BLD. SPOR (A) (BRS)",null,null,8,"33/128",{"$error":"#N/A"},{"$error":"#N/A"},"G64.1",0]
["9-12",33,null,null,"G9.1","İSTANBUL DSİ (B) (İST)",null,null,9,"33/128",{"$error":"#N/A"},{"$error":"#N/A"},"G33.1",0]
["9-12",224,null,null,"G10.1","TRAKER SPOR (A) (KRL)",null,null,10,null,24,"ULUDAĞ OKSİJEN SPOR (A) (BRS)","G9.2","BURSA"]
["9-12",96,null,null,"G11.1","YALOVA BLD. GENÇLİK SPOR (B) (YLV)",null,null,11,null,21,"BOYBEYİ SPOR (A) (SKR)","G12.2","SAKARYA"]
["9-12",161,null,null,"G12.1","D.S.İ. BENT SPOR (A) (ESK)",null,null,12,"33/128",{"$error":"#N/A"},{"$error":"#N/A"},"G95.1",0]
["13-16",97,null,null,"G13.1","LÜLEBURGAZ ZİRVE SPOR (B) (KRL)",null,null,13,"33/128",{"$error":"#N/A"},{"$error":"#N/A"},"G97.1",0]
["13-16",160,null,null,"G14.1","ÇAĞDAŞ KOLEJLİLER (A) (ESK)",null,null,14,null,20,"DERİNCE GSK (A) (KCL)","G13.2","KOCAELİ"]
["13-16",32,null,null,"G15.1","LÜLEBURGAZ GENÇLİK SPOR  (A) (KRL)",null,null,15,null,16,"TRAKER SPOR (B) (KRL)","G16.2","KIRKLARELİ"]
["13-16",225,null,null,"G16.1","YILDIZ RAKETLER (B) (İST)",null,null,16,"17/32.1",{"$error":"#N/A"},{"$error":"#N/A"},"G31.1",0]
["17-32",17,null,null,"G17.1",{"$error":"#N/A"},null,null,17,"17/32.1",{"$error":"#N/A"},{"$error":"#N/A"},"G17.1",0]
["17-32",240,null,null,"G18.1",{"$error":"#N/A"},null,null,18,null,{"$error":"#N/A"},{"$error":"#N/A"},"G17.2",0]
["17-32",112,null,null,"G19.1",{"$error":"#N/A"},null,null,19,null,{"$error":"#N/A"},{"$error":"#N/A"},"G20.2",0]
["17-32",145,null,null,"G20.1",{"$error":"#N/A"},null,null,20,"33/128",{"$error":"#N/A"},{"$error":"#N/A"},"G111.1",0]
["17-32",81,null,null,"G21.1",{"$error":"#N/A"},null,null,21,"33/128",{"$error":"#N/A"},{"$error":"#N/A"},"G81.1",0]
["17-32",176,null,null,"G22.1",{"$error":"#N/A"},null,null,22,null,{"$error":"#N/A"},{"$error":"#N/A"},"G21.2",0]
["17-32",48,null,null,"G23.1",{"$error":"#N/A"},null,null,23,null,{"$error":"#N/A"},{"$error":"#N/A"},"G24.2",0]
["17-32",209,null,null,"G24.1",{"$error":"#N/A"},null,null,24,"33/128",{"$error":"#N/A"},{"$error":"#N/A"},"G47.1",0]
["17-32",49,null,null,"G25.1",{"$error":"#N/A"},null,null,25,"33/128",{"$error":"#N/A"},{"$error":"#N/A"},"G49.1",0]
["17-32",208,null,null,"G26.1",{"$error":"#N/A"},null,null,26,null,{"$error":"#N/A"},{"$error":"#N/A"},"G25.2",0]
["17-32",80,null,null,"G27.1",{"$error":"#N/A"},null,null,27,null,{"$error":"#N/A"},{"$error":"#N/A"},"G28.2",0]
["17-32",177,null,null,"G28.1",{"$error":"#N/A"},null,null,28,"33/128",{"$error":"#N/A"},{"$error":"#N/A"},"G79.1",0]
["17-32",113,null,null,"G29.1",{"$error":"#N/A"},null,null,29,"33/128",{"$error":"#N/A"},{"$error":"#N/A"},"G113.1",0]
["17-32",144,null,null,"G30.1",{"$error":"#N/A"},null,null,30,null,{"$error":"#N/A"},{"$error":"#N/A"},"G29.2",0]
["17-32",16,null,null,"G31.1",{"$error":"#N/A"},null,null,31,null,{"$error":"#N/A"},{"$error":"#N/A"},"G32.2",0]
["17-32",241,null,null,"G32.1",{"$error":"#N/A"},null,null,32,"13/16.1",15,"LÜLEBURGAZ GENÇLİK SPOR  (A) (KRL)","G15.1","KIRKLARELİ"]
["33-128",9,null,null,"G33.1",{"$error":"#N/A"},null,null,33,"9/12.1",9,"İSTANBUL DSİ (B) (İST)","G9.1","İSTANBUL"]
["33-128",248,null,null,"G34.1",{"$error":"#N/A"},null,null,34,null,{"$error":"#N/A"},{"$error":"#N/A"},"G33.2",0]
["33-128",120,null,null,"G35.1",{"$error":"#N/A"},null,null,35,null,{"$error":"#N/A"},{"$error":"#N/A"},"G36.2",0]
["33-128",137,null,null,"G36.1",{"$error":"#N/A"},null,null,36,"33/128",{"$error":"#N/A"},{"$error":"#N/A"},"G119.1",0]
["33-128",73,null,null,"G37.1",{"$error":"#N/A"},null,null,37,"33/128",{"$error":"#N/A"},{"$error":"#N/A"},"G73.1",0]
["33-128",184,null,null,"G38.1",{"$error":"#N/A"},null,null,38,null,{"$error":"#N/A"},{"$error":"#N/A"},"G37.2",0]
["33-128",56,null,null,"G39.1",{"$error":"#N/A"},null,null,39,null,{"$error":"#N/A"},{"$error":"#N/A"},"G40.2",0]
["33-128",201,null,null,"G40.1",{"$error":"#N/A"},null,null,40,"33/128",{"$error":"#N/A"},{"$error":"#N/A"},"G55.1",0]
["33-128",41,null,null,"G41.1",{"$error":"#N/A"},null,null,41,"33/128",{"$error":"#N/A"},{"$error":"#N/A"},"G41.1",0]
["33-128",216,null,null,"G42.1",{"$error":"#N/A"},null,null,42,null,{"$error":"#N/A"},{"$error":"#N/A"},"G41.2",0]
["33-128",88,null,null,"G43.1",{"$error":"#N/A"},null,null,43,null,{"$error":"#N/A"},{"$error":"#N/A"},"G44.2",0]
["33-128",169,null,null,"G44.1",{"$error":"#N/A"},null,null,44,"33/128",{"$error":"#N/A"},{"$error":"#N/A"},"G87.1",0]
["33-128",105,null,null,"G45.1",{"$error":"#N/A"},null,null,45,"33/128",{"$error":"#N/A"},{"$error":"#N/A"},"G105.1",0]
["33-128",152,null,null,"G46.1",{"$error":"#N/A"},null,null,46,null,{"$error":"#N/A"},{"$error":"#N/A"},"G45.2",0]
["33-128",24,null,null,"G47.1",{"$error":"#N/A"},null,null,47,null,{"$error":"#N/A"},{"$error":"#N/A"},"G48.2",0]
["33-128",233,null,null,"G48.1",{"$error":"#N/A"},null,null,48,"17/32.1",{"$error":"#N/A"},{"$error":"#N/A"},"G23.1",0]
["33-128",25,null,null,"G49.1",{"$error":"#N/A"},null,null,49,"17/32.1",{"$error":"#N/A"},{"$error":"#N/A"},"G25.1",0]
["33-128",232,null,null,"G50.1",{"$error":"#N/A"},null,null,50,null,{"$error":"#N/A"},{"$error":"#N/A"},"G49.2",0]
["33-128",104,null,null,"G51.1",{"$error":"#N/A"},null,null,51,null,{"$error":"#N/A"},{"$error":"#N/A"},"G52.2",0]
["33-128",153,null,null,"G52.1",{"$error":"#N/A"},null,null,52,"33/128",{"$error":"#N/A"},{"$error":"#N/A"},"G103.1",0]
["33-128",89,null,null,"G53.1",{"$error":"#N/A"},null,null,53,"33/128",{"$error":"#N/A"},{"$error":"#N/A"},"G89.1",0]
["33-128",168,null,null,"G54.1",{"$error":"#N/A"},null,null,54,null,{"$error":"#N/A"},{"$error":"#N/A"},"G53.2",0]
["33-128",40,null,null,"G55.1",{"$error":"#N/A"},null,null,55,null,{"$error":"#N/A"},{"$error":"#N/A"},"G56.2",0]
["33-128",217,null,null,"G56.1",{"$error":"#N/A"},null,null,56,"33/128",{"$error":"#N/A"},{"$error":"#N/A"},"G39.1",0]
["33-128",57,null,null,"G57.1",{"$error":"#N/A"},null,null,57,"33/128",{"$error":"#N/A"},{"$error":"#N/A"},"G57.1",0]
["33-128",200,null,null,"G58.1",{"$error":"#N/A"},null,null,58,null,{"$error":"#N/A"},{"$error":"#N/A"},"G57.2",0]
["33-128",72,null,null,"G59.1",{"$error":"#N/A"},null,null,59,null,{"$error":"#N/A"},{"$error":"#N/A"},"G60.2",0]
["33-128",185,null,null,"G60.1",{"$error":"#N/A"},null,null,60,"33/128",{"$error":"#N/A"},{"$error":"#N/A"},"G71.1",0]
["33-128",121,null,null,"G61.1",{"$error":"#N/A"},null,null,61,"33/128",{"$error":"#N/A"},{"$error":"#N/A"},"G121.1",0]
["33-128",136,null,null,"G62.1",{"$error":"#N/A"},null,null,62,null,{"$error":"#N/A"},{"$error":"#N/A"},"G61.2",0]
["33-128",249,null,null,"G63.1",{"$error":"#N/A"},null,null,63,null,{"$error":"#N/A"},{"$error":"#N/A"},"G64.2",0]
["33-128",8,null,null,"G64.1",{"$error":"#N/A"},null,null,64,"7/8.1",8,"EDİRNE YURDUM SPOR (A) (EDR)","G8.1","EDİRNE"]
["33-128",5,null,null,"G65.1",{"$error":"#N/A"},null,null,65,"5/6.1",5,"PENDİK BLD. SPOR (A) (İST)","G5.1","İSTANBUL"]
["33-128",252,null,null,"G66.1",{"$error":"#N/A"},null,null,66,null,{"$error":"#N/A"},{"$error":"#N/A"},"G64.2",0]
["33-128",124,null,null,"G67.1",{"$error":"#N/A"},null,null,67,null,{"$error":"#N/A"},{"$error":"#N/A"},"G64.2",0]
["33-128",133,null,null,"G68.1",{"$error":"#N/A"},null,null,68,"33/128",{"$error":"#N/A"},{"$error":"#N/A"},"G123.1",0]
["33-128",69,null,null,"G69.1",{"$error":"#N/A"},null,null,69,"33/128",{"$error":"#N/A"},{"$error":"#N/A"},"G69.1",0]
["33-128",188,null,null,"G70.1",{"$error":"#N/A"},null,null,70,null,{"$error":"#N/A"},{"$error":"#N/A"},"G64.2",0]
["33-128",60,null,null,"G71.1",{"$error":"#N/A"},null,null,71,null,{"$error":"#N/A"},{"$error":"#N/A"},"G64.2",0]
["33-128",197,null,null,"G72.1",{"$error":"#N/A"},null,null,72,"33/128",{"$error":"#N/A"},{"$error":"#N/A"},"G59.1",0]
["33-128",37,null,null,"G73.1",{"$error":"#N/A"},null,null,73,"33/128",{"$error":"#N/A"},{"$error":"#N/A"},"G37.1",0]
["33-128",220,null,null,"G74.1",{"$error":"#N/A"},null,null,74,null,{"$error":"#N/A"},{"$error":"#N/A"},"G64.2",0]
["33-128",92,null,null,"G75.1",{"$error":"#N/A"},null,null,75,null,{"$error":"#N/A"},{"$error":"#N/A"},"G64.2",0]
["33-128",165,null,null,"G76.1",{"$error":"#N/A"},null,null,76,"33/128",{"$error":"#N/A"},{"$error":"#N/A"},"G91.1",0]
["33-128",101,null,null,"G77.1",{"$error":"#N/A"},null,null,77,"33/128",{"$error":"#N/A"},{"$error":"#N/A"},"G101.1",0]
["33-128",156,null,null,"G78.1",{"$error":"#N/A"},null,null,78,null,{"$error":"#N/A"},{"$error":"#N/A"},"G64.2",0]
["33-128",28,null,null,"G79.1",{"$error":"#N/A"},null,null,79,null,{"$error":"#N/A"},{"$error":"#N/A"},"G64.2",0]
["33-128",229,null,null,"G80.1",{"$error":"#N/A"},null,null,80,"17/32.1",{"$error":"#N/A"},{"$error":"#N/A"},"G27.1",0]
["33-128",21,null,null,"G81.1",{"$error":"#N/A"},null,null,81,"17/32.1",{"$error":"#N/A"},{"$error":"#N/A"},"G21.1",0]
["33-128",236,null,null,"G82.1",{"$error":"#N/A"},null,null,82,null,{"$error":"#N/A"},{"$error":"#N/A"},"G64.2",0]
["33-128",108,null,null,"G83.1",{"$error":"#N/A"},null,null,83,null,{"$error":"#N/A"},{"$error":"#N/A"},"G64.2",0]
["33-128",149,null,null,"G84.1",{"$error":"#N/A"},null,null,84,"33/128",{"$error":"#N/A"},{"$error":"#N/A"},"G107.1",0]
["33-128",85,null,null,"G85.1",{"$error":"#N/A"},null,null,85,"33/128",{"$error":"#N/A"},{"$error":"#N/A"},"G85.1",0]
["33-128",172,null,null,"G86.1",{"$error":"#N/A"},null,null,86,null,{"$error":"#N/A"},{"$error":"#N/A"},"G64.2",0]
["33-128",44,null,null,"G87.1",{"$error":"#N/A"},null,null,87,null,{"$error":"#N/A"},{"$error":"#N/A"},"G64.2",0]
["33-128",213,null,null,"G88.1",{"$error":"#N/A"},null,null,88,"33/128",{"$error":"#N/A"},{"$error":"#N/A"},"G43.1",0]
["33-128",53,null,null,"G89.1",{"$error":"#N/A"},null,null,89,"33/128",{"$error":"#N/A"},{"$error":"#N/A"},"G53.1",0]
["33-128",204,null,null,"G90.1",{"$error":"#N/A"},null,null,90,null,{"$error":"#N/A"},{"$error":"#N/A"},"G64.2",0]
["33-128",76,null,null,"G91.1",{"$error":"#N/A"},null,null,91,null,{"$error":"#N/A"},{"$error":"#N/A"},"G64.2",0]
["33-128",181,null,null,"G92.1",{"$error":"#N/A"},null,null,92,"33/128",{"$error":"#N/A"},{"$error":"#N/A"},"G75.1",0]
["33-128",117,null,null,"G93.1",{"$error":"#N/A"},null,null,93,"33/128",{"$error":"#N/A"},{"$error":"#N/A"},"G117.1",0]
["33-128",140,null,null,"G94.1",{"$error":"#N/A"},null,null,94,null,{"$error":"#N/A"},{"$error":"#N/A"},"G64.2",0]
["33-128",12,null,null,"G95.1",{"$error":"#N/A"},null,null,95,null,{"$error":"#N/A"},{"$error":"#N/A"},"G64.2",0]
["33-128",245,null,null,"G96.1",{"$error":"#N/A"},null,null,96,"9/12.1",11,"YALOVA BLD. GENÇLİK SPOR (B) (YLV)","G11.1","YALOVA"]
["33-128",13,null,null,"G97.1",{"$error":"#N/A"},null,null,97,"13/16.1",13,"LÜLEBURGAZ ZİRVE SPOR (B) (KRL)","G13.1","KIRKLARELİ"]
["33-128",244,null,null,"G98.1",{"$error":"#N/A"},null,null,98,null,{"$error":"#N/A"},{"$error":"#N/A"},"G64.2",0]
["33-128",116,null,null,"G99.1",{"$error":"#N/A"},null,null,99,null,{"$error":"#N/A"},{"$error":"#N/A"},"G64.2",0]
["33-128",141,null,null,"G100.1",{"$error":"#N/A"},null,null,100,"33/128",{"$error":"#N/A"},{"$error":"#N/A"},"G115.1",0]
["33-128",77,null,null,"G101.1",{"$error":"#N/A"},null,null,101,"33/128",{"$error":"#N/A"},{"$error":"#N/A"},"G77.1",0]
["33-128",180,null,null,"G102.1",{"$error":"#N/A"},null,null,102,null,{"$error":"#N/A"},{"$error":"#N/A"},"G64.2",0]
["33-128",52,null,null,"G103.1",{"$error":"#N/A"},null,null,103,null,{"$error":"#N/A"},{"$error":"#N/A"},"G64.2",0]
["33-128",205,null,null,"G104.1",{"$error":"#N/A"},null,null,104,"33/128",{"$error":"#N/A"},{"$error":"#N/A"},"G51.1",0]
["33-128",45,null,null,"G105.1",{"$error":"#N/A"},null,null,105,"33/128",{"$error":"#N/A"},{"$error":"#N/A"},"G45.1",0]
["33-128",212,null,null,"G106.1",{"$error":"#N/A"},null,null,106,null,{"$error":"#N/A"},{"$error":"#N/A"},"G64.2",0]
["33-128",84,null,null,"G107.1",{"$error":"#N/A"},null,null,107,null,{"$error":"#N/A"},{"$error":"#N/A"},"G64.2",0]
["33-128",173,null,null,"G108.1",{"$error":"#N/A"},null,null,108,"33/128",{"$error":"#N/A"},{"$error":"#N/A"},"G83.1",0]
["33-128",109,null,null,"G109.1",{"$error":"#N/A"},null,null,109,"33/128",{"$error":"#N/A"},{"$error":"#N/A"},"G109.1",0]
["33-128",148,null,null,"G110.1",{"$error":"#N/A"},null,null,110,null,{"$error":"#N/A"},{"$error":"#N/A"},"G64.2",0]
["33-128",20,null,null,"G111.1",{"$error":"#N/A"},null,null,111,null,{"$error":"#N/A"},{"$error":"#N/A"},"G64.2",0]
["33-128",237,null,null,"G112.1",{"$error":"#N/A"},null,null,112,"17/32.1",{"$error":"#N/A"},{"$error":"#N/A"},"G19.1",0]
["33-128",29,null,null,"G113.1",{"$error":"#N/A"},null,null,113,"17/32.1",{"$error":"#N/A"},{"$error":"#N/A"},"G29.1",0]
["33-128",228,null,null,"G114.1",{"$error":"#N/A"},null,null,114,null,{"$error":"#N/A"},{"$error":"#N/A"},"G64.2",0]
["33-128",100,null,null,"G115.1",{"$error":"#N/A"},null,null,115,null,{"$error":"#N/A"},{"$error":"#N/A"},"G64.2",0]
["33-128",157,null,null,"G116.1",{"$error":"#N/A"},null,null,116,"33/128",{"$error":"#N/A"},{"$error":"#N/A"},"G99.1",0]
["33-128",93,null,null,"G117.1",{"$error":"#N/A"},null,null,117,"33/128",{"$error":"#N/A"},{"$error":"#N/A"},"G93.1",0]
["33-128",164,null,null,"G118.1",{"$error":"#N/A"},null,null,118,null,{"$error":"#N/A"},{"$error":"#N/A"},"G64.2",0]
["33-128",36,null,null,"G119.1",{"$error":"#N/A"},null,null,119,null,{"$error":"#N/A"},{"$error":"#N/A"},"G64.2",0]
["33-128",221,null,null,"G120.1",{"$error":"#N/A"},null,null,120,"33/128",{"$error":"#N/A"},{"$error":"#N/A"},"G35.1",0]
["33-128",61,null,null,"G121.1",{"$error":"#N/A"},null,null,121,"33/128",{"$error":"#N/A"},{"$error":"#N/A"},"G61.1",0]
["33-128",196,null,null,"G122.1",{"$error":"#N/A"},null,null,122,null,{"$error":"#N/A"},{"$error":"#N/A"},"G64.2",0]
["33-128",68,null,null,"G123.1",{"$error":"#N/A"},null,null,123,null,{"$error":"#N/A"},{"$error":"#N/A"},"G64.2",0]
["33-128",189,null,null,"G124.1",{"$error":"#N/A"},null,null,124,"33/128",{"$error":"#N/A"},{"$error":"#N/A"},"G67.1",0]
["33-128",125,null,null,"G125.1",{"$error":"#N/A"},null,null,125,"33/128",{"$error":"#N/A"},{"$error":"#N/A"},"G125.1",0]
["33-128",132,null,null,"G126.1",{"$error":"#N/A"},null,null,126,null,{"$error":"#N/A"},{"$error":"#N/A"},"G64.2",0]
["33-128",253,null,null,"G127.1",{"$error":"#N/A"},null,null,127,null,{"$error":"#N/A"},{"$error":"#N/A"},"G64.2",0]
["33-128",4,null,null,"G128.1",{"$error":"#N/A"},null,null,128,"3/4.1",3,"İSTANBUL DSİ (A) (İST)","G3.1","İSTANBUL"]
[]
[null,"Lower Group Runners-down (↓)",null,null,null,null,null,null,129,"3/4.1",4,"YILDIZ RAKETLER (A) (İST)","G4.1","İSTANBUL"]
[null,130,null,null,"G1.2","BEYKOZ BLD. SPOR (A) (İST)",null,null,130,null,32,"BEYKOZ BLD. SPOR (A) (İST)","G1.2","İSTANBUL"]
[null,131,null,null,"G4.2","LÜLEBURGAZ ZİRVE SPOR (A) (KRL)",null,null,131,null,29,"LÜLEBURGAZ ZİRVE SPOR (A) (KRL)","G4.2","KIRKLARELİ"]
[null,134,null,null,"G5.2","İBB SPOR (A) (İST)",null,null,132,"33/128",{"$error":"#N/A"},{"$error":"#N/A"},"G126.1",0]
[null,135,null,null,"G7.2","PENDİK BLD. SPOR (B) (İST)",null,null,133,"33/128",{"$error":"#N/A"},{"$error":"#N/A"},"G68.1",0]
[null,138,null,null,"G9.2","ULUDAĞ OKSİJEN SPOR (A) (BRS)",null,null,134,null,28,"İBB SPOR (A) (İST)","G5.2","İSTANBUL"]
[null,139,null,null,"G12.2","BOYBEYİ SPOR (A) (SKR)",null,null,135,null,7,"PENDİK BLD. SPOR (B) (İST)","G7.2","İSTANBUL"]
[null,142,null,null,"G13.2","DERİNCE GSK (A) (KCL)",null,null,136,"33/128",{"$error":"#N/A"},{"$error":"#N/A"},"G62.1",0]
[null,143,null,null,"G16.2","TRAKER SPOR (B) (KRL)",null,null,137,"33/128",{"$error":"#N/A"},{"$error":"#N/A"},"G36.1",0]
[null,146,null,null,"G17.2",{"$error":"#N/A"},null,null,138,null,24,"ULUDAĞ OKSİJEN SPOR (A) (BRS)","G9.2","BURSA"]
[null,147,null,null,"G20.2",{"$error":"#N/A"},null,null,139,null,21,"BOYBEYİ SPOR (A) (SKR)","G12.2","SAKARYA"]
[null,150,null,null,"G21.2",{"$error":"#N/A"},null,null,140,"33/128",{"$error":"#N/A"},{"$error":"#N/A"},"G94.1",0]
[null,151,null,null,"G24.2",{"$error":"#N/A"},null,null,141,"33/128",{"$error":"#N/A"},{"$error":"#N/A"},"G100.1",0]
[null,154,null,null,"G25.2",{"$error":"#N/A"},null,null,142,null,20,"DERİNCE GSK (A) (KCL)","G13.2","KOCAELİ"]
[null,155,null,null,"G28.2",{"$error":"#N/A"},null,null,143,null,16,"TRAKER SPOR (B) (KRL)","G16.2","KIRKLARELİ"]
[null,158,null,null,"G29.2",{"$error":"#N/A"},null,null,144,"17/32.1",{"$error":"#N/A"},{"$error":"#N/A"},"G30.1",0]
[null,159,null,null,"G32.2",{"$error":"#N/A"},null,null,145,"17/32.1",{"$error":"#N/A"},{"$error":"#N/A"},"G20.1",0]
[null,162,null,null,"G33.2",{"$error":"#N/A"},null,null,146,null,{"$error":"#N/A"},{"$error":"#N/A"},"G17.2",0]
[null,163,null,null,"G36.2",{"$error":"#N/A"},null,null,147,null,{"$error":"#N/A"},{"$error":"#N/A"},"G20.2",0]
[null,166,null,null,"G37.2",{"$error":"#N/A"},null,null,148,"33/128",{"$error":"#N/A"},{"$error":"#N/A"},"G110.1",0]
[null,167,null,null,"G40.2",{"$error":"#N/A"},null,null,149,"33/128",{"$error":"#N/A"},{"$error":"#N/A"},"G84.1",0]
[null,170,null,null,"G41.2",{"$error":"#N/A"},null,null,150,null,{"$error":"#N/A"},{"$error":"#N/A"},"G21.2",0]
[null,171,null,null,"G44.2",{"$error":"#N/A"},null,null,151,null,{"$error":"#N/A"},{"$error":"#N/A"},"G24.2",0]
[null,174,null,null,"G45.2",{"$error":"#N/A"},null,null,152,"33/128",{"$error":"#N/A"},{"$error":"#N/A"},"G46.1",0]
[null,175,null,null,"G48.2",{"$error":"#N/A"},null,null,153,"33/128",{"$error":"#N/A"},{"$error":"#N/A"},"G52.1",0]
[null,178,null,null,"G49.2",{"$error":"#N/A"},null,null,154,null,{"$error":"#N/A"},{"$error":"#N/A"},"G25.2",0]
[null,179,null,null,"G52.2",{"$error":"#N/A"},null,null,155,null,{"$error":"#N/A"},{"$error":"#N/A"},"G28.2",0]
[null,182,null,null,"G53.2",{"$error":"#N/A"},null,null,156,"33/128",{"$error":"#N/A"},{"$error":"#N/A"},"G78.1",0]
[null,183,null,null,"G56.2",{"$error":"#N/A"},null,null,157,"33/128",{"$error":"#N/A"},{"$error":"#N/A"},"G116.1",0]
[null,186,null,null,"G57.2",{"$error":"#N/A"},null,null,158,null,{"$error":"#N/A"},{"$error":"#N/A"},"G29.2",0]
[null,187,null,null,"G60.2",{"$error":"#N/A"},null,null,159,null,{"$error":"#N/A"},{"$error":"#N/A"},"G32.2",0]
[null,190,null,null,"G61.2",{"$error":"#N/A"},null,null,160,"13/16.1",19,"ÇAĞDAŞ KOLEJLİLER (A) (ESK)","G14.1","ESKİŞEHİR"]
[null,191,null,null,"G64.2",{"$error":"#N/A"},null,null,161,"9/12.1",12,"D.S.İ. BENT SPOR (A) (ESK)","G12.1","ESKİŞEHİR"]
[null,194,null,null,"G64.2",{"$error":"#N/A"},null,null,162,null,{"$error":"#N/A"},{"$error":"#N/A"},"G33.2",0]
[null,195,null,null,"G64.2",{"$error":"#N/A"},null,null,163,null,{"$error":"#N/A"},{"$error":"#N/A"},"G36.2",0]
[null,198,null,null,"G64.2",{"$error":"#N/A"},null,null,164,"33/128",{"$error":"#N/A"},{"$error":"#N/A"},"G118.1",0]
[null,199,null,null,"G64.2",{"$error":"#N/A"},null,null,165,"33/128",{"$error":"#N/A"},{"$error":"#N/A"},"G76.1",0]
[null,202,null,null,"G64.2",{"$error":"#N/A"},null,null,166,null,{"$error":"#N/A"},{"$error":"#N/A"},"G37.2",0]
[null,203,null,null,"G64.2",{"$error":"#N/A"},null,null,167,null,{"$error":"#N/A"},{"$error":"#N/A"},"G40.2",0]
[null,206,null,null,"G64.2",{"$error":"#N/A"},null,null,168,"33/128",{"$error":"#N/A"},{"$error":"#N/A"},"G54.1",0]
[null,207,null,null,"G64.2",{"$error":"#N/A"},null,null,169,"33/128",{"$error":"#N/A"},{"$error":"#N/A"},"G44.1",0]
[null,210,null,null,"G64.2",{"$error":"#N/A"},null,null,170,null,{"$error":"#N/A"},{"$error":"#N/A"},"G41.2",0]
[null,211,null,null,"G64.2",{"$error":"#N/A"},null,null,171,null,{"$error":"#N/A"},{"$error":"#N/A"},"G44.2",0]
[null,214,null,null,"G64.2",{"$error":"#N/A"},null,null,172,"33/128",{"$error":"#N/A"},{"$error":"#N/A"},"G86.1",0]
[null,215,null,null,"G64.2",{"$error":"#N/A"},null,null,173,"33/128",{"$error":"#N/A"},{"$error":"#N/A"},"G108.1",0]
[null,218,null,null,"G64.2",{"$error":"#N/A"},null,null,174,null,{"$error":"#N/A"},{"$error":"#N/A"},"G45.2",0]
[null,219,null,null,"G64.2",{"$error":"#N/A"},null,null,175,null,{"$error":"#N/A"},{"$error":"#N/A"},"G48.2",0]
[null,222,null,null,"G64.2",{"$error":"#N/A"},null,null,176,"17/32.1",{"$error":"#N/A"},{"$error":"#N/A"},"G22.1",0]
[null,223,null,null,"G64.2",{"$error":"#N/A"},null,null,177,"17/32.1",{"$error":"#N/A"},{"$error":"#N/A"},"G28.1",0]
[null,226,null,null,"G64.2",{"$error":"#N/A"},null,null,178,null,{"$error":"#N/A"},{"$error":"#N/A"},"G49.2",0]
[null,227,null,null,"G64.2",{"$error":"#N/A"},null,null,179,null,{"$error":"#N/A"},{"$error":"#N/A"},"G52.2",0]
[null,230,null,null,"G64.2",{"$error":"#N/A"},null,null,180,"33/128",{"$error":"#N/A"},{"$error":"#N/A"},"G102.1",0]
[null,231,null,null,"G64.2",{"$error":"#N/A"},null,null,181,"33/128",{"$error":"#N/A"},{"$error":"#N/A"},"G92.1",0]
[null,234,null,null,"G64.2",{"$error":"#N/A"},null,null,182,null,{"$error":"#N/A"},{"$error":"#N/A"},"G53.2",0]
[null,235,null,null,"G64.2",{"$error":"#N/A"},null,null,183,null,{"$error":"#N/A"},{"$error":"#N/A"},"G56.2",0]
[null,238,null,null,"G64.2",{"$error":"#N/A"},null,null,184,"33/128",{"$error":"#N/A"},{"$error":"#N/A"},"G38.1",0]
[null,239,null,null,"G64.2",{"$error":"#N/A"},null,null,185,"33/128",{"$error":"#N/A"},{"$error":"#N/A"},"G60.1",0]
[null,242,null,null,"G64.2",{"$error":"#N/A"},null,null,186,null,{"$error":"#N/A"},{"$error":"#N/A"},"G57.2",0]
[null,243,null,null,"G64.2",{"$error":"#N/A"},null,null,187,null,{"$error":"#N/A"},{"$error":"#N/A"},"G60.2",0]
[null,246,null,null,"G64.2",{"$error":"#N/A"},null,null,188,"33/128",{"$error":"#N/A"},{"$error":"#N/A"},"G70.1",0]
[null,247,null,null,"G64.2",{"$error":"#N/A"},null,null,189,"33/128",{"$error":"#N/A"},{"$error":"#N/A"},"G124.1",0]
[null,250,null,null,"G64.2",{"$error":"#N/A"},null,null,190,null,{"$error":"#N/A"},{"$error":"#N/A"},"G61.2",0]
[null,251,null,null,"G64.2",{"$error":"#N/A"},null,null,191,null,{"$error":"#N/A"},{"$error":"#N/A"},"G64.2",0]
[null,254,null,null,"G64.2",{"$error":"#N/A"},null,null,192,"5/6.1",6,"ÇERKEZKÖY BLD. GSK (A) (TKD)","G6.1","TEKİRDAĞ"]
[null,255,null,null,"G64.2",{"$error":"#N/A"},null,null,193,"7/8.1",26,"BURSA B. ŞEH. BLD. SPOR (A) (BRS)","G7.1","BURSA"]
[null,null,null,null,null,null,null,null,194,null,{"$error":"#N/A"},{"$error":"#N/A"},"G64.2",0]
[null,"Upper Group Runners-up (↑)",null,null,null,null,null,null,195,null,{"$error":"#N/A"},{"$error":"#N/A"},"G64.2",0]
[null,2,null,null,"G1.2","BEYKOZ BLD. SPOR (A) (İST)",null,null,196,"33/128",{"$error":"#N/A"},{"$error":"#N/A"},"G122.1",0]
[null,3,null,null,"G4.2","LÜLEBURGAZ ZİRVE SPOR (A) (KRL)",null,null,197,"33/128",{"$error":"#N/A"},{"$error":"#N/A"},"G72.1",0]
[null,6,null,null,"G5.2","İBB SPOR (A) (İST)",null,null,198,null,{"$error":"#N/A"},{"$error":"#N/A"},"G64.2",0]
[null,7,null,null,"G7.2","PENDİK BLD. SPOR (B) (İST)",null,null,199,null,{"$error":"#N/A"},{"$error":"#N/A"},"G64.2",0]
[null,10,null,null,"G9.2","ULUDAĞ OKSİJEN SPOR (A) (BRS)",null,null,200,"33/128",{"$error":"#N/A"},{"$error":"#N/A"},"G58.1",0]
[null,11,null,null,"G12.2","BOYBEYİ SPOR (A) (SKR)",null,null,201,"33/128",{"$error":"#N/A"},{"$error":"#N/A"},"G40.1",0]
[null,14,null,null,"G13.2","DERİNCE GSK (A) (KCL)",null,null,202,null,{"$error":"#N/A"},{"$error":"#N/A"},"G64.2",0]
[null,15,null,null,"G16.2","TRAKER SPOR (B) (KRL)",null,null,203,null,{"$error":"#N/A"},{"$error":"#N/A"},"G64.2",0]
[null,18,null,null,"G17.2",{"$error":"#N/A"},null,null,204,"33/128",{"$error":"#N/A"},{"$error":"#N/A"},"G90.1",0]
[null,19,null,null,"G20.2",{"$error":"#N/A"},null,null,205,"33/128",{"$error":"#N/A"},{"$error":"#N/A"},"G104.1",0]
[null,22,null,null,"G21.2",{"$error":"#N/A"},null,null,206,null,{"$error":"#N/A"},{"$error":"#N/A"},"G64.2",0]
[null,23,null,null,"G24.2",{"$error":"#N/A"},null,null,207,null,{"$error":"#N/A"},{"$error":"#N/A"},"G64.2",0]
[null,26,null,null,"G25.2",{"$error":"#N/A"},null,null,208,"17/32.1",{"$error":"#N/A"},{"$error":"#N/A"},"G26.1",0]
[null,27,null,null,"G28.2",{"$error":"#N/A"},null,null,209,"17/32.1",{"$error":"#N/A"},{"$error":"#N/A"},"G24.1",0]
[null,30,null,null,"G29.2",{"$error":"#N/A"},null,null,210,null,{"$error":"#N/A"},{"$error":"#N/A"},"G64.2",0]
[null,31,null,null,"G32.2",{"$error":"#N/A"},null,null,211,null,{"$error":"#N/A"},{"$error":"#N/A"},"G64.2",0]
[null,34,null,null,"G33.2",{"$error":"#N/A"},null,null,212,"33/128",{"$error":"#N/A"},{"$error":"#N/A"},"G106.1",0]
[null,35,null,null,"G36.2",{"$error":"#N/A"},null,null,213,"33/128",{"$error":"#N/A"},{"$error":"#N/A"},"G88.1",0]
[null,38,null,null,"G37.2",{"$error":"#N/A"},null,null,214,null,{"$error":"#N/A"},{"$error":"#N/A"},"G64.2",0]
[null,39,null,null,"G40.2",{"$error":"#N/A"},null,null,215,null,{"$error":"#N/A"},{"$error":"#N/A"},"G64.2",0]
[null,42,null,null,"G41.2",{"$error":"#N/A"},null,null,216,"33/128",{"$error":"#N/A"},{"$error":"#N/A"},"G42.1",0]
[null,43,null,null,"G44.2",{"$error":"#N/A"},null,null,217,"33/128",{"$error":"#N/A"},{"$error":"#N/A"},"G56.1",0]
[null,46,null,null,"G45.2",{"$error":"#N/A"},null,null,218,null,{"$error":"#N/A"},{"$error":"#N/A"},"G64.2",0]
[null,47,null,null,"G48.2",{"$error":"#N/A"},null,null,219,null,{"$error":"#N/A"},{"$error":"#N/A"},"G64.2",0]
[null,50,null,null,"G49.2",{"$error":"#N/A"},null,null,220,"33/128",{"$error":"#N/A"},{"$error":"#N/A"},"G74.1",0]
[null,51,null,null,"G52.2",{"$error":"#N/A"},null,null,221,"33/128",{"$error":"#N/A"},{"$error":"#N/A"},"G120.1",0]
[null,54,null,null,"G53.2",{"$error":"#N/A"},null,null,222,null,{"$error":"#N/A"},{"$error":"#N/A"},"G64.2",0]
[null,55,null,null,"G56.2",{"$error":"#N/A"},null,null,223,null,{"$error":"#N/A"},{"$error":"#N/A"},"G64.2",0]
[null,58,null,null,"G57.2",{"$error":"#N/A"},null,null,224,"9/12.1",10,"TRAKER SPOR (A) (KRL)","G10.1","KIRKLARELİ"]
[null,59,null,null,"G60.2",{"$error":"#N/A"},null,null,225,"13/16.1",17,"YILDIZ RAKETLER (B) (İST)","G16.1","İSTANBUL"]
[null,62,null,null,"G61.2",{"$error":"#N/A"},null,null,226,null,{"$error":"#N/A"},{"$error":"#N/A"},"G64.2",0]
[null,63,null,null,"G64.2",{"$error":"#N/A"},null,null,227,null,{"$error":"#N/A"},{"$error":"#N/A"},"G64.2",0]
[null,66,null,null,"G64.2",{"$error":"#N/A"},null,null,228,"33/128",{"$error":"#N/A"},{"$error":"#N/A"},"G114.1",0]
[null,67,null,null,"G64.2",{"$error":"#N/A"},null,null,229,"33/128",{"$error":"#N/A"},{"$error":"#N/A"},"G80.1",0]
[null,70,null,null,"G64.2",{"$error":"#N/A"},null,null,230,null,{"$error":"#N/A"},{"$error":"#N/A"},"G64.2",0]
[null,71,null,null,"G64.2",{"$error":"#N/A"},null,null,231,null,{"$error":"#N/A"},{"$error":"#N/A"},"G64.2",0]
[null,74,null,null,"G64.2",{"$error":"#N/A"},null,null,232,"33/128",{"$error":"#N/A"},{"$error":"#N/A"},"G50.1",0]
[null,75,null,null,"G64.2",{"$error":"#N/A"},null,null,233,"33/128",{"$error":"#N/A"},{"$error":"#N/A"},"G48.1",0]
[null,78,null,null,"G64.2",{"$error":"#N/A"},null,null,234,null,{"$error":"#N/A"},{"$error":"#N/A"},"G64.2",0]
[null,79,null,null,"G64.2",{"$error":"#N/A"},null,null,235,null,{"$error":"#N/A"},{"$error":"#N/A"},"G64.2",0]
[null,82,null,null,"G64.2",{"$error":"#N/A"},null,null,236,"33/128",{"$error":"#N/A"},{"$error":"#N/A"},"G82.1",0]
[null,83,null,null,"G64.2",{"$error":"#N/A"},null,null,237,"33/128",{"$error":"#N/A"},{"$error":"#N/A"},"G112.1",0]
[null,86,null,null,"G64.2",{"$error":"#N/A"},null,null,238,null,{"$error":"#N/A"},{"$error":"#N/A"},"G64.2",0]
[null,87,null,null,"G64.2",{"$error":"#N/A"},null,null,239,null,{"$error":"#N/A"},{"$error":"#N/A"},"G64.2",0]
[null,90,null,null,"G64.2",{"$error":"#N/A"},null,null,240,"17/32.1",{"$error":"#N/A"},{"$error":"#N/A"},"G18.1",0]
[null,91,null,null,"G64.2",{"$error":"#N/A"},null,null,241,"17/32.1",{"$error":"#N/A"},{"$error":"#N/A"},"G32.1",0]
[null,94,null,null,"G64.2",{"$error":"#N/A"},null,null,242,null,{"$error":"#N/A"},{"$error":"#N/A"},"G64.2",0]
[null,95,null,null,"G64.2",{"$error":"#N/A"},null,null,243,null,{"$error":"#N/A"},{"$error":"#N/A"},"G64.2",0]
[null,98,null,null,"G64.2",{"$error":"#N/A"},null,null,244,"33/128",{"$error":"#N/A"},{"$error":"#N/A"},"G98.1",0]
[null,99,null,null,"G64.2",{"$error":"#N/A"},null,null,245,"33/128",{"$error":"#N/A"},{"$error":"#N/A"},"G96.1",0]
[null,102,null,null,"G64.2",{"$error":"#N/A"},null,null,246,null,{"$error":"#N/A"},{"$error":"#N/A"},"G64.2",0]
[null,103,null,null,"G64.2",{"$error":"#N/A"},null,null,247,null,{"$error":"#N/A"},{"$error":"#N/A"},"G64.2",0]
[null,106,null,null,"G64.2",{"$error":"#N/A"},null,null,248,"33/128",{"$error":"#N/A"},{"$error":"#N/A"},"G34.1",0]
[null,107,null,null,"G64.2",{"$error":"#N/A"},null,null,249,"33/128",{"$error":"#N/A"},{"$error":"#N/A"},"G63.1",0]
[null,110,null,null,"G64.2",{"$error":"#N/A"},null,null,250,null,{"$error":"#N/A"},{"$error":"#N/A"},"G64.2",0]
[null,111,null,null,"G64.2",{"$error":"#N/A"},null,null,251,null,{"$error":"#N/A"},{"$error":"#N/A"},"G64.2",0]
[null,114,null,null,"G64.2",{"$error":"#N/A"},null,null,252,"33/128",{"$error":"#N/A"},{"$error":"#N/A"},"G66.1",0]
[null,115,null,null,"G64.2",{"$error":"#N/A"},null,null,253,"33/128",{"$error":"#N/A"},{"$error":"#N/A"},"G127.1",0]
[null,118,null,null,"G64.2",{"$error":"#N/A"},null,null,254,null,{"$error":"#N/A"},{"$error":"#N/A"},"G64.2",0]
[null,119,null,null,"G64.2",{"$error":"#N/A"},null,null,255,null,{"$error":"#N/A"},{"$error":"#N/A"},"G64.2",0]
[null,122,null,null,"G64.2",{"$error":"#N/A"},null,null,256,"2.1",2,"YALOVA BLD. GENÇLİK SPOR (A) (YLV)","G2.1","YALOVA"]
[null,123,null,null,"G64.2",{"$error":"#N/A"}]
[null,126,null,null,"G64.2",{"$error":"#N/A"}]
[null,127,null,null,"G64.2",{"$error":"#N/A"}]
[]
[]
[null,128]
[]
[null,"Place",null,"#","Group","Player",null,"Manuel",null,null,"S.No","Main table"]
[1,1,null,null,"G1.1","FENERBAHÇE (A) (İST)",null,null,1,"1.1",1,"FENERBAHÇE (A) (İST)","G1.1","İSTANBUL"]
[2,128,null,null,"G2.1","YALOVA BLD. GENÇLİK SPOR (A) (YLV)",null,null,2,null,31,"ESKİŞEHİR YURDUM SPOR (A) (ESK)","G2.2","ESKİŞEHİR"]
["3-4",65,null,null,"G3.1","İSTANBUL DSİ (A) (İST)",null,null,3,null,30,"B.B.KAĞITSPOR (A) (KCL)","G3.2","KOCAELİ"]
["3-4",64,null,null,"G4.1","YILDIZ RAKETLER (A) (İST)",null,null,4,"33/64.1",{"$error":"#N/A"},{"$error":"#N/A"},"G64.1",0]
["5-6",33,null,null,"G5.1","PENDİK BLD. SPOR (A) (İST)",null,null,5,"33/64.1",{"$error":"#N/A"},{"$error":"#N/A"},"G61.1",0]
["5-6",96,null,null,"G6.1","ÇERKEZKÖY BLD. GSK (A) (TKD)",null,null,6,null,27,"PENDİK BLD. SPOR (C) (İST)","G6.2","İSTANBUL"]
["7-8",97,null,null,"G8.1","EDİRNE YURDUM SPOR (A) (EDR)",null,null,7,null,25,"ULUDAĞ OKSİJEN SPOR (B) (BRS)","G8.2","BURSA"]
["7-8",32,null,null,"G7.1","BURSA B. ŞEH. BLD. SPOR (A) (BRS)",null,null,8,"17/32.1",{"$error":"#N/A"},{"$error":"#N/A"},"G28.1",0]
["9-12",17,null,null,"G9.1","İSTANBUL DSİ (B) (İST)",null,null,9,"17/32.1",{"$error":"#N/A"},{"$error":"#N/A"},"G25.1",0]
["9-12",112,null,null,"G10.1","TRAKER SPOR (A) (KRL)",null,null,10,null,23,"İBB SPOR (B) (İST)","G10.2","İSTANBUL"]
["9-12",81,null,null,"G11.1","YALOVA BLD. GENÇLİK SPOR (B) (YLV)",null,null,11,null,22,"GENÇ TRAKYA SPOR (A) (EDR)","G11.2","EDİRNE"]
["9-12",48,null,null,"G12.1","D.S.İ. BENT SPOR (A) (ESK)",null,null,12,"33/64.1",{"$error":"#N/A"},{"$error":"#N/A"},"G56.1",0]
["13-16",16,null,null,"G13.1","LÜLEBURGAZ ZİRVE SPOR (B) (KRL)",null,null,13,"33/64.1",{"$error":"#N/A"},{"$error":"#N/A"},"G53.1",0]
["13-16",113,null,null,"G14.1","ÇAĞDAŞ KOLEJLİLER (A) (ESK)",null,null,14,null,14,"KOCAELİ GSIM (B) (KCL)","G14.2","KOCAELİ"]
["13-16",80,null,null,"G15.1","LÜLEBURGAZ GENÇLİK SPOR  (A) (KRL)",null,null,15,null,18,"KOCAELİ GSIM (A) (KCL)","G15.2","KOCAELİ"]
["13-16",49,null,null,"G16.1","YILDIZ RAKETLER (B) (İST)",null,null,16,"13/16.1",13,"LÜLEBURGAZ ZİRVE SPOR (B) (KRL)","G13.1","KIRKLARELİ"]
["17-32",25,null,null,"G17.1",{"$error":"#N/A"},null,null,17,"9/12.1",9,"İSTANBUL DSİ (B) (İST)","G9.1","İSTANBUL"]
["17-32",104,null,null,"G18.1",{"$error":"#N/A"},null,null,18,null,{"$error":"#N/A"},{"$error":"#N/A"},"G18.2",0]
["17-32",105,null,null,"G19.1",{"$error":"#N/A"},null,null,19,null,{"$error":"#N/A"},{"$error":"#N/A"},"G19.2",0]
["17-32",24,null,null,"G20.1",{"$error":"#N/A"},null,null,20,"33/64.1",{"$error":"#N/A"},{"$error":"#N/A"},"G48.1",0]
["17-32",40,null,null,"G21.1",{"$error":"#N/A"},null,null,21,"33/64.1",{"$error":"#N/A"},{"$error":"#N/A"},"G45.1",0]
["17-32",89,null,null,"G22.1",{"$error":"#N/A"},null,null,22,null,{"$error":"#N/A"},{"$error":"#N/A"},"G22.2",0]
["17-32",88,null,null,"G23.1",{"$error":"#N/A"},null,null,23,null,{"$error":"#N/A"},{"$error":"#N/A"},"G23.2",0]
["17-32",41,null,null,"G24.1",{"$error":"#N/A"},null,null,24,"17/32.1",{"$error":"#N/A"},{"$error":"#N/A"},"G20.1",0]
["17-32",9,null,null,"G25.1",{"$error":"#N/A"},null,null,25,"17/32.1",{"$error":"#N/A"},{"$error":"#N/A"},"G17.1",0]
["17-32",120,null,null,"G26.1",{"$error":"#N/A"},null,null,26,null,{"$error":"#N/A"},{"$error":"#N/A"},"G26.2",0]
["17-32",121,null,null,"G27.1",{"$error":"#N/A"},null,null,27,null,{"$error":"#N/A"},{"$error":"#N/A"},"G27.2",0]
["17-32",8,null,null,"G28.1",{"$error":"#N/A"},null,null,28,"33/64.1",{"$error":"#N/A"},{"$error":"#N/A"},"G40.1",0]
["17-32",56,null,null,"G29.1",{"$error":"#N/A"},null,null,29,"33/64.1",{"$error":"#N/A"},{"$error":"#N/A"},"G37.1",0]
["17-32",73,null,null,"G30.1",{"$error":"#N/A"},null,null,30,null,{"$error":"#N/A"},{"$error":"#N/A"},"G30.2",0]
["17-32",72,null,null,"G31.1",{"$error":"#N/A"},null,null,31,null,{"$error":"#N/A"},{"$error":"#N/A"},"G31.2",0]
["17-32",57,null,null,"G32.1",{"$error":"#N/A"},null,null,32,"7/8.1",26,"BURSA B. ŞEH. BLD. SPOR (A) (BRS)","G7.1","BURSA"]
["33-64",36,null,null,"G33.1",{"$error":"#N/A"},null,null,33,"5/6.1",5,"PENDİK BLD. SPOR (A) (İST)","G5.1","İSTANBUL"]
["33-64",100,null,null,"G34.1",{"$error":"#N/A"},null,null,34,null,{"$error":"#N/A"},{"$error":"#N/A"},"G34.2",0]
["33-64",101,null,null,"G35.1",{"$error":"#N/A"},null,null,35,null,{"$error":"#N/A"},{"$error":"#N/A"},"G35.2",0]
["33-64",37,null,null,"G36.1",{"$error":"#N/A"},null,null,36,"33/64.1",{"$error":"#N/A"},{"$error":"#N/A"},"G33.1",0]
["33-64",29,null,null,"G37.1",{"$error":"#N/A"},null,null,37,"33/64.1",{"$error":"#N/A"},{"$error":"#N/A"},"G36.1",0]
["33-64",93,null,null,"G38.1",{"$error":"#N/A"},null,null,38,null,{"$error":"#N/A"},{"$error":"#N/A"},"G38.2",0]
["33-64",92,null,null,"G39.1",{"$error":"#N/A"},null,null,39,null,{"$error":"#N/A"},{"$error":"#N/A"},"G39.2",0]
["33-64",28,null,null,"G40.1",{"$error":"#N/A"},null,null,40,"17/32.1",{"$error":"#N/A"},{"$error":"#N/A"},"G21.1",0]
["33-64",44,null,null,"G41.1",{"$error":"#N/A"},null,null,41,"17/32.1",{"$error":"#N/A"},{"$error":"#N/A"},"G24.1",0]
["33-64",108,null,null,"G42.1",{"$error":"#N/A"},null,null,42,null,{"$error":"#N/A"},{"$error":"#N/A"},"G42.2",0]
["33-64",109,null,null,"G43.1",{"$error":"#N/A"},null,null,43,null,{"$error":"#N/A"},{"$error":"#N/A"},"G43.2",0]
["33-64",45,null,null,"G44.1",{"$error":"#N/A"},null,null,44,"33/64.1",{"$error":"#N/A"},{"$error":"#N/A"},"G41.1",0]
["33-64",21,null,null,"G45.1",{"$error":"#N/A"},null,null,45,"33/64.1",{"$error":"#N/A"},{"$error":"#N/A"},"G44.1",0]
["33-64",85,null,null,"G46.1",{"$error":"#N/A"},null,null,46,null,{"$error":"#N/A"},{"$error":"#N/A"},"G46.2",0]
["33-64",84,null,null,"G47.1",{"$error":"#N/A"},null,null,47,null,{"$error":"#N/A"},{"$error":"#N/A"},"G47.2",0]
["33-64",20,null,null,"G48.1",{"$error":"#N/A"},null,null,48,"9/12.1",12,"D.S.İ. BENT SPOR (A) (ESK)","G12.1","ESKİŞEHİR"]
["33-64",52,null,null,"G49.1",{"$error":"#N/A"},null,null,49,"13/16.1",17,"YILDIZ RAKETLER (B) (İST)","G16.1","İSTANBUL"]
["33-64",116,null,null,"G50.1",{"$error":"#N/A"},null,null,50,null,{"$error":"#N/A"},{"$error":"#N/A"},"G50.2",0]
["33-64",117,null,null,"G51.1",{"$error":"#N/A"},null,null,51,null,{"$error":"#N/A"},{"$error":"#N/A"},"G51.2",0]
["33-64",53,null,null,"G52.1",{"$error":"#N/A"},null,null,52,"33/64.1",{"$error":"#N/A"},{"$error":"#N/A"},"G49.1",0]
["33-64",13,null,null,"G53.1",{"$error":"#N/A"},null,null,53,"33/64.1",{"$error":"#N/A"},{"$error":"#N/A"},"G52.1",0]
["33-64",77,null,null,"G54.1",{"$error":"#N/A"},null,null,54,null,{"$error":"#N/A"},{"$error":"#N/A"},"G54.2",0]
["33-64",76,null,null,"G55.1",{"$error":"#N/A"},null,null,55,null,{"$error":"#N/A"},{"$error":"#N/A"},"G55.2",0]
["33-64",12,null,null,"G56.1",{"$error":"#N/A"},null,null,56,"17/32.1",{"$error":"#N/A"},{"$error":"#N/A"},"G29.1",0]
["33-64",60,null,null,"G57.1",{"$error":"#N/A"},null,null,57,"17/32.1",{"$error":"#N/A"},{"$error":"#N/A"},"G32.1",0]
["33-64",124,null,null,"G58.1",{"$error":"#N/A"},null,null,58,null,{"$error":"#N/A"},{"$error":"#N/A"},"G58.2",0]
["33-64",125,null,null,"G59.1",{"$error":"#N/A"},null,null,59,null,{"$error":"#N/A"},{"$error":"#N/A"},"G59.2",0]
["33-64",61,null,null,"G60.1",{"$error":"#N/A"},null,null,60,"33/64.1",{"$error":"#N/A"},{"$error":"#N/A"},"G57.1",0]
["33-64",5,null,null,"G61.1",{"$error":"#N/A"},null,null,61,"33/64.1",{"$error":"#N/A"},{"$error":"#N/A"},"G60.1",0]
["33-64",69,null,null,"G62.1",{"$error":"#N/A"},null,null,62,null,{"$error":"#N/A"},{"$error":"#N/A"},"G62.2",0]
["33-64",68,null,null,"G63.1",{"$error":"#N/A"},null,null,63,null,{"$error":"#N/A"},{"$error":"#N/A"},"G63.2",0]
["33-64",4,null,null,"G64.1",{"$error":"#N/A"},null,null,64,"3/4.1",4,"YILDIZ RAKETLER (A) (İST)","G4.1","İSTANBUL"]
[]
[null,"Lower Group Runners-down (↓)",null,null,null,null,null,null,65,"3/4.1",3,"İSTANBUL DSİ (A) (İST)","G3.1","İSTANBUL"]
[null,66,null,null,"G1.2","BEYKOZ BLD. SPOR (A) (İST)",null,null,66,null,32,"BEYKOZ BLD. SPOR (A) (İST)","G1.2","İSTANBUL"]
[null,67,null,null,"G4.2","LÜLEBURGAZ ZİRVE SPOR (A) (KRL)",null,null,67,null,29,"LÜLEBURGAZ ZİRVE SPOR (A) (KRL)","G4.2","KIRKLARELİ"]
[null,70,null,null,"G5.2","İBB SPOR (A) (İST)",null,null,68,"33/64.1",{"$error":"#N/A"},{"$error":"#N/A"},"G63.1",0]
[null,71,null,null,"G7.2","PENDİK BLD. SPOR (B) (İST)",null,null,69,"33/64.1",{"$error":"#N/A"},{"$error":"#N/A"},"G62.1",0]
[null,74,null,null,"G9.2","ULUDAĞ OKSİJEN SPOR (A) (BRS)",null,null,70,null,28,"İBB SPOR (A) (İST)","G5.2","İSTANBUL"]
[null,75,null,null,"G12.2","BOYBEYİ SPOR (A) (SKR)",null,null,71,null,7,"PENDİK BLD. SPOR (B) (İST)","G7.2","İSTANBUL"]
[null,78,null,null,"G13.2","DERİNCE GSK (A) (KCL)",null,null,72,"17/32.1",{"$error":"#N/A"},{"$error":"#N/A"},"G31.1",0]
[null,79,null,null,"G16.2","TRAKER SPOR (B) (KRL)",null,null,73,"17/32.1",{"$error":"#N/A"},{"$error":"#N/A"},"G30.1",0]
[null,82,null,null,"G17.2",{"$error":"#N/A"},null,null,74,null,24,"ULUDAĞ OKSİJEN SPOR (A) (BRS)","G9.2","BURSA"]
[null,83,null,null,"G20.2",{"$error":"#N/A"},null,null,75,null,21,"BOYBEYİ SPOR (A) (SKR)","G12.2","SAKARYA"]
[null,86,null,null,"G21.2",{"$error":"#N/A"},null,null,76,"33/64.1",{"$error":"#N/A"},{"$error":"#N/A"},"G55.1",0]
[null,87,null,null,"G24.2",{"$error":"#N/A"},null,null,77,"33/64.1",{"$error":"#N/A"},{"$error":"#N/A"},"G54.1",0]
[null,90,null,null,"G25.2",{"$error":"#N/A"},null,null,78,null,20,"DERİNCE GSK (A) (KCL)","G13.2","KOCAELİ"]
[null,91,null,null,"G28.2",{"$error":"#N/A"},null,null,79,null,16,"TRAKER SPOR (B) (KRL)","G16.2","KIRKLARELİ"]
[null,94,null,null,"G29.2",{"$error":"#N/A"},null,null,80,"13/16.1",15,"LÜLEBURGAZ GENÇLİK SPOR  (A) (KRL)","G15.1","KIRKLARELİ"]
[null,95,null,null,"G32.2",{"$error":"#N/A"},null,null,81,"9/12.1",11,"YALOVA BLD. GENÇLİK SPOR (B) (YLV)","G11.1","YALOVA"]
[null,98,null,null,"G33.2",{"$error":"#N/A"},null,null,82,null,{"$error":"#N/A"},{"$error":"#N/A"},"G17.2",0]
[null,99,null,null,"G36.2",{"$error":"#N/A"},null,null,83,null,{"$error":"#N/A"},{"$error":"#N/A"},"G20.2",0]
[null,102,null,null,"G37.2",{"$error":"#N/A"},null,null,84,"33/64.1",{"$error":"#N/A"},{"$error":"#N/A"},"G47.1",0]
[null,103,null,null,"G40.2",{"$error":"#N/A"},null,null,85,"33/64.1",{"$error":"#N/A"},{"$error":"#N/A"},"G46.1",0]
[null,106,null,null,"G41.2",{"$error":"#N/A"},null,null,86,null,{"$error":"#N/A"},{"$error":"#N/A"},"G21.2",0]
[null,107,null,null,"G44.2",{"$error":"#N/A"},null,null,87,null,{"$error":"#N/A"},{"$error":"#N/A"},"G24.2",0]
[null,110,null,null,"G45.2",{"$error":"#N/A"},null,null,88,"17/32.1",{"$error":"#N/A"},{"$error":"#N/A"},"G23.1",0]
[null,111,null,null,"G48.2",{"$error":"#N/A"},null,null,89,"17/32.1",{"$error":"#N/A"},{"$error":"#N/A"},"G22.1",0]
[null,114,null,null,"G49.2",{"$error":"#N/A"},null,null,90,null,{"$error":"#N/A"},{"$error":"#N/A"},"G25.2",0]
[null,115,null,null,"G52.2",{"$error":"#N/A"},null,null,91,null,{"$error":"#N/A"},{"$error":"#N/A"},"G28.2",0]
[null,118,null,null,"G53.2",{"$error":"#N/A"},null,null,92,"33/64.1",{"$error":"#N/A"},{"$error":"#N/A"},"G39.1",0]
[null,119,null,null,"G56.2",{"$error":"#N/A"},null,null,93,"33/64.1",{"$error":"#N/A"},{"$error":"#N/A"},"G38.1",0]
[null,122,null,null,"G57.2",{"$error":"#N/A"},null,null,94,null,{"$error":"#N/A"},{"$error":"#N/A"},"G29.2",0]
[null,123,null,null,"G60.2",{"$error":"#N/A"},null,null,95,null,{"$error":"#N/A"},{"$error":"#N/A"},"G32.2",0]
[null,126,null,null,"G61.2",{"$error":"#N/A"},null,null,96,"5/6.1",6,"ÇERKEZKÖY BLD. GSK (A) (TKD)","G6.1","TEKİRDAĞ"]
[null,127,null,null,"G64.2",{"$error":"#N/A"},null,null,97,"7/8.1",8,"EDİRNE YURDUM SPOR (A) (EDR)","G8.1","EDİRNE"]
[null,null,null,null,null,null,null,null,98,null,{"$error":"#N/A"},{"$error":"#N/A"},"G33.2",0]
[null,"Upper Group Runners-up (↑)",null,null,null,null,null,null,99,null,{"$error":"#N/A"},{"$error":"#N/A"},"G36.2",0]
[null,2,null,null,"G2.2","ESKİŞEHİR YURDUM SPOR (A) (ESK)",null,null,100,"33/64.1",{"$error":"#N/A"},{"$error":"#N/A"},"G34.1",0]
[null,3,null,null,"G3.2","B.B.KAĞITSPOR (A) (KCL)",null,null,101,"33/64.1",{"$error":"#N/A"},{"$error":"#N/A"},"G35.1",0]
[null,6,null,null,"G6.2","PENDİK BLD. SPOR (C) (İST)",null,null,102,null,{"$error":"#N/A"},{"$error":"#N/A"},"G37.2",0]
[null,7,null,null,"G8.2","ULUDAĞ OKSİJEN SPOR (B) (BRS)",null,null,103,null,{"$error":"#N/A"},{"$error":"#N/A"},"G40.2",0]
[null,10,null,null,"G10.2","İBB SPOR (B) (İST)",null,null,104,"17/32.1",{"$error":"#N/A"},{"$error":"#N/A"},"G18.1",0]
[null,11,null,null,"G11.2","GENÇ TRAKYA SPOR (A) (EDR)",null,null,105,"17/32.1",{"$error":"#N/A"},{"$error":"#N/A"},"G19.1",0]
[null,14,null,null,"G14.2","KOCAELİ GSIM (B) (KCL)",null,null,106,null,{"$error":"#N/A"},{"$error":"#N/A"},"G41.2",0]
[null,15,null,null,"G15.2","KOCAELİ GSIM (A) (KCL)",null,null,107,null,{"$error":"#N/A"},{"$error":"#N/A"},"G44.2",0]
[null,18,null,null,"G18.2",{"$error":"#N/A"},null,null,108,"33/64.1",{"$error":"#N/A"},{"$error":"#N/A"},"G42.1",0]
[null,19,null,null,"G19.2",{"$error":"#N/A"},null,null,109,"33/64.1",{"$error":"#N/A"},{"$error":"#N/A"},"G43.1",0]
[null,22,null,null,"G22.2",{"$error":"#N/A"},null,null,110,null,{"$error":"#N/A"},{"$error":"#N/A"},"G45.2",0]
[null,23,null,null,"G23.2",{"$error":"#N/A"},null,null,111,null,{"$error":"#N/A"},{"$error":"#N/A"},"G48.2",0]
[null,26,null,null,"G26.2",{"$error":"#N/A"},null,null,112,"9/12.1",10,"TRAKER SPOR (A) (KRL)","G10.1","KIRKLARELİ"]
[null,27,null,null,"G27.2",{"$error":"#N/A"},null,null,113,"13/16.1",19,"ÇAĞDAŞ KOLEJLİLER (A) (ESK)","G14.1","ESKİŞEHİR"]
[null,30,null,null,"G30.2",{"$error":"#N/A"},null,null,114,null,{"$error":"#N/A"},{"$error":"#N/A"},"G49.2",0]
[null,31,null,null,"G31.2",{"$error":"#N/A"},null,null,115,null,{"$error":"#N/A"},{"$error":"#N/A"},"G52.2",0]
[null,34,null,null,"G34.2",{"$error":"#N/A"},null,null,116,"33/64.1",{"$error":"#N/A"},{"$error":"#N/A"},"G50.1",0]
[null,35,null,null,"G35.2",{"$error":"#N/A"},null,null,117,"33/64.1",{"$error":"#N/A"},{"$error":"#N/A"},"G51.1",0]
[null,38,null,null,"G38.2",{"$error":"#N/A"},null,null,118,null,{"$error":"#N/A"},{"$error":"#N/A"},"G53.2",0]
[null,39,null,null,"G39.2",{"$error":"#N/A"},null,null,119,null,{"$error":"#N/A"},{"$error":"#N/A"},"G56.2",0]
[null,42,null,null,"G42.2",{"$error":"#N/A"},null,null,120,"17/32.1",{"$error":"#N/A"},{"$error":"#N/A"},"G26.1",0]
[null,43,null,null,"G43.2",{"$error":"#N/A"},null,null,121,"17/32.1",{"$error":"#N/A"},{"$error":"#N/A"},"G27.1",0]
[null,46,null,null,"G46.2",{"$error":"#N/A"},null,null,122,null,{"$error":"#N/A"},{"$error":"#N/A"},"G57.2",0]
[null,47,null,null,"G47.2",{"$error":"#N/A"},null,null,123,null,{"$error":"#N/A"},{"$error":"#N/A"},"G60.2",0]
[null,50,null,null,"G50.2",{"$error":"#N/A"},null,null,124,"33/64.1",{"$error":"#N/A"},{"$error":"#N/A"},"G58.1",0]
[null,51,null,null,"G51.2",{"$error":"#N/A"},null,null,125,"33/64.1",{"$error":"#N/A"},{"$error":"#N/A"},"G59.1",0]
[null,54,null,null,"G54.2",{"$error":"#N/A"},null,null,126,null,{"$error":"#N/A"},{"$error":"#N/A"},"G61.2",0]
[null,55,null,null,"G55.2",{"$error":"#N/A"},null,null,127,null,{"$error":"#N/A"},{"$error":"#N/A"},"G64.2",0]
[null,58,null,null,"G58.2",{"$error":"#N/A"},null,null,128,"2.1",2,"YALOVA BLD. GENÇLİK SPOR (A) (YLV)","G2.1","YALOVA"]
[null,59,null,null,"G59.2",{"$error":"#N/A"}]
[null,62,null,null,"G62.2",{"$error":"#N/A"}]
[null,63,null,null,"G63.2",{"$error":"#N/A"}]
[]
[]
[null,64]
[]
[null,"Place",null,"#","Group","Player",null,"Manuel",null,null,"S.No","Main table"]
[1,1,null,null,"G1.1","FENERBAHÇE (A) (İST)",null,null,1,"1.1",1,"FENERBAHÇE (A) (İST)","G1.1","İSTANBUL"]
[2,64,null,null,"G2.1","YALOVA BLD. GENÇLİK SPOR (A) (YLV)",null,null,2,null,31,"ESKİŞEHİR YURDUM SPOR (A) (ESK)","G2.2","ESKİŞEHİR"]
["3-4",33,null,null,"G3.1","İSTANBUL DSİ (A) (İST)",null,null,3,null,30,"B.B.KAĞITSPOR (A) (KCL)","G3.2","KOCAELİ"]
["3-4",32,null,null,"G4.1","YILDIZ RAKETLER (A) (İST)",null,null,4,"17/32.1",{"$error":"#N/A"},{"$error":"#N/A"},"G32.1",0]
["5-6",17,null,null,"G5.1","PENDİK BLD. SPOR (A) (İST)",null,null,5,"17/32.1",{"$error":"#N/A"},{"$error":"#N/A"},"G29.1",0]
["5-6",48,null,null,"G6.1","ÇERKEZKÖY BLD. GSK (A) (TKD)",null,null,6,null,27,"PENDİK BLD. SPOR (C) (İST)","G6.2","İSTANBUL"]
["7-8",16,null,null,"G8.1","EDİRNE YURDUM SPOR (A) (EDR)",null,null,7,null,7,"PENDİK BLD. SPOR (B) (İST)","G7.2","İSTANBUL"]
["7-8",49,null,null,"G7.1","BURSA B. ŞEH. BLD. SPOR (A) (BRS)",null,null,8,"13/16.1",17,"YILDIZ RAKETLER (B) (İST)","G16.1","İSTANBUL"]
["9-12",9,null,null,"G9.1","İSTANBUL DSİ (B) (İST)",null,null,9,"9/12.1",9,"İSTANBUL DSİ (B) (İST)","G9.1","İSTANBUL"]
["9-12",56,null,null,"G10.1","TRAKER SPOR (A) (KRL)",null,null,10,null,23,"İBB SPOR (B) (İST)","G10.2","İSTANBUL"]
["9-12",41,null,null,"G11.1","YALOVA BLD. GENÇLİK SPOR (B) (YLV)",null,null,11,null,22,"GENÇ TRAKYA SPOR (A) (EDR)","G11.2","EDİRNE"]
["9-12",24,null,null,"G12.1","D.S.İ. BENT SPOR (A) (ESK)",null,null,12,"17/32.1",{"$error":"#N/A"},{"$error":"#N/A"},"G28.1",0]
["13-16",25,null,null,"G13.1","LÜLEBURGAZ ZİRVE SPOR (B) (KRL)",null,null,13,"17/32.1",{"$error":"#N/A"},{"$error":"#N/A"},"G25.1",0]
["13-16",40,null,null,"G14.1","ÇAĞDAŞ KOLEJLİLER (A) (ESK)",null,null,14,null,14,"KOCAELİ GSIM (B) (KCL)","G14.2","KOCAELİ"]
["13-16",57,null,null,"G15.1","LÜLEBURGAZ GENÇLİK SPOR  (A) (KRL)",null,null,15,null,18,"KOCAELİ GSIM (A) (KCL)","G15.2","KOCAELİ"]
["13-16",8,null,null,"G16.1","YILDIZ RAKETLER (B) (İST)",null,null,16,"7/8.1",8,"EDİRNE YURDUM SPOR (A) (EDR)","G8.1","EDİRNE"]
["17-32",29,null,null,"G17.1",{"$error":"#N/A"},3.819197416305542E-2,null,17,"5/6.1",5,"PENDİK BLD. SPOR (A) (İST)","G5.1","İSTANBUL"]
["17-32",36,null,null,"G18.1",{"$error":"#N/A"},0.11724323034286499,null,18,null,{"$error":"#N/A"},{"$error":"#N/A"},"G18.2",0]
["17-32",37,null,null,"G19.1",{"$error":"#N/A"},0.17354333400726318,null,19,null,{"$error":"#N/A"},{"$error":"#N/A"},"G19.2",0]
["17-32",28,null,null,"G20.1",{"$error":"#N/A"},0.34038853645324707,null,20,"17/32.1",{"$error":"#N/A"},{"$error":"#N/A"},"G24.1",0]
["17-32",21,null,null,"G21.1",{"$error":"#N/A"},0.35810422897338867,null,21,"17/32.1",{"$error":"#N/A"},{"$error":"#N/A"},"G21.1",0]
["17-32",44,null,null,"G22.1",{"$error":"#N/A"},0.41199654340744019,null,22,null,{"$error":"#N/A"},{"$error":"#N/A"},"G22.2",0]
["17-32",45,null,null,"G23.1",{"$error":"#N/A"},0.42553412914276123,null,23,null,{"$error":"#N/A"},{"$error":"#N/A"},"G23.2",0]
["17-32",20,null,null,"G24.1",{"$error":"#N/A"},0.43658334016799927,null,24,"9/12.1",12,"D.S.İ. BENT SPOR (A) (ESK)","G12.1","ESKİŞEHİR"]
["17-32",13,null,null,"G25.1",{"$error":"#N/A"},0.50674146413803101,null,25,"13/16.1",13,"LÜLEBURGAZ ZİRVE SPOR (B) (KRL)","G13.1","KIRKLARELİ"]
["17-32",52,null,null,"G26.1",{"$error":"#N/A"},0.54701143503189087,null,26,null,{"$error":"#N/A"},{"$error":"#N/A"},"G26.2",0]
["17-32",53,null,null,"G27.1",{"$error":"#N/A"},0.64779531955718994,null,27,null,{"$error":"#N/A"},{"$error":"#N/A"},"G27.2",0]
["17-32",12,null,null,"G28.1",{"$error":"#N/A"},0.67394924163818359,null,28,"17/32.1",{"$error":"#N/A"},{"$error":"#N/A"},"G20.1",0]
["17-32",5,null,null,"G29.1",{"$error":"#N/A"},0.7198331356048584,null,29,"17/32.1",{"$error":"#N/A"},{"$error":"#N/A"},"G17.1",0]
["17-32",60,null,null,"G30.1",{"$error":"#N/A"},0.74757301807403564,null,30,null,{"$error":"#N/A"},{"$error":"#N/A"},"G30.2",0]
["17-32",61,null,null,"G31.1",{"$error":"#N/A"},0.77159649133682251,null,31,null,{"$error":"#N/A"},{"$error":"#N/A"},"G31.2",0]
["17-32",4,null,null,"G32.1",{"$error":"#N/A"},0.89949065446853638,null,32,"3/4.1",4,"YILDIZ RAKETLER (A) (İST)","G4.1","İSTANBUL"]
[]
[null,"Lower Group Runners-down (↓)",null,null,null,null,null,null,33,"3/4.1",3,"İSTANBUL DSİ (A) (İST)","G3.1","İSTANBUL"]
[null,34,null,null,"G1.2","BEYKOZ BLD. SPOR (A) (İST)",null,null,34,null,32,"BEYKOZ BLD. SPOR (A) (İST)","G1.2","İSTANBUL"]
[null,35,null,null,"G4.2","LÜLEBURGAZ ZİRVE SPOR (A) (KRL)",null,null,35,null,29,"LÜLEBURGAZ ZİRVE SPOR (A) (KRL)","G4.2","KIRKLARELİ"]
[null,38,null,null,"G5.2","İBB SPOR (A) (İST)",null,null,36,"17/32.1",{"$error":"#N/A"},{"$error":"#N/A"},"G18.1",0]
[null,39,null,null,"G8.2","ULUDAĞ OKSİJEN SPOR (B) (BRS)",null,null,37,"17/32.1",{"$error":"#N/A"},{"$error":"#N/A"},"G19.1",0]
[null,42,null,null,"G9.2","ULUDAĞ OKSİJEN SPOR (A) (BRS)",null,null,38,null,28,"İBB SPOR (A) (İST)","G5.2","İSTANBUL"]
[null,43,null,null,"G12.2","BOYBEYİ SPOR (A) (SKR)",null,null,39,null,25,"ULUDAĞ OKSİJEN SPOR (B) (BRS)","G8.2","BURSA"]
[null,46,null,null,"G13.2","DERİNCE GSK (A) (KCL)",null,null,40,"13/16.1",19,"ÇAĞDAŞ KOLEJLİLER (A) (ESK)","G14.1","ESKİŞEHİR"]
[null,47,null,null,"G16.2","TRAKER SPOR (B) (KRL)",null,null,41,"9/12.1",11,"YALOVA BLD. GENÇLİK SPOR (B) (YLV)","G11.1","YALOVA"]
[null,50,null,null,"G17.2",{"$error":"#N/A"},null,null,42,null,24,"ULUDAĞ OKSİJEN SPOR (A) (BRS)","G9.2","BURSA"]
[null,51,null,null,"G20.2",{"$error":"#N/A"},null,null,43,null,21,"BOYBEYİ SPOR (A) (SKR)","G12.2","SAKARYA"]
[null,54,null,null,"G21.2",{"$error":"#N/A"},null,null,44,"17/32.1",{"$error":"#N/A"},{"$error":"#N/A"},"G22.1",0]
[null,55,null,null,"G24.2",{"$error":"#N/A"},null,null,45,"17/32.1",{"$error":"#N/A"},{"$error":"#N/A"},"G23.1",0]
[null,58,null,null,"G25.2",{"$error":"#N/A"},null,null,46,null,20,"DERİNCE GSK (A) (KCL)","G13.2","KOCAELİ"]
[null,59,null,null,"G28.2",{"$error":"#N/A"},null,null,47,null,16,"TRAKER SPOR (B) (KRL)","G16.2","KIRKLARELİ"]
[null,62,null,null,"G29.2",{"$error":"#N/A"},null,null,48,"5/6.1",6,"ÇERKEZKÖY BLD. GSK (A) (TKD)","G6.1","TEKİRDAĞ"]
[null,63,null,null,"G32.2",{"$error":"#N/A"},null,null,49,"7/8.1",26,"BURSA B. ŞEH. BLD. SPOR (A) (BRS)","G7.1","BURSA"]
[null,null,null,null,null,null,null,null,50,null,{"$error":"#N/A"},{"$error":"#N/A"},"G17.2",0]
[null,"Upper Group Runners-up (↑)",null,null,null,null,null,null,51,null,{"$error":"#N/A"},{"$error":"#N/A"},"G20.2",0]
[null,2,null,null,"G2.2","ESKİŞEHİR YURDUM SPOR (A) (ESK)",null,null,52,"17/32.1",{"$error":"#N/A"},{"$error":"#N/A"},"G26.1",0]
[null,3,null,null,"G3.2","B.B.KAĞITSPOR (A) (KCL)",null,null,53,"17/32.1",{"$error":"#N/A"},{"$error":"#N/A"},"G27.1",0]
[null,6,null,null,"G6.2","PENDİK BLD. SPOR (C) (İST)",null,null,54,null,{"$error":"#N/A"},{"$error":"#N/A"},"G21.2",0]
[null,7,null,null,"G7.2","PENDİK BLD. SPOR (B) (İST)",null,null,55,null,{"$error":"#N/A"},{"$error":"#N/A"},"G24.2",0]
[null,10,null,null,"G10.2","İBB SPOR (B) (İST)",null,null,56,"9/12.1",10,"TRAKER SPOR (A) (KRL)","G10.1","KIRKLARELİ"]
[null,11,null,null,"G11.2","GENÇ TRAKYA SPOR (A) (EDR)",null,null,57,"13/16.1",15,"LÜLEBURGAZ GENÇLİK SPOR  (A) (KRL)","G15.1","KIRKLARELİ"]
[null,14,null,null,"G14.2","KOCAELİ GSIM (B) (KCL)",null,null,58,null,{"$error":"#N/A"},{"$error":"#N/A"},"G25.2",0]
[null,15,null,null,"G15.2","KOCAELİ GSIM (A) (KCL)",null,null,59,null,{"$error":"#N/A"},{"$error":"#N/A"},"G28.2",0]
[null,18,null,null,"G18.2",{"$error":"#N/A"},null,null,60,"17/32.1",{"$error":"#N/A"},{"$error":"#N/A"},"G30.1",0]
[null,19,null,null,"G19.2",{"$error":"#N/A"},null,null,61,"17/32.1",{"$error":"#N/A"},{"$error":"#N/A"},"G31.1",0]
[null,22,null,null,"G22.2",{"$error":"#N/A"},null,null,62,null,{"$error":"#N/A"},{"$error":"#N/A"},"G29.2",0]
[null,23,null,null,"G23.2",{"$error":"#N/A"},null,null,63,null,{"$error":"#N/A"},{"$error":"#N/A"},"G32.2",0]
[null,26,null,null,"G26.2",{"$error":"#N/A"},null,null,64,"2.1",2,"YALOVA BLD. GENÇLİK SPOR (A) (YLV)","G2.1","YALOVA"]
[null,27,null,null,"G27.2",{"$error":"#N/A"}]
[null,30,null,null,"G30.2",{"$error":"#N/A"}]
[null,31,null,null,"G31.2",{"$error":"#N/A"}]
[]
[]
[null,32]
[]
[null,"Place",null,"#","Group","Player",null,"Manuel",null,null,"S.No","Main table"]
[1,1,null,null,"G1.1","FENERBAHÇE (A) (İST)",null,null,1,"1.1",1,"FENERBAHÇE (A) (İST)","G1.1","İSTANBUL"]
[2,32,null,null,"G2.1","YALOVA BLD. GENÇLİK SPOR (A) (YLV)",null,null,2,null,31,"ESKİŞEHİR YURDUM SPOR (A) (ESK)","G2.2","ESKİŞEHİR"]
["3-4",17,null,null,"G3.1","İSTANBUL DSİ (A) (İST)",4.8118889331817627E-2,null,3,null,16,"TRAKER SPOR (B) (KRL)","G16.2","KIRKLARELİ"]
["3-4",16,null,null,"G4.1","YILDIZ RAKETLER (A) (İST)",0.17377340793609619,null,4,"13/16.1",13,"LÜLEBURGAZ ZİRVE SPOR (B) (KRL)","G13.1","KIRKLARELİ"]
["5-6",9,null,null,"G5.1","PENDİK BLD. SPOR (A) (İST)",0.27529549598693848,null,5,"9/12.1",11,"YALOVA BLD. GENÇLİK SPOR (B) (YLV)","G11.1","YALOVA"]
["5-6",24,null,null,"G6.1","ÇERKEZKÖY BLD. GSK (A) (TKD)",0.98537391424179077,null,6,null,24,"ULUDAĞ OKSİJEN SPOR (A) (BRS)","G9.2","BURSA"]
["7-8",25,null,null,"G8.1","EDİRNE YURDUM SPOR (A) (EDR)",0.49437671899795532,null,7,null,18,"KOCAELİ GSIM (A) (KCL)","G15.2","KOCAELİ"]
["7-8",8,null,null,"G7.1","BURSA B. ŞEH. BLD. SPOR (A) (BRS)",0.54202926158905029,null,8,"7/8.1",26,"BURSA B. ŞEH. BLD. SPOR (A) (BRS)","G7.1","BURSA"]
["9-12",5,null,null,"G11.1","YALOVA BLD. GENÇLİK SPOR (B) (YLV)",0.12308281660079956,null,9,"5/6.1",5,"PENDİK BLD. SPOR (A) (İST)","G5.1","İSTANBUL"]
["9-12",28,null,null,"G10.1","TRAKER SPOR (A) (KRL)",0.41664838790893555,30,10,null,30,"B.B.KAĞITSPOR (A) (KCL)","G6.2","KOCAELİ"]
["9-12",20,null,null,"G9.1","İSTANBUL DSİ (B) (İST)",0.79729729890823364,null,11,null,23,"İBB SPOR (B) (İST)","G10.2","İSTANBUL"]
["9-12",12,null,null,"G12.1","D.S.İ. BENT SPOR (A) (ESK)",0.95415794849395752,null,12,"9/12.1",12,"D.S.İ. BENT SPOR (A) (ESK)","G12.1","ESKİŞEHİR"]
["13-16",13,null,null,"G14.1","ÇAĞDAŞ KOLEJLİLER (A) (ESK)",2.5056600570678711E-3,null,13,"13/16.1",19,"ÇAĞDAŞ KOLEJLİLER (A) (ESK)","G14.1","ESKİŞEHİR"]
["13-16",21,null,null,"G15.1","LÜLEBURGAZ GENÇLİK SPOR  (A) (KRL)",0.17869353294372559,27,14,null,27,"PENDİK BLD. SPOR (C) (İST)","G3.2","İSTANBUL"]
["13-16",29,null,null,"G16.1","YILDIZ RAKETLER (B) (İST)",0.34695714712142944,null,15,null,25,"ULUDAĞ OKSİJEN SPOR (B) (BRS)","G8.2","BURSA"]
["13-16",4,null,null,"G13.1","LÜLEBURGAZ ZİRVE SPOR (B) (KRL)",0.74234205484390259,null,16,"3/4.1",4,"YILDIZ RAKETLER (A) (İST)","G4.1","İSTANBUL"]
[]
[null,"Lower Group Runners-down (↓)",null,null,null,null,null,null,17,"3/4.1",3,"İSTANBUL DSİ (A) (İST)","G3.1","İSTANBUL"]
[null,18,null,null,"G7.2","PENDİK BLD. SPOR (B) (İST)",1.0293424129486084E-2,null,18,null,7,"PENDİK BLD. SPOR (B) (İST)","G7.2","İSTANBUL"]
[null,19,null,null,"G5.2","İBB SPOR (A) (İST)",0.10878586769104004,null,19,null,28,"İBB SPOR (A) (İST)","G5.2","İSTANBUL"]
[null,22,null,null,"G13.2","DERİNCE GSK (A) (KCL)",0.15165698528289795,null,20,"9/12.1",9,"İSTANBUL DSİ (B) (İST)","G9.1","İSTANBUL"]
[null,23,null,null,"G12.2","BOYBEYİ SPOR (A) (SKR)",0.17688685655593872,null,21,"13/16.1",15,"LÜLEBURGAZ GENÇLİK SPOR  (A) (KRL)","G15.1","KIRKLARELİ"]
[null,26,null,null,"G14.2","KOCAELİ GSIM (B) (KCL)",0.37740761041641235,null,22,null,20,"DERİNCE GSK (A) (KCL)","G13.2","KOCAELİ"]
[null,27,null,null,"G11.2","GENÇ TRAKYA SPOR (A) (EDR)",0.75254249572753906,null,23,null,21,"BOYBEYİ SPOR (A) (SKR)","G12.2","SAKARYA"]
[null,30,null,null,"G4.2","LÜLEBURGAZ ZİRVE SPOR (A) (KRL)",0.82193148136138916,null,24,"5/6.1",6,"ÇERKEZKÖY BLD. GSK (A) (TKD)","G6.1","TEKİRDAĞ"]
[null,31,null,null,"G1.2","BEYKOZ BLD. SPOR (A) (İST)",0.89127939939498901,null,25,"7/8.1",8,"EDİRNE YURDUM SPOR (A) (EDR)","G8.1","EDİRNE"]
[null,null,null,null,null,null,null,null,26,null,14,"KOCAELİ GSIM (B) (KCL)","G14.2","KOCAELİ"]
[null,"Upper Group Runners-up (↑)",null,null,null,null,null,null,27,null,22,"GENÇ TRAKYA SPOR (A) (EDR)","G11.2","EDİRNE"]
[null,2,null,null,"G2.2","ESKİŞEHİR YURDUM SPOR (A) (ESK)",1.4221131801605225E-2,null,28,"9/12.1",10,"TRAKER SPOR (A) (KRL)","G10.1","KIRKLARELİ"]
[null,3,null,null,"G16.2","TRAKER SPOR (B) (KRL)",0.28138142824172974,null,29,"13/16.1",17,"YILDIZ RAKETLER (B) (İST)","G16.1","İSTANBUL"]
[null,6,null,null,"G9.2","ULUDAĞ OKSİJEN SPOR (A) (BRS)",0.28301477432250977,null,30,null,29,"LÜLEBURGAZ ZİRVE SPOR (A) (KRL)","G4.2","KIRKLARELİ"]
[null,7,null,null,"G15.2","KOCAELİ GSIM (A) (KCL)",0.29465901851654053,null,31,null,32,"BEYKOZ BLD. SPOR (A) (İST)","G1.2","İSTANBUL"]
[null,10,null,null,"G6.2","PENDİK BLD. SPOR (C) (İST)",0.36805605888366699,null,32,"2.1",2,"YALOVA BLD. GENÇLİK SPOR (A) (YLV)","G2.1","YALOVA"]
[null,11,null,null,"G10.2","İBB SPOR (B) (İST)",0.6675383448600769]
[null,14,null,null,"G3.2","B.B.KAĞITSPOR (A) (KCL)",0.89012730121612549]
[null,15,null,null,"G8.2","ULUDAĞ OKSİJEN SPOR (B) (BRS)",0.98404604196548462]
[]
[]
[null,16]
[]
[]
[null,"Place",null,"#","Group","Player",null,"Manuel",null,null,"S.No","Main table"]
[1,1,null,null,"G1.1","FENERBAHÇE (A) (İST)",null,null,1,"1.1",1,"FENERBAHÇE (A) (İST)","G1.1","İSTANBUL"]
[2,16,null,null,"G2.1","YALOVA BLD. GENÇLİK SPOR (A) (YLV)",null,null,2,null,28,"İBB SPOR (A) (İST)","G5.2","İSTANBUL"]
["3-4",9,null,null,"G3.1","İSTANBUL DSİ (A) (İST)",1.5703916549682617E-2,null,3,null,30,"B.B.KAĞITSPOR (A) (KCL)","G3.2","KOCAELİ"]
["3-4",8,null,null,"G4.1","YILDIZ RAKETLER (A) (İST)",0.67617589235305786,null,4,"7/8.1",26,"BURSA B. ŞEH. BLD. SPOR (A) (BRS)","G7.1","BURSA"]
["5-6",12,null,null,"G5.1","PENDİK BLD. SPOR (A) (İST)",0.79048001766204834,null,5,"5/6.1",6,"ÇERKEZKÖY BLD. GSK (A) (TKD)","G6.1","TEKİRDAĞ"]
["5-6",5,null,null,"G6.1","ÇERKEZKÖY BLD. GSK (A) (TKD)",0.86261934041976929,null,6,null,25,"ULUDAĞ OKSİJEN SPOR (B) (BRS)","G8.2","BURSA"]
["7-8",13,null,null,"G8.1","EDİRNE YURDUM SPOR (A) (EDR)",9.7973823547363281E-2,null,7,null,31,"ESKİŞEHİR YURDUM SPOR (A) (ESK)","G2.2","ESKİŞEHİR"]
["7-8",4,null,null,"G7.1","BURSA B. ŞEH. BLD. SPOR (A) (BRS)",0.42845636606216431,null,8,"3/4.1",4,"YILDIZ RAKETLER (A) (İST)","G4.1","İSTANBUL"]
[]
[null,"Lower Group Runners-down (↓)",null,null,null,null,null,null,9,"3/4.1",3,"İSTANBUL DSİ (A) (İST)","G3.1","İSTANBUL"]
[null,10,null,null,"G7.2","PENDİK BLD. SPOR (B) (İST)",0.20601719617843628,null,10,null,7,"PENDİK BLD. SPOR (B) (İST)","G7.2","İSTANBUL"]
[null,11,null,null,"G6.2","PENDİK BLD. SPOR (C) (İST)",0.58862859010696411,null,11,null,27,"PENDİK BLD. SPOR (C) (İST)","G6.2","İSTANBUL"]
[null,14,null,null,"G4.2","LÜLEBURGAZ ZİRVE SPOR (A) (KRL)",0.75490832328796387,null,12,"5/6.1",5,"PENDİK BLD. SPOR (A) (İST)","G5.1","İSTANBUL"]
[null,15,null,null,"G1.2","BEYKOZ BLD. SPOR (A) (İST)",0.86453449726104736,null,13,"7/8.1",8,"EDİRNE YURDUM SPOR (A) (EDR)","G8.1","EDİRNE"]
[null,null,null,null,null,null,null,null,14,null,29,"LÜLEBURGAZ ZİRVE SPOR (A) (KRL)","G4.2","KIRKLARELİ"]
[null,"Upper Group Runners-up (↑)",null,null,null,null,null,null,15,null,32,"BEYKOZ BLD. SPOR (A) (İST)","G1.2","İSTANBUL"]
[null,2,null,null,"G5.2","İBB SPOR (A) (İST)",3.544008731842041E-2,null,16,"2.1",2,"YALOVA BLD. GENÇLİK SPOR (A) (YLV)","G2.1","YALOVA"]
[null,3,null,null,"G3.2","B.B.KAĞITSPOR (A) (KCL)",0.48348832130432129]
[null,6,null,null,"G8.2","ULUDAĞ OKSİJEN SPOR (B) (BRS)",0.79146403074264526]
[null,7,null,null,"G2.2","ESKİŞEHİR YURDUM SPOR (A) (ESK)",0.79417353868484497]
[]
[]
[null,8]
[]
[]
[null,"Place",null,null,"Group","Player",null,"Manuel",null,null,"S.No","Main table"]
[1,1,null,null,"G1.1","FENERBAHÇE (A) (İST)",null,null,1,"1.1",1,"FENERBAHÇE (A) (İST)","G1.1","İSTANBUL"]
[2,8,null,null,"G2.1","YALOVA BLD. GENÇLİK SPOR (A) (YLV)",null,null,2,null,31,"ESKİŞEHİR YURDUM SPOR (A) (ESK)","G2.2","ESKİŞEHİR"]
["3-4",4,null,null,"G3.1","İSTANBUL DSİ (A) (İST)",0.79048001766204834,null,3,null,29,"LÜLEBURGAZ ZİRVE SPOR (A) (KRL)","G4.2","KIRKLARELİ"]
["3-4",5,null,null,"G4.1","YILDIZ RAKETLER (A) (İST)",0.86261934041976929,null,4,"3/4.1",3,"İSTANBUL DSİ (A) (İST)","G3.1","İSTANBUL"]
[]
[null,"Lower Group Runners-down (↓)",null,null,null,null,null,null,5,"3/4.1",4,"YILDIZ RAKETLER (A) (İST)","G4.1","İSTANBUL"]
[null,6,null,null,"G1.2","BEYKOZ BLD. SPOR (A) (İST)",null,null,6,null,32,"BEYKOZ BLD. SPOR (A) (İST)","G1.2","İSTANBUL"]
[null,7,null,null,"G3.2","B.B.KAĞITSPOR (A) (KCL)",null,null,7,null,30,"B.B.KAĞITSPOR (A) (KCL)","G3.2","KOCAELİ"]
[null,null,null,null,null,null,null,null,8,"2.1",2,"YALOVA BLD. GENÇLİK SPOR (A) (YLV)","G2.1","YALOVA"]
[null,"Upper Group Runners-up (↑)"]
[null,2,null,null,"G2.2","ESKİŞEHİR YURDUM SPOR (A) (ESK)"]
[null,3,null,null,"G4.2","LÜLEBURGAZ ZİRVE SPOR (A) (KRL)"]

{"sheet":"On_Eleme","index":3,"n_rows":195,"n_cols":52,"rows_kept":195,"cut":false,"hidden":true,"merged":[[0,4,1,7],[2,4,2,7],[3,47,3,48],[3,49,3,50],[3,51,3,52],[3,41,3,42],[3,43,3,44],[3,45,3,46]]}
[null,null,null,null,{"$f":"Katılım!AC1","v":"TÜRKİYE MASA TENİSİ FEDERASYONU\nKÜÇÜKLER KUZEYBATI BÖLGESİ YARIŞMALARI"},null,null,null,null,null,null,null,null,null,null,null,null,null,null,null,null,null,null,null,null,null,null,null,null,null,null,null,null,null,null,null,null,null,null,{"$f":"COUNTIF(AN5:AN68,\"<>0\")","v":16}]
[]
[null,null,null,null,{"$f":"Katılım!A2&\" \"&Katılım!AC3","v":"ERKEK TAKIM  [12-13 Mart 2025 KOCAELİ] [ Ön Eleme ]"}]
[null,null,null,null,"Sporcu","Skor","Galip",null,"Külüp Adı",null,null,"Eleme tablosu ilk turda denk gelip gelmediğinin kontrolü yapılır",null,null,null,null,null,null,null,null,null,null,null,null,null,null,null,null,null,null,null,null,null,null,"#","Date","Time","Table","Competition","Player-A","Player-B","Set1",null,"Set2",null,"Set3",null,"Set4",null,"Set5",null,"Result"]
[1,"E1",19,null,{"$f":"IFERROR(VLOOKUP(C5,Katılım!$A$4:$Z$36,26,0),0)","v":"ÇAĞDAŞ KOLEJLİLER (A) (ESK)"},{"$f":"AZ5","v":0},{"$f":"IF(AND(F5=0,F6=0),\"\",IF(F5>F6,E5,E6))","v":""},null,{"$f":"IFERROR(VLOOKUP(C5,Katılım!$A$4:$G$36,6,0),0)","v":"ESKİŞEHİR"},null,null,"E1",1,{"$f":"OFFSET(#REF!,M5,#REF!)","v":{"$error":"#REF!"}},{"$f":"IFERROR(VLOOKUP(N5,Katılım!$A$4:$Z$36,26,0),0)","v":0},{"$f":"IFERROR(VLOOKUP(N5,Katılım!$A$4:$G$36,6,0),0)","v":0},null,null,null,null,null,null,null,null,null,null,null,null,null,null,null,null,null,null,1,null,null,null,null,{"$f":"E5","v":"ÇAĞDAŞ KOLEJLİLER (A) (ESK)"},{"$f":"E6","v":0}]
["1.1",null,33,null,{"$f":"IFERROR(VLOOKUP(C6,Katılım!$A$4:$Z$36,26,0),0)","v":0},{"$f":"BA5","v":0},null,null,{"$f":"IFERROR(VLOOKUP(C6,Katılım!$A$4:$G$36,6,0),0)","v":0},null,null,null,null,null,null,null,null,null,null,null,null,null,null,null,null,null,null,null,null,null,null,null,null,null,2,null,null,null,null,{"$f":"E8","v":"DERİNCE GSK (A) (KCL)"},{"$f":"E9","v":0}]
[null,null,null,null,null,null,null,null,null,null,null,null,null,null,null,null,null,null,null,null,null,null,null,null,null,null,null,null,null,null,null,null,null,null,3,null,null,null,null,{"$f":"E11","v":"KOCAELİ GSIM (A) (KCL)"},{"$f":"E12","v":0}]
[2,"E2",20,null,{"$f":"IFERROR(VLOOKUP(C8,Katılım!$A$4:$Z$36,26,0),0)","v":"DERİNCE GSK (A) (KCL)"},{"$f":"AZ6","v":0},{"$f":"IF(AND(F8=0,F9=0),\"\",IF(F8>F9,E8,E9))","v":""},null,{"$f":"IFERROR(VLOOKUP(C8,Katılım!$A$4:$G$36,6,0),0)","v":"KOCAELİ"},null,null,"E2",2,{"$f":"OFFSET(#REF!,M8,#REF!)","v":{"$error":"#REF!"}},{"$f":"IFERROR(VLOOKUP(N8,Katılım!$A$4:$Z$36,26,0),0)","v":0},{"$f":"IFERROR(VLOOKUP(N8,Katılım!$A$4:$G$36,6,0),0)","v":0},null,null,null,null,null,null,null,null,null,null,null,null,null,null,null,null,null,null,4,null,null,null,null,{"$f":"E14","v":"YILDIZ RAKETLER (B) (İST)"},{"$f":"E15","v":0}]
["2.2",null,34,null,{"$f":"IFERROR(VLOOKUP(C9,Katılım!$A$4:$Z$36,26,0),0)","v":0},{"$f":"BA6","v":0},null,null,{"$f":"IFERROR(VLOOKUP(C9,Katılım!$A$4:$G$36,6,0),0)","v":0},null,null,null,null,null,null,null,null,null,null,null,null,null,null,null,null,null,null,null,null,null,null,null,null,null,5,null,null,null,null,{"$f":"E17","v":"GENÇ TRAKYA SPOR (A) (EDR)"},{"$f":"E18","v":0}]
[null,null,null,null,null,null,null,null,null,null,null,null,null,null,null,null,null,null,null,null,null,null,null,null,null,null,null,null,null,null,null,null,null,null,6,null,null,null,null,{"$f":"E20","v":"BOYBEYİ SPOR (A) (SKR)"},{"$f":"E21","v":0}]
[3,"E3",18,null,{"$f":"IFERROR(VLOOKUP(C11,Katılım!$A$4:$Z$36,26,0),0)","v":"KOCAELİ GSIM (A) (KCL)"},{"$f":"AZ7","v":0},{"$f":"IF(AND(F11=0,F12=0),\"\",IF(F11>F12,E11,E12))","v":""},null,{"$f":"IFERROR(VLOOKUP(C11,Katılım!$A$4:$G$36,6,0),0)","v":"KOCAELİ"},null,null,"E3",3,{"$f":"OFFSET(#REF!,M11,#REF!)","v":{"$error":"#REF!"}},{"$f":"IFERROR(VLOOKUP(N11,Katılım!$A$4:$Z$36,26,0),0)","v":0},{"$f":"IFERROR(VLOOKUP(N11,Katılım!$A$4:$G$36,6,0),0)","v":0},null,null,null,null,null,null,null,null,null,null,null,null,null,null,null,null,null,null,7,null,null,null,null,{"$f":"E23","v":"İBB SPOR (B) (İST)"},{"$f":"E24","v":0}]
["3.3",null,35,null,{"$f":"IFERROR(VLOOKUP(C12,Katılım!$A$4:$Z$36,26,0),0)","v":0},{"$f":"BA7","v":0},null,null,{"$f":"IFERROR(VLOOKUP(C12,Katılım!$A$4:$G$36,6,0),0)","v":0},null,null,null,null,null,null,null,null,null,null,null,null,null,null,null,null,null,null,null,null,null,null,null,null,null,8,null,null,null,null,{"$f":"E26","v":"ULUDAĞ OKSİJEN SPOR (A) (BRS)"},{"$f":"E27","v":0}]
[null,null,null,null,null,null,null,null,null,null,null,null,null,null,null,null,null,null,null,null,null,null,null,null,null,null,null,null,null,null,null,null,null,null,9,null,null,null,null,{"$f":"E29","v":"PENDİK BLD. SPOR (C) (İST)"},{"$f":"E30","v":0}]
[4,"E4",17,null,{"$f":"IFERROR(VLOOKUP(C14,Katılım!$A$4:$Z$36,26,0),0)","v":"YILDIZ RAKETLER (B) (İST)"},{"$f":"AZ8","v":0},{"$f":"IF(AND(F14=0,F15=0),\"\",IF(F14>F15,E14,E15))","v":""},null,{"$f":"IFERROR(VLOOKUP(C14,Katılım!$A$4:$G$36,6,0),0)","v":"İSTANBUL"},null,null,"E4",4,{"$f":"OFFSET(#REF!,M14,#REF!)","v":{"$error":"#REF!"}},{"$f":"IFERROR(VLOOKUP(N14,Katılım!$A$4:$Z$36,26,0),0)","v":0},{"$f":"IFERROR(VLOOKUP(N14,Katılım!$A$4:$G$36,6,0),0)","v":0},null,null,null,null,null,null,null,null,null,null,null,null,null,null,null,null,null,null,10,null,null,null,null,{"$f":"E32","v":"İBB SPOR (A) (İST)"},{"$f":"E33","v":0}]
["4.4",null,36,null,{"$f":"IFERROR(VLOOKUP(C15,Katılım!$A$4:$Z$36,26,0),0)","v":0},{"$f":"BA8","v":0},null,null,{"$f":"IFERROR(VLOOKUP(C15,Katılım!$A$4:$G$36,6,0),0)","v":0},null,null,null,null,null,null,null,null,null,null,null,null,null,null,null,null,null,null,null,null,null,null,null,null,null,11,null,null,null,null,{"$f":"E35","v":"BURSA B. ŞEH. BLD. SPOR (A) (BRS)"},{"$f":"E36","v":0}]
[null,null,null,null,null,null,null,null,null,null,null,null,null,null,null,null,null,null,null,null,null,null,null,null,null,null,null,null,null,null,null,null,null,null,12,null,null,null,null,{"$f":"E38","v":"ULUDAĞ OKSİJEN SPOR (B) (BRS)"},{"$f":"E39","v":0}]
[5,"E5",22,null,{"$f":"IFERROR(VLOOKUP(C17,Katılım!$A$4:$Z$36,26,0),0)","v":"GENÇ TRAKYA SPOR (A) (EDR)"},{"$f":"AZ9","v":0},{"$f":"IF(AND(F17=0,F18=0),\"\",IF(F17>F18,E17,E18))","v":""},null,{"$f":"IFERROR(VLOOKUP(C17,Katılım!$A$4:$G$36,6,0),0)","v":"EDİRNE"},null,null,"E5",5,{"$f":"OFFSET(#REF!,M17,#REF!)","v":{"$error":"#REF!"}},{"$f":"IFERROR(VLOOKUP(N17,Katılım!$A$4:$Z$36,26,0),0)","v":0},{"$f":"IFERROR(VLOOKUP(N17,Katılım!$A$4:$G$36,6,0),0)","v":0},null,null,null,null,null,null,null,null,null,null,null,null,null,null,null,null,null,null,13,null,null,null,null,{"$f":"E41","v":"B.B.KAĞITSPOR (A) (KCL)"},{"$f":"E42","v":0}]
["5.5",null,37,null,{"$f":"IFERROR(VLOOKUP(C18,Katılım!$A$4:$Z$36,26,0),0)","v":0},{"$f":"BA9","v":0},null,null,{"$f":"IFERROR(VLOOKUP(C18,Katılım!$A$4:$G$36,6,0),0)","v":0},null,null,null,null,null,null,null,null,null,null,null,null,null,null,null,null,null,null,null,null,null,null,null,null,null,14,null,null,null,null,{"$f":"E44","v":"LÜLEBURGAZ ZİRVE SPOR (A) (KRL)"},{"$f":"E45","v":0}]
[null,null,null,null,null,null,null,null,null,null,null,null,null,null,null,null,null,null,null,null,null,null,null,null,null,null,null,null,null,null,null,null,null,null,15,null,null,null,null,{"$f":"E47","v":"ESKİŞEHİR YURDUM SPOR (A) (ESK)"},{"$f":"E48","v":0}]
[6,"E6",21,null,{"$f":"IFERROR(VLOOKUP(C20,Katılım!$A$4:$Z$36,26,0),0)","v":"BOYBEYİ SPOR (A) (SKR)"},{"$f":"AZ10","v":0},{"$f":"IF(AND(F20=0,F21=0),\"\",IF(F20>F21,E20,E21))","v":""},null,{"$f":"IFERROR(VLOOKUP(C20,Katılım!$A$4:$G$36,6,0),0)","v":"SAKARYA"},null,null,"E6",6,{"$f":"OFFSET(#REF!,M20,#REF!)","v":{"$error":"#REF!"}},{"$f":"IFERROR(VLOOKUP(N20,Katılım!$A$4:$Z$36,26,0),0)","v":0},{"$f":"IFERROR(VLOOKUP(N20,Katılım!$A$4:$G$36,6,0),0)","v":0},null,null,null,null,null,null,null,null,null,null,null,null,null,null,null,null,null,null,16,null,null,null,null,{"$f":"E50","v":"BEYKOZ BLD. SPOR (A) (İST)"},{"$f":"E51","v":0}]
["6.6",null,38,null,{"$f":"IFERROR(VLOOKUP(C21,Katılım!$A$4:$Z$36,26,0),0)","v":0},{"$f":"BA10","v":0},null,null,{"$f":"IFERROR(VLOOKUP(C21,Katılım!$A$4:$G$36,6,0),0)","v":0},null,null,null,null,null,null,null,null,null,null,null,null,null,null,null,null,null,null,null,null,null,null,null,null,null,17,null,null,null,null,{"$f":"E53","v":0},{"$f":"E54","v":0}]
[null,null,null,null,null,null,null,null,null,null,null,null,null,null,null,null,null,null,null,null,null,null,null,null,null,null,null,null,null,null,null,null,null,null,18,null,null,null,null,{"$f":"E56","v":0},{"$f":"E57","v":0}]
[7,"E7",23,null,{"$f":"IFERROR(VLOOKUP(C23,Katılım!$A$4:$Z$36,26,0),0)","v":"İBB SPOR (B) (İST)"},{"$f":"AZ11","v":0},{"$f":"IF(AND(F23=0,F24=0),\"\",IF(F23>F24,E23,E24))","v":""},null,{"$f":"IFERROR(VLOOKUP(C23,Katılım!$A$4:$G$36,6,0),0)","v":"İSTANBUL"},null,null,"E7",7,{"$f":"OFFSET(#REF!,M23,#REF!)","v":{"$error":"#REF!"}},{"$f":"IFERROR(VLOOKUP(N23,Katılım!$A$4:$Z$36,26,0),0)","v":0},{"$f":"IFERROR(VLOOKUP(N23,Katılım!$A$4:$G$36,6,0),0)","v":0},null,null,null,null,null,null,null,null,null,null,null,null,null,null,null,null,null,null,19,null,null,null,null,{"$f":"E59","v":0},{"$f":"E60","v":0}]
["7.7",null,39,null,{"$f":"IFERROR(VLOOKUP(C24,Katılım!$A$4:$Z$36,26,0),0)","v":0},{"$f":"BA11","v":0},null,null,{"$f":"IFERROR(VLOOKUP(C24,Katılım!$A$4:$G$36,6,0),0)","v":0},null,null,null,null,null,null,null,null,null,null,null,null,null,null,null,null,null,null,null,null,null,null,null,null,null,20,null,null,null,null,{"$f":"E62","v":0},{"$f":"E63","v":0}]
[null,null,null,null,null,null,null,null,null,null,null,null,null,null,null,null,null,null,null,null,null,null,null,null,null,null,null,null,null,null,null,null,null,null,21,null,null,null,null,{"$f":"E65","v":0},{"$f":"E66","v":0}]
[8,"E8",24,null,{"$f":"IFERROR(VLOOKUP(C26,Katılım!$A$4:$Z$36,26,0),0)","v":"ULUDAĞ OKSİJEN SPOR (A) (BRS)"},{"$f":"AZ12","v":0},{"$f":"IF(AND(F26=0,F27=0),\"\",IF(F26>F27,E26,E27))","v":""},null,{"$f":"IFERROR(VLOOKUP(C26,Katılım!$A$4:$G$36,6,0),0)","v":"BURSA"},null,null,"E8",8,{"$f":"OFFSET(#REF!,M26,#REF!)","v":{"$error":"#REF!"}},{"$f":"IFERROR(VLOOKUP(N26,Katılım!$A$4:$Z$36,26,0),0)","v":0},{"$f":"IFERROR(VLOOKUP(N26,Katılım!$A$4:$G$36,6,0),0)","v":0},null,null,null,null,null,null,null,null,null,null,null,null,null,null,null,null,null,null,22,null,null,null,null,{"$f":"E68","v":0},{"$f":"E69","v":0}]
["8.8",null,40,null,{"$f":"IFERROR(VLOOKUP(C27,Katılım!$A$4:$Z$36,26,0),0)","v":0},{"$f":"BA12","v":0},null,null,{"$f":"IFERROR(VLOOKUP(C27,Katılım!$A$4:$G$36,6,0),0)","v":0},null,null,null,null,null,null,null,null,null,null,null,null,null,null,null,null,null,null,null,null,null,null,null,null,null,23,null,null,null,null,{"$f":"E71","v":0},{"$f":"E72","v":0}]
[null,null,null,null,null,null,null,null,null,null,null,null,null,null,null,null,null,null,null,null,null,null,null,null,null,null,null,null,null,null,null,null,null,null,24,null,null,null,null,{"$f":"E74","v":0},{"$f":"E75","v":0}]
[9,"E9",27,null,{"$f":"IFERROR(VLOOKUP(C29,Katılım!$A$4:$Z$36,26,0),0)","v":"PENDİK BLD. SPOR (C) (İST)"},{"$f":"AZ13","v":0},{"$f":"IF(AND(F29=0,F30=0),\"\",IF(F29>F30,E29,E30))","v":""},null,{"$f":"IFERROR(VLOOKUP(C29,Katılım!$A$4:$G$36,6,0),0)","v":"İSTANBUL"},null,null,"E9",9,{"$f":"OFFSET(#REF!,M29,#REF!)","v":{"$error":"#REF!"}},{"$f":"IFERROR(VLOOKUP(N29,Katılım!$A$4:$Z$36,26,0),0)","v":0},{"$f":"IFERROR(VLOOKUP(N29,Katılım!$A$4:$G$36,6,0),0)","v":0},null,null,null,null,null,null,null,null,null,null,null,null,null,null,null,null,null,null,25,null,null,null,null,{"$f":"E77","v":0},{"$f":"E78","v":0}]
["9.9",null,41,null,{"$f":"IFERROR(VLOOKUP(C30,Katılım!$A$4:$Z$36,26,0),0)","v":0},{"$f":"BA13","v":0},null,null,{"$f":"IFERROR(VLOOKUP(C30,Katılım!$A$4:$G$36,6,0),0)","v":0},null,null,null,null,null,null,null,null,null,null,null,null,null,null,null,null,null,null,null,null,null,null,null,null,null,26,null,null,null,null,{"$f":"E80","v":0},{"$f":"E81","v":0}]
[null,null,null,null,null,null,null,null,null,null,null,null,null,null,null,null,null,null,null,null,null,null,null,null,null,null,null,null,null,null,null,null,null,null,27,null,null,null,null,{"$f":"E83","v":0},{"$f":"E84","v":0}]
[10,"E10",28,null,{"$f":"IFERROR(VLOOKUP(C32,Katılım!$A$4:$Z$36,26,0),0)","v":"İBB SPOR (A) (İST)"},{"$f":"AZ14","v":0},{"$f":"IF(AND(F32=0,F33=0),\"\",IF(F32>F33,E32,E33))","v":""},null,{"$f":"IFERROR(VLOOKUP(C32,Katılım!$A$4:$G$36,6,0),0)","v":"İSTANBUL"},null,null,"E10",10,{"$f":"OFFSET(#REF!,M32,#REF!)","v":{"$error":"#REF!"}},{"$f":"IFERROR(VLOOKUP(N32,Katılım!$A$4:$Z$36,26,0),0)","v":0},{"$f":"IFERROR(VLOOKUP(N32,Katılım!$A$4:$G$36,6,0),0)","v":0},null,null,null,null,null,null,null,null,null,null,null,null,null,null,null,null,null,null,28,null,null,null,null,{"$f":"E86","v":0},{"$f":"E87","v":0}]
["10.10",null,42,null,{"$f":"IFERROR(VLOOKUP(C33,Katılım!$A$4:$Z$36,26,0),0)","v":0},{"$f":"BA14","v":0},null,null,{"$f":"IFERROR(VLOOKUP(C33,Katılım!$A$4:$G$36,6,0),0)","v":0},null,null,null,null,null,null,null,null,null,null,null,null,null,null,null,null,null,null,null,null,null,null,null,null,null,29,null,null,null,null,{"$f":"E89","v":0},{"$f":"E90","v":0}]
[null,null,null,null,null,null,null,null,null,null,null,null,null,null,null,null,null,null,null,null,null,null,null,null,null,null,null,null,null,null,null,null,null,null,30,null,null,null,null,{"$f":"E92","v":0},{"$f":"E93","v":0}]
[11,"E11",26,null,{"$f":"IFERROR(VLOOKUP(C35,Katılım!$A$4:$Z$36,26,0),0)","v":"BURSA B. ŞEH. BLD. SPOR (A) (BRS)"},{"$f":"AZ15","v":0},{"$f":"IF(AND(F35=0,F36=0),\"\",IF(F35>F36,E35,E36))","v":""},null,{"$f":"IFERROR(VLOOKUP(C35,Katılım!$A$4:$G$36,6,0),0)","v":"BURSA"},null,null,"E11",11,{"$f":"OFFSET(#REF!,M35,#REF!)","v":{"$error":"#REF!"}},{"$f":"IFERROR(VLOOKUP(N35,Katılım!$A$4:$Z$36,26,0),0)","v":0},{"$f":"IFERROR(VLOOKUP(N35,Katılım!$A$4:$G$36,6,0),0)","v":0},null,null,null,null,null,null,null,null,null,null,null,null,null,null,null,null,null,null,31,null,null,null,null,{"$f":"E95","v":0},{"$f":"E96","v":0}]
["11.11",null,43,null,{"$f":"IFERROR(VLOOKUP(C36,Katılım!$A$4:$Z$36,26,0),0)","v":0},{"$f":"BA15","v":0},null,null,{"$f":"IFERROR(VLOOKUP(C36,Katılım!$A$4:$G$36,6,0),0)","v":0},null,null,null,null,null,null,null,null,null,null,null,null,null,null,null,null,null,null,null,null,null,null,null,null,null,32,null,null,null,null,{"$f":"E98","v":0},{"$f":"E99","v":0}]
[null,null,null,null,null,null,null,null,null,null,null,null,null,null,null,null,null,null,null,null,null,null,null,null,null,null,null,null,null,null,null,null,null,null,33,null,null,null,null,{"$f":"E101","v":0},{"$f":"E102","v":0}]
[12,"E12",25,null,{"$f":"IFERROR(VLOOKUP(C38,Katılım!$A$4:$Z$36,26,0),0)","v":"ULUDAĞ OKSİJEN SPOR (B) (BRS)"},{"$f":"AZ16","v":0},{"$f":"IF(AND(F38=0,F39=0),\"\",IF(F38>F39,E38,E39))","v":""},null,{"$f":"IFERROR(VLOOKUP(C38,Katılım!$A$4:$G$36,6,0),0)","v":"BURSA"},null,null,"E12",12,{"$f":"OFFSET(#REF!,M38,#REF!)","v":{"$error":"#REF!"}},{"$f":"IFERROR(VLOOKUP(N38,Katılım!$A$4:$Z$36,26,0),0)","v":0},{"$f":"IFERROR(VLOOKUP(N38,Katılım!$A$4:$G$36,6,0),0)","v":0},null,null,null,null,null,null,null,null,null,null,null,null,null,null,null,null,null,null,34,null,null,null,null,{"$f":"E104","v":0},{"$f":"E105","v":0}]
["12.12",null,44,null,{"$f":"IFERROR(VLOOKUP(C39,Katılım!$A$4:$Z$36,26,0),0)","v":0},{"$f":"BA16","v":0},null,null,{"$f":"IFERROR(VLOOKUP(C39,Katılım!$A$4:$G$36,6,0),0)","v":0},null,null,null,null,null,null,null,null,null,null,null,null,null,null,null,null,null,null,null,null,null,null,null,null,null,35,null,null,null,null,{"$f":"E107","v":0},{"$f":"E108","v":0}]
[null,null,null,null,null,null,null,null,null,null,null,null,null,null,null,null,null,null,null,null,null,null,null,null,null,null,null,null,null,null,null,null,null,null,36,null,null,null,null,{"$f":"E110","v":0},{"$f":"E111","v":0}]
[13,"E13",30,null,{"$f":"IFERROR(VLOOKUP(C41,Katılım!$A$4:$Z$36,26,0),0)","v":"B.B.KAĞITSPOR (A) (KCL)"},{"$f":"AZ17","v":0},{"$f":"IF(AND(F41=0,F42=0),\"\",IF(F41>F42,E41,E42))","v":""},null,{"$f":"IFERROR(VLOOKUP(C41,Katılım!$A$4:$G$36,6,0),0)","v":"KOCAELİ"},null,null,"E13",13,{"$f":"OFFSET(#REF!,M41,#REF!)","v":{"$error":"#REF!"}},{"$f":"IFERROR(VLOOKUP(N41,Katılım!$A$4:$Z$36,26,0),0)","v":0},{"$f":"IFERROR(VLOOKUP(N41,Katılım!$A$4:$G$36,6,0),0)","v":0},null,null,null,null,null,null,null,null,null,null,null,null,null,null,null,null,null,null,37,null,null,null,null,{"$f":"E113","v":0},{"$f":"E114","v":0}]
["13.13",null,45,null,{"$f":"IFERROR(VLOOKUP(C42,Katılım!$A$4:$Z$36,26,0),0)","v":0},{"$f":"BA17","v":0},null,null,{"$f":"IFERROR(VLOOKUP(C42,Katılım!$A$4:$G$36,6,0),0)","v":0},null,null,null,null,null,null,null,null,null,null,null,null,null,null,null,null,null,null,null,null,null,null,null,null,null,38,null,null,null,null,{"$f":"E116","v":0},{"$f":"E117","v":0}]
[null,null,null,null,null,null,null,null,null,null,null,null,null,null,null,null,null,null,null,null,null,null,null,null,null,null,null,null,null,null,null,null,null,null,39,null,null,null,null,{"$f":"E119","v":0},{"$f":"E120","v":0}]
[14,"E14",29,null,{"$f":"IFERROR(VLOOKUP(C44,Katılım!$A$4:$Z$36,26,0),0)","v":"LÜLEBURGAZ ZİRVE SPOR (A) (KRL)"},{"$f":"AZ18","v":0},{"$f":"IF(AND(F44=0,F45=0),\"\",IF(F44>F45,E44,E45))","v":""},null,{"$f":"IFERROR(VLOOKUP(C44,Katılım!$A$4:$G$36,6,0),0)","v":"KIRKLARELİ"},null,null,"E14",14,{"$f":"OFFSET(#REF!,M44,#REF!)","v":{"$error":"#REF!"}},{"$f":"IFERROR(VLOOKUP(N44,Katılım!$A$4:$Z$36,26,0),0)","v":0},{"$f":"IFERROR(VLOOKUP(N44,Katılım!$A$4:$G$36,6,0),0)","v":0},null,null,null,null,null,null,null,null,null,null,null,null,null,null,null,null,null,null,40,null,null,null,null,{"$f":"E122","v":0},{"$f":"E123","v":0}]
["14.14",null,46,null,{"$f":"IFERROR(VLOOKUP(C45,Katılım!$A$4:$Z$36,26,0),0)","v":0},{"$f":"BA18","v":0},null,null,{"$f":"IFERROR(VLOOKUP(C45,Katılım!$A$4:$G$36,6,0),0)","v":0},null,null,null,null,null,null,null,null,null,null,null,null,null,null,null,null,null,null,null,null,null,null,null,null,null,41,null,null,null,null,{"$f":"E125","v":0},{"$f":"E126","v":0}]
[null,null,null,null,null,null,null,null,null,null,null,null,null,null,null,null,null,null,null,null,null,null,null,null,null,null,null,null,null,null,null,null,null,null,42,null,null,null,null,{"$f":"E128","v":0},{"$f":"E129","v":0}]
[15,"E15",31,null,{"$f":"IFERROR(VLOOKUP(C47,Katılım!$A$4:$Z$36,26,0),0)","v":"ESKİŞEHİR YURDUM SPOR (A) (ESK)"},{"$f":"AZ19","v":0},{"$f":"IF(AND(F47=0,F48=0),\"\",IF(F47>F48,E47,E48))","v":""},null,{"$f":"IFERROR(VLOOKUP(C47,Katılım!$A$4:$G$36,6,0),0)","v":"ESKİŞEHİR"},null,null,"E15",15,{"$f":"OFFSET(#REF!,M47,#REF!)","v":{"$error":"#REF!"}},{"$f":"IFERROR(VLOOKUP(N47,Katılım!$A$4:$Z$36,26,0),0)","v":0},{"$f":"IFERROR(VLOOKUP(N47,Katılım!$A$4:$G$36,6,0),0)","v":0},null,null,null,null,null,null,null,null,null,null,null,null,null,null,null,null,null,null,43,null,null,null,null,{"$f":"E131","v":0},{"$f":"E132","v":0}]
["15.15",null,47,null,{"$f":"IFERROR(VLOOKUP(C48,Katılım!$A$4:$Z$36,26,0),0)","v":0},{"$f":"BA19","v":0},null,null,{"$f":"IFERROR(VLOOKUP(C48,Katılım!$A$4:$G$36,6,0),0)","v":0},null,null,null,null,null,null,null,null,null,null,null,null,null,null,null,null,null,null,null,null,null,null,null,null,null,44,null,null,null,null,{"$f":"E134","v":0},{"$f":"E135","v":0}]
[null,null,null,null,null,null,null,null,null,null,null,null,null,null,null,null,null,null,null,null,null,null,null,null,null,null,null,null,null,null,null,null,null,null,45,null,null,null,null,{"$f":"E137","v":0},{"$f":"E138","v":0}]
[16,"E16",32,null,{"$f":"IFERROR(VLOOKUP(C50,Katılım!$A$4:$Z$36,26,0),0)","v":"BEYKOZ BLD. SPOR (A) (İST)"},{"$f":"AZ20","v":0},{"$f":"IF(AND(F50=0,F51=0),\"\",IF(F50>F51,E50,E51))","v":""},null,{"$f":"IFERROR(VLOOKUP(C50,Katılım!$A$4:$G$36,6,0),0)","v":"İSTANBUL"},null,null,"E16",16,{"$f":"OFFSET(#REF!,M50,#REF!)","v":{"$error":"#REF!"}},{"$f":"IFERROR(VLOOKUP(N50,Katılım!$A$4:$Z$36,26,0),0)","v":0},{"$f":"IFERROR(VLOOKUP(N50,Katılım!$A$4:$G$36,6,0),0)","v":0},null,null,null,null,null,null,null,null,null,null,null,null,null,null,null,null,null,null,46,null,null,null,null,{"$f":"E140","v":0},{"$f":"E141","v":0}]
["16.16",null,48,null,{"$f":"IFERROR(VLOOKUP(C51,Katılım!$A$4:$Z$36,26,0),0)","v":0},{"$f":"BA20","v":0},null,null,{"$f":"IFERROR(VLOOKUP(C51,Katılım!$A$4:$G$36,6,0),0)","v":0},null,null,null,null,null,null,null,null,null,null,null,null,null,null,null,null,null,null,null,null,null,null,null,null,null,47,null,null,null,null,{"$f":"E143","v":0},{"$f":"E144","v":0}]
[null,null,null,null,null,null,null,null,null,null,null,null,null,null,null,null,null,null,null,null,null,null,null,null,null,null,null,null,null,null,null,null,null,null,48,null,null,null,null,{"$f":"E146","v":0},{"$f":"E147","v":0}]
[17,"E17",null,null,{"$f":"IFERROR(VLOOKUP(C53,Katılım!$A$4:$Z$36,26,0),0)","v":0},{"$f":"AZ21","v":0},{"$f":"IF(AND(F53=0,F54=0),\"\",IF(F53>F54,E53,E54))","v":""},null,{"$f":"IFERROR(VLOOKUP(C53,Katılım!$A$4:$G$36,6,0),0)","v":0},null,null,"E17",17,{"$f":"OFFSET(#REF!,M53,#REF!)","v":{"$error":"#REF!"}},{"$f":"IFERROR(VLOOKUP(N53,Katılım!$A$4:$Z$36,26,0),0)","v":0},{"$f":"IFERROR(VLOOKUP(N53,Katılım!$A$4:$G$36,6,0),0)","v":0},null,null,null,null,null,null,null,null,null,null,null,null,null,null,null,null,null,null,49,null,null,null,null,{"$f":"E149","v":0},{"$f":"E150","v":0}]
["17.17",null,null,null,{"$f":"IFERROR(VLOOKUP(C54,Katılım!$A$4:$Z$36,26,0),0)","v":0},{"$f":"BA21","v":0},null,null,{"$f":"IFERROR(VLOOKUP(C54,Katılım!$A$4:$G$36,6,0),0)","v":0},null,null,null,null,null,null,null,null,null,null,null,null,null,null,null,null,null,null,null,null,null,null,null,null,null,50,null,null,null,null,{"$f":"E152","v":0},{"$f":"E153","v":0}]
[null,null,null,null,null,null,null,null,null,null,null,null,null,null,null,null,null,null,null,null,null,null,null,null,null,null,null,null,null,null,null,null,null,null,51,null,null,null,null,{"$f":"E155","v":0},{"$f":"E156","v":0}]
[18,"E18",null,null,{"$f":"IFERROR(VLOOKUP(C56,Katılım!$A$4:$Z$36,26,0),0)","v":0},{"$f":"AZ22","v":0},{"$f":"IF(AND(F56=0,F57=0),\"\",IF(F56>F57,E56,E57))","v":""},null,{"$f":"IFERROR(VLOOKUP(C56,Katılım!$A$4:$G$36,6,0),0)","v":0},null,null,"E18",18,{"$f":"OFFSET(#REF!,M56,#REF!)","v":{"$error":"#REF!"}},{"$f":"IFERROR(VLOOKUP(N56,Katılım!$A$4:$Z$36,26,0),0)","v":0},{"$f":"IFERROR(VLOOKUP(N56,Katılım!$A$4:$G$36,6,0),0)","v":0},null,null,null,null,null,null,null,null,null,null,null,null,null,null,null,null,null,null,52,null,null,null,null,{"$f":"E158","v":0},{"$f":"E159","v":0}]
["18.18",null,null,null,{"$f":"IFERROR(VLOOKUP(C57,Katılım!$A$4:$Z$36,26,0),0)","v":0},{"$f":"BA22","v":0},null,null,{"$f":"IFERROR(VLOOKUP(C57,Katılım!$A$4:$G$36,6,0),0)","v":0},null,null,null,null,null,null,null,null,null,null,null,null,null,null,null,null,null,null,null,null,null,null,null,null,null,53,null,null,null,null,{"$f":"E161","v":0},{"$f":"E162","v":0}]
[null,null,null,null,null,null,null,null,null,null,null,null,null,null,null,null,null,null,null,null,null,null,null,null,null,null,null,null,null,null,null,null,null,null,54,null,null,null,null,{"$f":"E164","v":0},{"$f":"E165","v":0}]
[19,"E19",null,null,{"$f":"IFERROR(VLOOKUP(C59,Katılım!$A$4:$Z$36,26,0),0)","v":0},{"$f":"AZ23","v":0},{"$f":"IF(AND(F59=0,F60=0),\"\",IF(F59>F60,E59,E60))","v":""},null,{"$f":"IFERROR(VLOOKUP(C59,Katılım!$A$4:$G$36,6,0),0)","v":0},null,null,"E19",19,{"$f":"OFFSET(#REF!,M59,#REF!)","v":{"$error":"#REF!"}},{"$f":"IFERROR(VLOOKUP(N59,Katılım!$A$4:$Z$36,26,0),0)","v":0},{"$f":"IFERROR(VLOOKUP(N59,Katılım!$A$4:$G$36,6,0),0)","v":0},null,null,null,null,null,null,null,null,null,null,null,null,null,null,null,null,null,null,55,null,null,null,null,{"$f":"E167","v":0},{"$f":"E168","v":0}]
["19.19",null,null,null,{"$f":"IFERROR(VLOOKUP(C60,Katılım!$A$4:$Z$36,26,0),0)","v":0},{"$f":"BA23","v":0},null,null,{"$f":"IFERROR(VLOOKUP(C60,Katılım!$A$4:$G$36,6,0),0)","v":0},null,null,null,null,null,null,null,null,null,null,null,null,null,null,null,null,null,null,null,null,null,null,null,null,null,56,null,null,null,null,{"$f":"E170","v":0},{"$f":"E171","v":0}]
[null,null,null,null,null,null,null,null,null,null,null,null,null,null,null,null,null,null,null,null,null,null,null,null,null,null,null,null,null,null,null,null,null,null,57,null,null,null,null,{"$f":"E173","v":0},{"$f":"E174","v":0}]
[20,"E20",null,null,{"$f":"IFERROR(VLOOKUP(C62,Katılım!$A$4:$Z$36,26,0),0)","v":0},{"$f":"AZ24","v":0},{"$f":"IF(AND(F62=0,F63=0),\"\",IF(F62>F63,E62,E63))","v":""},null,{"$f":"IFERROR(VLOOKUP(C62,Katılım!$A$4:$G$36,6,0),0)","v":0},null,null,"E20",20,{"$f":"OFFSET(#REF!,M62,#REF!)","v":{"$error":"#REF!"}},{"$f":"IFERROR(VLOOKUP(N62,Katılım!$A$4:$Z$36,26,0),0)","v":0},{"$f":"IFERROR(VLOOKUP(N62,Katılım!$A$4:$G$36,6,0),0)","v":0},null,null,null,null,null,null,null,null,null,null,null,null,null,null,null,null,null,null,58,null,null,null,null,{"$f":"E176","v":0},{"$f":"E177","v":0}]
["20.20",null,null,null,{"$f":"IFERROR(VLOOKUP(C63,Katılım!$A$4:$Z$36,26,0),0)","v":0},{"$f":"BA24","v":0},null,null,{"$f":"IFERROR(VLOOKUP(C63,Katılım!$A$4:$G$36,6,0),0)","v":0},null,null,null,null,null,null,null,null,null,null,null,null,null,null,null,null,null,null,null,null,null,null,null,null,null,59,null,null,null,null,{"$f":"E179","v":0},{"$f":"E180","v":0}]
[null,null,null,null,null,null,null,null,null,null,null,null,null,null,null,null,null,null,null,null,null,null,null,null,null,null,null,null,null,null,null,null,null,null,60,null,null,null,null,{"$f":"E182","v":0},{"$f":"E183","v":0}]
[21,"E21",null,null,{"$f":"IFERROR(VLOOKUP(C65,Katılım!$A$4:$Z$36,26,0),0)","v":0},{"$f":"AZ25","v":0},{"$f":"IF(AND(F65=0,F66=0),\"\",IF(F65>F66,E65,E66))","v":""},null,{"$f":"IFERROR(VLOOKUP(C65,Katılım!$A$4:$G$36,6,0),0)","v":0},null,null,"E21",21,{"$f":"OFFSET(#REF!,M65,#REF!)","v":{"$error":"#REF!"}},{"$f":"IFERROR(VLOOKUP(N65,Katılım!$A$4:$Z$36,26,0),0)","v":0},{"$f":"IFERROR(VLOOKUP(N65,Katılım!$A$4:$G$36,6,0),0)","v":0},null,null,null,null,null,null,null,null,null,null,null,null,null,null,null,null,null,null,61,null,null,null,null,{"$f":"E185","v":0},{"$f":"E186","v":0}]
["21.21",null,null,null,{"$f":"IFERROR(VLOOKUP(C66,Katılım!$A$4:$Z$36,26,0),0)","v":0},{"$f":"BA25","v":0},null,null,{"$f":"IFERROR(VLOOKUP(C66,Katılım!$A$4:$G$36,6,0),0)","v":0},null,null,null,null,null,null,null,null,null,null,null,null,null,null,null,null,null,null,null,null,null,null,null,null,null,62,null,null,null,null,{"$f":"E188","v":0},{"$f":"E189","v":0}]
[null,null,null,null,null,null,null,null,null,null,null,null,null,null,null,null,null,null,null,null,null,null,null,null,null,null,null,null,null,null,null,null,null,null,63,null,null,null,null,{"$f":"E191","v":0},{"$f":"E192","v":0}]
[22,"E22",null,null,{"$f":"IFERROR(VLOOKUP(C68,Katılım!$A$4:$Z$36,26,0),0)","v":0},{"$f":"AZ26","v":0},{"$f":"IF(AND(F68=0,F69=0),\"\",IF(F68>F69,E68,E69))","v":""},null,{"$f":"IFERROR(VLOOKUP(C68,Katılım!$A$4:$G$36,6,0),0)","v":0},null,null,"E22",22,{"$f":"OFFSET(#REF!,M68,#REF!)","v":{"$error":"#REF!"}},{"$f":"IFERROR(VLOOKUP(N68,Katılım!$A$4:$Z$36,26,0),0)","v":0},{"$f":"IFERROR(VLOOKUP(N68,Katılım!$A$4:$G$36,6,0),0)","v":0},null,null,null,null,null,null,null,null,null,null,null,null,null,null,null,null,null,null,64,null,null,null,null,{"$f":"E194","v":0},{"$f":"E195","v":0}]
["22.22",null,null,null,{"$f":"IFERROR(VLOOKUP(C69,Katılım!$A$4:$Z$36,26,0),0)","v":0},{"$f":"BA26","v":0},null,null,{"$f":"IFERROR(VLOOKUP(C69,Katılım!$A$4:$G$36,6,0),0)","v":0}]
[]
[23,"E23",null,null,{"$f":"IFERROR(VLOOKUP(C71,Katılım!$A$4:$Z$36,26,0),0)","v":0},{"$f":"AZ27","v":0},{"$f":"IF(AND(F71=0,F72=0),\"\",IF(F71>F72,E71,E72))","v":""},null,{"$f":"IFERROR(VLOOKUP(C71,Katılım!$A$4:$G$36,6,0),0)","v":0},null,null,"E23",23,{"$f":"OFFSET(#REF!,M71,#REF!)","v":{"$error":"#REF!"}},{"$f":"IFERROR(VLOOKUP(N71,Katılım!$A$4:$Z$36,26,0),0)","v":0},{"$f":"IFERROR(VLOOKUP(N71,Katılım!$A$4:$G$36,6,0),0)","v":0}]
["23.23",null,null,null,{"$f":"IFERROR(VLOOKUP(C72,Katılım!$A$4:$Z$36,26,0),0)","v":0},{"$f":"BA27","v":0},null,null,{"$f":"IFERROR(VLOOKUP(C72,Katılım!$A$4:$G$36,6,0),0)","v":0}]
[]
[24,"E24",null,null,{"$f":"IFERROR(VLOOKUP(C74,Katılım!$A$4:$Z$36,26,0),0)","v":0},{"$f":"AZ28","v":0},{"$f":"IF(AND(F74=0,F75=0),\"\",IF(F74>F75,E74,E75))","v":""},null,{"$f":"IFERROR(VLOOKUP(C74,Katılım!$A$4:$G$36,6,0),0)","v":0},null,null,"E24",24,{"$f":"OFFSET(#REF!,M74,#REF!)","v":{"$error":"#REF!"}},{"$f":"IFERROR(VLOOKUP(N74,Katılım!$A$4:$Z$36,26,0),0)","v":0},{"$f":"IFERROR(VLOOKUP(N74,Katılım!$A$4:$G$36,6,0),0)","v":0}]
["24.24",null,null,null,{"$f":"IFERROR(VLOOKUP(C75,Katılım!$A$4:$Z$36,26,0),0)","v":0},{"$f":"BA28","v":0},null,null,{"$f":"IFERROR(VLOOKUP(C75,Katılım!$A$4:$G$36,6,0),0)","v":0}]
[]
[25,"E25",null,null,{"$f":"IFERROR(VLOOKUP(C77,Katılım!$A$4:$Z$36,26,0),0)","v":0},{"$f":"AZ29","v":0},{"$f":"IF(AND(F77=0,F78=0),\"\",IF(F77>F78,E77,E78))","v":""},null,{"$f":"IFERROR(VLOOKUP(C77,Katılım!$A$4:$G$36,6,0),0)","v":0},null,null,"E25",25,{"$f":"OFFSET(#REF!,M77,#REF!)","v":{"$error":"#REF!"}},{"$f":"IFERROR(VLOOKUP(N77,Katılım!$A$4:$Z$36,26,0),0)","v":0},{"$f":"IFERROR(VLOOKUP(N77,Katılım!$A$4:$G$36,6,0),0)","v":0}]
["25.25",null,null,null,{"$f":"IFERROR(VLOOKUP(C78,Katılım!$A$4:$Z$36,26,0),0)","v":0},{"$f":"BA29","v":0},null,null,{"$f":"IFERROR(VLOOKUP(C78,Katılım!$A$4:$G$36,6,0),0)","v":0}]
[]
[26,"E26",null,null,{"$f":"IFERROR(VLOOKUP(C80,Katılım!$A$4:$Z$36,26,0),0)","v":0},{"$f":"AZ30","v":0},{"$f":"IF(AND(F80=0,F81=0),\"\",IF(F80>F81,E80,E81))","v":""},null,{"$f":"IFERROR(VLOOKUP(C80,Katılım!$A$4:$G$36,6,0),0)","v":0},null,null,"E26",26,{"$f":"OFFSET(#REF!,M80,#REF!)","v":{"$error":"#REF!"}},{"$f":"IFERROR(VLOOKUP(N80,Katılım!$A$4:$Z$36,26,0),0)","v":0},{"$f":"IFERROR(VLOOKUP(N80,Katılım!$A$4:$G$36,6,0),0)","v":0}]
["26.26",null,null,null,{"$f":"IFERROR(VLOOKUP(C81,Katılım!$A$4:$Z$36,26,0),0)","v":0},{"$f":"BA30","v":0},null,null,{"$f":"IFERROR(VLOOKUP(C81,Katılım!$A$4:$G$36,6,0),0)","v":0}]
[]
[27,"E27",null,null,{"$f":"IFERROR(VLOOKUP(C83,Katılım!$A$4:$Z$36,26,0),0)","v":0},{"$f":"AZ31","v":0},{"$f":"IF(AND(F83=0,F84=0),\"\",IF(F83>F84,E83,E84))","v":""},null,{"$f":"IFERROR(VLOOKUP(C83,Katılım!$A$4:$G$36,6,0),0)","v":0},null,null,"E27",27,{"$f":"OFFSET(#REF!,M83,#REF!)","v":{"$error":"#REF!"}},{"$f":"IFERROR(VLOOKUP(N83,Katılım!$A$4:$Z$36,26,0),0)","v":0},{"$f":"IFERROR(VLOOKUP(N83,Katılım!$A$4:$G$36,6,0),0)","v":0}]
["27.27",null,null,null,{"$f":"IFERROR(VLOOKUP(C84,Katılım!$A$4:$Z$36,26,0),0)","v":0},{"$f":"BA31","v":0},null,null,{"$f":"IFERROR(VLOOKUP(C84,Katılım!$A$4:$G$36,6,0),0)","v":0}]
[]
[28,"E28",null,null,{"$f":"IFERROR(VLOOKUP(C86,Katılım!$A$4:$Z$36,26,0),0)","v":0},{"$f":"AZ32","v":0},{"$f":"IF(AND(F86=0,F87=0),\"\",IF(F86>F87,E86,E87))","v":""},null,{"$f":"IFERROR(VLOOKUP(C86,Katılım!$A$4:$G$36,6,0),0)","v":0},null,null,"E28",28,{"$f":"OFFSET(#REF!,M86,#REF!)","v":{"$error":"#REF!"}},{"$f":"IFERROR(VLOOKUP(N86,Katılım!$A$4:$Z$36,26,0),0)","v":0},{"$f":"IFERROR(VLOOKUP(N86,Katılım!$A$4:$G$36,6,0),0)","v":0}]
["28.28",null,null,null,{"$f":"IFERROR(VLOOKUP(C87,Katılım!$A$4:$Z$36,26,0),0)","v":0},{"$f":"BA32","v":0},null,null,{"$f":"IFERROR(VLOOKUP(C87,Katılım!$A$4:$G$36,6,0),0)","v":0}]
[]
[29,"E29",null,null,{"$f":"IFERROR(VLOOKUP(C89,Katılım!$A$4:$Z$36,26,0),0)","v":0},{"$f":"AZ33","v":0},{"$f":"IF(AND(F89=0,F90=0),\"\",IF(F89>F90,E89,E90))","v":""},null,{"$f":"IFERROR(VLOOKUP(C89,Katılım!$A$4:$G$36,6,0),0)","v":0},null,null,"E29",29,{"$f":"OFFSET(#REF!,M89,#REF!)","v":{"$error":"#REF!"}},{"$f":"IFERROR(VLOOKUP(N89,Katılım!$A$4:$Z$36,26,0),0)","v":0},{"$f":"IFERROR(VLOOKUP(N89,Katılım!$A$4:$G$36,6,0),0)","v":0}]
["29.29",null,null,null,{"$f":"IFERROR(VLOOKUP(C90,Katılım!$A$4:$Z$36,26,0),0)","v":0},{"$f":"BA33","v":0},null,null,{"$f":"IFERROR(VLOOKUP(C90,Katılım!$A$4:$G$36,6,0),0)","v":0}]
[]
[30,"E30",null,null,{"$f":"IFERROR(VLOOKUP(C92,Katılım!$A$4:$Z$36,26,0),0)","v":0},{"$f":"AZ34","v":0},{"$f":"IF(AND(F92=0,F93=0),\"\",IF(F92>F93,E92,E93))","v":""},null,{"$f":"IFERROR(VLOOKUP(C92,Katılım!$A$4:$G$36,6,0),0)","v":0},null,null,"E30",30,{"$f":"OFFSET(#REF!,M92,#REF!)","v":{"$error":"#REF!"}},{"$f":"IFERROR(VLOOKUP(N92,Katılım!$A$4:$Z$36,26,0),0)","v":0},{"$f":"IFERROR(VLOOKUP(N92,Katılım!$A$4:$G$36,6,0),0)","v":0}]
["30.30",null,null,null,{"$f":"IFERROR(VLOOKUP(C93,Katılım!$A$4:$Z$36,26,0),0)","v":0},{"$f":"BA34","v":0},null,null,{"$f":"IFERROR(VLOOKUP(C93,Katılım!$A$4:$G$36,6,0),0)","v":0}]
[]
[31,"E31",null,null,{"$f":"IFERROR(VLOOKUP(C95,Katılım!$A$4:$Z$36,26,0),0)","v":0},{"$f":"AZ35","v":0},{"$f":"IF(AND(F95=0,F96=0),\"\",IF(F95>F96,E95,E96))","v":""},null,{"$f":"IFERROR(VLOOKUP(C95,Katılım!$A$4:$G$36,6,0),0)","v":0},null,null,"E31",31,{"$f":"OFFSET(#REF!,M95,#REF!)","v":{"$error":"#REF!"}},{"$f":"IFERROR(VLOOKUP(N95,Katılım!$A$4:$Z$36,26,0),0)","v":0},{"$f":"IFERROR(VLOOKUP(N95,Katılım!$A$4:$G$36,6,0),0)","v":0}]
["31.31",null,null,null,{"$f":"IFERROR(VLOOKUP(C96,Katılım!$A$4:$Z$36,26,0),0)","v":0},{"$f":"BA35","v":0},null,null,{"$f":"IFERROR(VLOOKUP(C96,Katılım!$A$4:$G$36,6,0),0)","v":0}]
[]
[32,"E32",null,null,{"$f":"IFERROR(VLOOKUP(C98,Katılım!$A$4:$Z$36,26,0),0)","v":0},{"$f":"AZ36","v":0},{"$f":"IF(AND(F98=0,F99=0),\"\",IF(F98>F99,E98,E99))","v":""},null,{"$f":"IFERROR(VLOOKUP(C98,Katılım!$A$4:$G$36,6,0),0)","v":0},null,null,"E32",32,{"$f":"OFFSET(#REF!,M98,#REF!)","v":{"$error":"#REF!"}},{"$f":"IFERROR(VLOOKUP(N98,Katılım!$A$4:$Z$36,26,0),0)","v":0},{"$f":"IFERROR(VLOOKUP(N98,Katılım!$A$4:$G$36,6,0),0)","v":0}]
["32.32",null,null,null,{"$f":"IFERROR(VLOOKUP(C99,Katılım!$A$4:$Z$36,26,0),0)","v":0},{"$f":"BA36","v":0},null,null,{"$f":"IFERROR(VLOOKUP(C99,Katılım!$A$4:$G$36,6,0),0)","v":0}]
[]
[33,"E33",null,null,{"$f":"IFERROR(VLOOKUP(C101,Katılım!$A$4:$Z$36,26,0),0)","v":0},{"$f":"AZ37","v":0},{"$f":"IF(AND(F101=0,F102=0),\"\",IF(F101>F102,E101,E102))","v":""},null,{"$f":"IFERROR(VLOOKUP(C101,Katılım!$A$4:$G$36,6,0),0)","v":0},null,null,"E33",33,{"$f":"OFFSET(#REF!,M101,#REF!)","v":{"$error":"#REF!"}},{"$f":"IFERROR(VLOOKUP(N101,Katılım!$A$4:$Z$36,26,0),0)","v":0},{"$f":"IFERROR(VLOOKUP(N101,Katılım!$A$4:$G$36,6,0),0)","v":0}]
["33.33",null,null,null,{"$f":"IFERROR(VLOOKUP(C102,Katılım!$A$4:$Z$36,26,0),0)","v":0},{"$f":"BA37","v":0},null,null,{"$f":"IFERROR(VLOOKUP(C102,Katılım!$A$4:$G$36,6,0),0)","v":0}]
[]
[34,"E34",null,null,{"$f":"IFERROR(VLOOKUP(C104,Katılım!$A$4:$Z$36,26,0),0)","v":0},{"$f":"AZ38","v":0},{"$f":"IF(AND(F104=0,F105=0),\"\",IF(F104>F105,E104,E105))","v":""},null,{"$f":"IFERROR(VLOOKUP(C104,Katılım!$A$4:$G$36,6,0),0)","v":0},null,null,"E34",34,{"$f":"OFFSET(#REF!,M104,#REF!)","v":{"$error":"#REF!"}},{"$f":"IFERROR(VLOOKUP(N104,Katılım!$A$4:$Z$36,26,0),0)","v":0},{"$f":"IFERROR(VLOOKUP(N104,Katılım!$A$4:$G$36,6,0),0)","v":0}]
["34.34",null,null,null,{"$f":"IFERROR(VLOOKUP(C105,Katılım!$A$4:$Z$36,26,0),0)","v":0},{"$f":"BA38","v":0},null,null,{"$f":"IFERROR(VLOOKUP(C105,Katılım!$A$4:$G$36,6,0),0)","v":0}]
[]
[35,"E35",null,null,{"$f":"IFERROR(VLOOKUP(C107,Katılım!$A$4:$Z$36,26,0),0)","v":0},{"$f":"AZ39","v":0},{"$f":"IF(AND(F107=0,F108=0),\"\",IF(F107>F108,E107,E108))","v":""},null,{"$f":"IFERROR(VLOOKUP(C107,Katılım!$A$4:$G$36,6,0),0)","v":0},null,null,"E35",35,{"$f":"OFFSET(#REF!,M107,#REF!)","v":{"$error":"#REF!"}},{"$f":"IFERROR(VLOOKUP(N107,Katılım!$A$4:$Z$36,26,0),0)","v":0},{"$f":"IFERROR(VLOOKUP(N107,Katılım!$A$4:$G$36,6,0),0)","v":0}]
["35.35",null,null,null,{"$f":"IFERROR(VLOOKUP(C108,Katılım!$A$4:$Z$36,26,0),0)","v":0},{"$f":"BA39","v":0},null,null,{"$f":"IFERROR(VLOOKUP(C108,Katılım!$A$4:$G$36,6,0),0)","v":0}]
[]
[36,"E36",null,null,{"$f":"IFERROR(VLOOKUP(C110,Katılım!$A$4:$Z$36,26,0),0)","v":0},{"$f":"AZ40","v":0},{"$f":"IF(AND(F110=0,F111=0),\"\",IF(F110>F111,E110,E111))","v":""},null,{"$f":"IFERROR(VLOOKUP(C110,Katılım!$A$4:$G$36,6,0),0)","v":0},null,null,"E36",36,{"$f":"OFFSET(#REF!,M110,#REF!)","v":{"$error":"#REF!"}},{"$f":"IFERROR(VLOOKUP(N110,Katılım!$A$4:$Z$36,26,0),0)","v":0},{"$f":"IFERROR(VLOOKUP(N110,Katılım!$A$4:$G$36,6,0),0)","v":0}]
["36.36",null,null,null,{"$f":"IFERROR(VLOOKUP(C111,Katılım!$A$4:$Z$36,26,0),0)","v":0},{"$f":"BA40","v":0},null,null,{"$f":"IFERROR(VLOOKUP(C111,Katılım!$A$4:$G$36,6,0),0)","v":0}]
[]
[37,"E37",null,null,{"$f":"IFERROR(VLOOKUP(C113,Katılım!$A$4:$Z$36,26,0),0)","v":0},{"$f":"AZ41","v":0},{"$f":"IF(AND(F113=0,F114=0),\"\",IF(F113>F114,E113,E114))","v":""},null,{"$f":"IFERROR(VLOOKUP(C113,Katılım!$A$4:$G$36,6,0),0)","v":0},null,null,"E37",37,{"$f":"OFFSET(#REF!,M113,#REF!)","v":{"$error":"#REF!"}},{"$f":"IFERROR(VLOOKUP(N113,Katılım!$A$4:$Z$36,26,0),0)","v":0},{"$f":"IFERROR(VLOOKUP(N113,Katılım!$A$4:$G$36,6,0),0)","v":0}]
["37.37",null,null,null,{"$f":"IFERROR(VLOOKUP(C114,Katılım!$A$4:$Z$36,26,0),0)","v":0},{"$f":"BA41","v":0},null,null,{"$f":"IFERROR(VLOOKUP(C114,Katılım!$A$4:$G$36,6,0),0)","v":0}]
[]
[38,"E38",null,null,{"$f":"IFERROR(VLOOKUP(C116,Katılım!$A$4:$Z$36,26,0),0)","v":0},{"$f":"AZ42","v":0},{"$f":"IF(AND(F116=0,F117=0),\"\",IF(F116>F117,E116,E117))","v":""},null,{"$f":"IFERROR(VLOOKUP(C116,Katılım!$A$4:$G$36,6,0),0)","v":0},null,null,"E38",38,{"$f":"OFFSET(#REF!,M116,#REF!)","v":{"$error":"#REF!"}},{"$f":"IFERROR(VLOOKUP(N116,Katılım!$A$4:$Z$36,26,0),0)","v":0},{"$f":"IFERROR(VLOOKUP(N116,Katılım!$A$4:$G$36,6,0),0)","v":0}]
["38.38",null,null,null,{"$f":"IFERROR(VLOOKUP(C117,Katılım!$A$4:$Z$36,26,0),0)","v":0},{"$f":"BA42","v":0},null,null,{"$f":"IFERROR(VLOOKUP(C117,Katılım!$A$4:$G$36,6,0),0)","v":0}]
[]
[39,"E39",null,null,{"$f":"IFERROR(VLOOKUP(C119,Katılım!$A$4:$Z$36,26,0),0)","v":0},{"$f":"AZ43","v":0},{"$f":"IF(AND(F119=0,F120=0),\"\",IF(F119>F120,E119,E120))","v":""},null,{"$f":"IFERROR(VLOOKUP(C119,Katılım!$A$4:$G$36,6,0),0)","v":0},null,null,"E39",39,{"$f":"OFFSET(#REF!,M119,#REF!)","v":{"$error":"#REF!"}},{"$f":"IFERROR(VLOOKUP(N119,Katılım!$A$4:$Z$36,26,0),0)","v":0},{"$f":"IFERROR(VLOOKUP(N119,Katılım!$A$4:$G$36,6,0),0)","v":0}]
["39.39",null,null,null,{"$f":"IFERROR(VLOOKUP(C120,Katılım!$A$4:$Z$36,26,0),0)","v":0},{"$f":"BA43","v":0},null,null,{"$f":"IFERROR(VLOOKUP(C120,Katılım!$A$4:$G$36,6,0),0)","v":0}]
[]
[40,"E40",null,null,{"$f":"IFERROR(VLOOKUP(C122,Katılım!$A$4:$Z$36,26,0),0)","v":0},{"$f":"AZ44","v":0},{"$f":"IF(AND(F122=0,F123=0),\"\",IF(F122>F123,E122,E123))","v":""},null,{"$f":"IFERROR(VLOOKUP(C122,Katılım!$A$4:$G$36,6,0),0)","v":0},null,null,"E40",40,{"$f":"OFFSET(#REF!,M122,#REF!)","v":{"$error":"#REF!"}},{"$f":"IFERROR(VLOOKUP(N122,Katılım!$A$4:$Z$36,26,0),0)","v":0},{"$f":"IFERROR(VLOOKUP(N122,Katılım!$A$4:$G$36,6,0),0)","v":0}]
["40.40",null,null,null,{"$f":"IFERROR(VLOOKUP(C123,Katılım!$A$4:$Z$36,26,0),0)","v":0},{"$f":"BA44","v":0},null,null,{"$f":"IFERROR(VLOOKUP(C123,Katılım!$A$4:$G$36,6,0),0)","v":0}]
[]
[41,"E41",null,null,{"$f":"IFERROR(VLOOKUP(C125,Katılım!$A$4:$Z$36,26,0),0)","v":0},{"$f":"AZ45","v":0},{"$f":"IF(AND(F125=0,F126=0),\"\",IF(F125>F126,E125,E126))","v":""},null,{"$f":"IFERROR(VLOOKUP(C125,Katılım!$A$4:$G$36,6,0),0)","v":0},null,null,"E41",41,{"$f":"OFFSET(#REF!,M125,#REF!)","v":{"$error":"#REF!"}},{"$f":"IFERROR(VLOOKUP(N125,Katılım!$A$4:$Z$36,26,0),0)","v":0},{"$f":"IFERROR(VLOOKUP(N125,Katılım!$A$4:$G$36,6,0),0)","v":0}]
["41.41",null,null,null,{"$f":"IFERROR(VLOOKUP(C126,Katılım!$A$4:$Z$36,26,0),0)","v":0},{"$f":"BA45","v":0},null,null,{"$f":"IFERROR(VLOOKUP(C126,Katılım!$A$4:$G$36,6,0),0)","v":0}]
[]
[42,"E42",null,null,{"$f":"IFERROR(VLOOKUP(C128,Katılım!$A$4:$Z$36,26,0),0)","v":0},{"$f":"AZ46","v":0},{"$f":"IF(AND(F128=0,F129=0),\"\",IF(F128>F129,E128,E129))","v":""},null,{"$f":"IFERROR(VLOOKUP(C128,Katılım!$A$4:$G$36,6,0),0)","v":0},null,null,"E42",42,{"$f":"OFFSET(#REF!,M128,#REF!)","v":{"$error":"#REF!"}},{"$f":"IFERROR(VLOOKUP(N128,Katılım!$A$4:$Z$36,26,0),0)","v":0},{"$f":"IFERROR(VLOOKUP(N128,Katılım!$A$4:$G$36,6,0),0)","v":0}]
["42.42",null,null,null,{"$f":"IFERROR(VLOOKUP(C129,Katılım!$A$4:$Z$36,26,0),0)","v":0},{"$f":"BA46","v":0},null,null,{"$f":"IFERROR(VLOOKUP(C129,Katılım!$A$4:$G$36,6,0),0)","v":0}]
[]
[43,"E43",null,null,{"$f":"IFERROR(VLOOKUP(C131,Katılım!$A$4:$Z$36,26,0),0)","v":0},{"$f":"AZ47","v":0},{"$f":"IF(AND(F131=0,F132=0),\"\",IF(F131>F132,E131,E132))","v":""},null,{"$f":"IFERROR(VLOOKUP(C131,Katılım!$A$4:$G$36,6,0),0)","v":0},null,null,"E43",43,{"$f":"OFFSET(#REF!,M131,#REF!)","v":{"$error":"#REF!"}},{"$f":"IFERROR(VLOOKUP(N131,Katılım!$A$4:$Z$36,26,0),0)","v":0},{"$f":"IFERROR(VLOOKUP(N131,Katılım!$A$4:$G$36,6,0),0)","v":0}]
["43.43",null,null,null,{"$f":"IFERROR(VLOOKUP(C132,Katılım!$A$4:$Z$36,26,0),0)","v":0},{"$f":"BA47","v":0},null,null,{"$f":"IFERROR(VLOOKUP(C132,Katılım!$A$4:$G$36,6,0),0)","v":0}]
[]
[44,"E44",null,null,{"$f":"IFERROR(VLOOKUP(C134,Katılım!$A$4:$Z$36,26,0),0)","v":0},{"$f":"AZ48","v":0},{"$f":"IF(AND(F134=0,F135=0),\"\",IF(F134>F135,E134,E135))","v":""},null,{"$f":"IFERROR(VLOOKUP(C134,Katılım!$A$4:$G$36,6,0),0)","v":0},null,null,"E44",44,{"$f":"OFFSET(#REF!,M134,#REF!)","v":{"$error":"#REF!"}},{"$f":"IFERROR(VLOOKUP(N134,Katılım!$A$4:$Z$36,26,0),0)","v":0},{"$f":"IFERROR(VLOOKUP(N134,Katılım!$A$4:$G$36,6,0),0)","v":0}]
["44.44",null,null,null,{"$f":"IFERROR(VLOOKUP(C135,Katılım!$A$4:$Z$36,26,0),0)","v":0},{"$f":"BA48","v":0},null,null,{"$f":"IFERROR(VLOOKUP(C135,Katılım!$A$4:$G$36,6,0),0)","v":0}]
[]
[45,"E45",null,null,{"$f":"IFERROR(VLOOKUP(C137,Katılım!$A$4:$Z$36,26,0),0)","v":0},{"$f":"AZ49","v":0},{"$f":"IF(AND(F137=0,F138=0),\"\",IF(F137>F138,E137,E138))","v":""},null,{"$f":"IFERROR(VLOOKUP(C137,Katılım!$A$4:$G$36,6,0),0)","v":0},null,null,"E45",45,{"$f":"OFFSET(#REF!,M137,#REF!)","v":{"$error":"#REF!"}},{"$f":"IFERROR(VLOOKUP(N137,Katılım!$A$4:$Z$36,26,0),0)","v":0},{"$f":"IFERROR(VLOOKUP(N137,Katılım!$A$4:$G$36,6,0),0)","v":0}]
["45.45",null,null,null,{"$f":"IFERROR(VLOOKUP(C138,Katılım!$A$4:$Z$36,26,0),0)","v":0},{"$f":"BA49","v":0},null,null,{"$f":"IFERROR(VLOOKUP(C138,Katılım!$A$4:$G$36,6,0),0)","v":0}]
[]
[46,"E46",null,null,{"$f":"IFERROR(VLOOKUP(C140,Katılım!$A$4:$Z$36,26,0),0)","v":0},{"$f":"AZ50","v":0},{"$f":"IF(AND(F140=0,F141=0),\"\",IF(F140>F141,E140,E141))","v":""},null,{"$f":"IFERROR(VLOOKUP(C140,Katılım!$A$4:$G$36,6,0),0)","v":0},null,null,"E46",46,{"$f":"OFFSET(#REF!,M140,#REF!)","v":{"$error":"#REF!"}},{"$f":"IFERROR(VLOOKUP(N140,Katılım!$A$4:$Z$36,26,0),0)","v":0},{"$f":"IFERROR(VLOOKUP(N140,Katılım!$A$4:$G$36,6,0),0)","v":0}]
["46.46",null,null,null,{"$f":"IFERROR(VLOOKUP(C141,Katılım!$A$4:$Z$36,26,0),0)","v":0},{"$f":"BA50","v":0},null,null,{"$f":"IFERROR(VLOOKUP(C141,Katılım!$A$4:$G$36,6,0),0)","v":0}]
[]
[47,"E47",null,null,{"$f":"IFERROR(VLOOKUP(C143,Katılım!$A$4:$Z$36,26,0),0)","v":0},{"$f":"AZ51","v":0},{"$f":"IF(AND(F143=0,F144=0),\"\",IF(F143>F144,E143,E144))","v":""},null,{"$f":"IFERROR(VLOOKUP(C143,Katılım!$A$4:$G$36,6,0),0)","v":0},null,null,"E47",47,{"$f":"OFFSET(#REF!,M143,#REF!)","v":{"$error":"#REF!"}},{"$f":"IFERROR(VLOOKUP(N143,Katılım!$A$4:$Z$36,26,0),0)","v":0},{"$f":"IFERROR(VLOOKUP(N143,Katılım!$A$4:$G$36,6,0),0)","v":0}]
["47.47",null,null,null,{"$f":"IFERROR(VLOOKUP(C144,Katılım!$A$4:$Z$36,26,0),0)","v":0},{"$f":"BA51","v":0},null,null,{"$f":"IFERROR(VLOOKUP(C144,Katılım!$A$4:$G$36,6,0),0)","v":0}]
[]
[48,"E48",null,null,{"$f":"IFERROR(VLOOKUP(C146,Katılım!$A$4:$Z$36,26,0),0)","v":0},{"$f":"AZ52","v":0},{"$f":"IF(AND(F146=0,F147=0),\"\",IF(F146>F147,E146,E147))","v":""},null,{"$f":"IFERROR(VLOOKUP(C146,Katılım!$A$4:$G$36,6,0),0)","v":0},null,null,"E48",48,{"$f":"OFFSET(#REF!,M146,#REF!)","v":{"$error":"#REF!"}},{"$f":"IFERROR(VLOOKUP(N146,Katılım!$A$4:$Z$36,26,0),0)","v":0},{"$f":"IFERROR(VLOOKUP(N146,Katılım!$A$4:$G$36,6,0),0)","v":0}]
["48.48",null,null,null,{"$f":"IFERROR(VLOOKUP(C147,Katılım!$A$4:$Z$36,26,0),0)","v":0},{"$f":"BA52","v":0},null,null,{"$f":"IFERROR(VLOOKUP(C147,Katılım!$A$4:$G$36,6,0),0)","v":0}]
[]
[49,"E49",null,null,{"$f":"IFERROR(VLOOKUP(C149,Katılım!$A$4:$Z$36,26,0),0)","v":0},{"$f":"AZ53","v":0},{"$f":"IF(AND(F149=0,F150=0),\"\",IF(F149>F150,E149,E150))","v":""},null,{"$f":"IFERROR(VLOOKUP(C149,Katılım!$A$4:$G$36,6,0),0)","v":0},null,null,"E49",49,{"$f":"OFFSET(#REF!,M149,#REF!)","v":{"$error":"#REF!"}},{"$f":"IFERROR(VLOOKUP(N149,Katılım!$A$4:$Z$36,26,0),0)","v":0},{"$f":"IFERROR(VLOOKUP(N149,Katılım!$A$4:$G$36,6,0),0)","v":0}]
["49.49",null,null,null,{"$f":"IFERROR(VLOOKUP(C150,Katılım!$A$4:$Z$36,26,0),0)","v":0},{"$f":"BA53","v":0},null,null,{"$f":"IFERROR(VLOOKUP(C150,Katılım!$A$4:$G$36,6,0),0)","v":0}]
[]
[50,"E50",null,null,{"$f":"IFERROR(VLOOKUP(C152,Katılım!$A$4:$Z$36,26,0),0)","v":0},{"$f":"AZ54","v":0},{"$f":"IF(AND(F152=0,F153=0),\"\",IF(F152>F153,E152,E153))","v":""},null,{"$f":"IFERROR(VLOOKUP(C152,Katılım!$A$4:$G$36,6,0),0)","v":0},null,null,"E50",50,{"$f":"OFFSET(#REF!,M152,#REF!)","v":{"$error":"#REF!"}},{"$f":"IFERROR(VLOOKUP(N152,Katılım!$A$4:$Z$36,26,0),0)","v":0},{"$f":"IFERROR(VLOOKUP(N152,Katılım!$A$4:$G$36,6,0),0)","v":0}]
["50.50",null,null,null,{"$f":"IFERROR(VLOOKUP(C153,Katılım!$A$4:$Z$36,26,0),0)","v":0},{"$f":"BA54","v":0},null,null,{"$f":"IFERROR(VLOOKUP(C153,Katılım!$A$4:$G$36,6,0),0)","v":0}]
[]
[51,"E51",null,null,{"$f":"IFERROR(VLOOKUP(C155,Katılım!$A$4:$Z$36,26,0),0)","v":0},{"$f":"AZ55","v":0},{"$f":"IF(AND(F155=0,F156=0),\"\",IF(F155>F156,E155,E156))","v":""},null,{"$f":"IFERROR(VLOOKUP(C155,Katılım!$A$4:$G$36,6,0),0)","v":0},null,null,"E51",51,{"$f":"OFFSET(#REF!,M155,#REF!)","v":{"$error":"#REF!"}},{"$f":"IFERROR(VLOOKUP(N155,Katılım!$A$4:$Z$36,26,0),0)","v":0},{"$f":"IFERROR(VLOOKUP(N155,Katılım!$A$4:$G$36,6,0),0)","v":0}]
["51.51",null,null,null,{"$f":"IFERROR(VLOOKUP(C156,Katılım!$A$4:$Z$36,26,0),0)","v":0},{"$f":"BA55","v":0},null,null,{"$f":"IFERROR(VLOOKUP(C156,Katılım!$A$4:$G$36,6,0),0)","v":0}]
[]
[52,"E52",null,null,{"$f":"IFERROR(VLOOKUP(C158,Katılım!$A$4:$Z$36,26,0),0)","v":0},{"$f":"AZ56","v":0},{"$f":"IF(AND(F158=0,F159=0),\"\",IF(F158>F159,E158,E159))","v":""},null,{"$f":"IFERROR(VLOOKUP(C158,Katılım!$A$4:$G$36,6,0),0)","v":0},null,null,"E52",52,{"$f":"OFFSET(#REF!,M158,#REF!)","v":{"$error":"#REF!"}},{"$f":"IFERROR(VLOOKUP(N158,Katılım!$A$4:$Z$36,26,0),0)","v":0},{"$f":"IFERROR(VLOOKUP(N158,Katılım!$A$4:$G$36,6,0),0)","v":0}]
["52.52",null,null,null,{"$f":"IFERROR(VLOOKUP(C159,Katılım!$A$4:$Z$36,26,0),0)","v":0},{"$f":"BA56","v":0},null,null,{"$f":"IFERROR(VLOOKUP(C159,Katılım!$A$4:$G$36,6,0),0)","v":0}]
[]
[53,"E53",null,null,{"$f":"IFERROR(VLOOKUP(C161,Katılım!$A$4:$Z$36,26,0),0)","v":0},{"$f":"AZ57","v":0},{"$f":"IF(AND(F161=0,F162=0),\"\",IF(F161>F162,E161,E162))","v":""},null,{"$f":"IFERROR(VLOOKUP(C161,Katılım!$A$4:$G$36,6,0),0)","v":0},null,null,"E53",53,{"$f":"OFFSET(#REF!,M161,#REF!)","v":{"$error":"#REF!"}},{"$f":"IFERROR(VLOOKUP(N161,Katılım!$A$4:$Z$36,26,0),0)","v":0},{"$f":"IFERROR(VLOOKUP(N161,Katılım!$A$4:$G$36,6,0),0)","v":0}]
["53.53",null,null,null,{"$f":"IFERROR(VLOOKUP(C162,Katılım!$A$4:$Z$36,26,0),0)","v":0},{"$f":"BA57","v":0},null,null,{"$f":"IFERROR(VLOOKUP(C162,Katılım!$A$4:$G$36,6,0),0)","v":0}]
[]
[54,"E54",null,null,{"$f":"IFERROR(VLOOKUP(C164,Katılım!$A$4:$Z$36,26,0),0)","v":0},{"$f":"AZ58","v":0},{"$f":"IF(AND(F164=0,F165=0),\"\",IF(F164>F165,E164,E165))","v":""},null,{"$f":"IFERROR(VLOOKUP(C164,Katılım!$A$4:$G$36,6,0),0)","v":0},null,null,"E54",54,{"$f":"OFFSET(#REF!,M164,#REF!)","v":{"$error":"#REF!"}},{"$f":"IFERROR(VLOOKUP(N164,Katılım!$A$4:$Z$36,26,0),0)","v":0},{"$f":"IFERROR(VLOOKUP(N164,Katılım!$A$4:$G$36,6,0),0)","v":0}]
["54.54",null,null,null,{"$f":"IFERROR(VLOOKUP(C165,Katılım!$A$4:$Z$36,26,0),0)","v":0},{"$f":"BA58","v":0},null,null,{"$f":"IFERROR(VLOOKUP(C165,Katılım!$A$4:$G$36,6,0),0)","v":0}]
[]
[55,"E55",null,null,{"$f":"IFERROR(VLOOKUP(C167,Katılım!$A$4:$Z$36,26,0),0)","v":0},{"$f":"AZ59","v":0},{"$f":"IF(AND(F167=0,F168=0),\"\",IF(F167>F168,E167,E168))","v":""},null,{"$f":"IFERROR(VLOOKUP(C167,Katılım!$A$4:$G$36,6,0),0)","v":0},null,null,"E55",55,{"$f":"OFFSET(#REF!,M167,#REF!)","v":{"$error":"#REF!"}},{"$f":"IFERROR(VLOOKUP(N167,Katılım!$A$4:$Z$36,26,0),0)","v":0},{"$f":"IFERROR(VLOOKUP(N167,Katılım!$A$4:$G$36,6,0),0)","v":0}]
["55.55",null,null,null,{"$f":"IFERROR(VLOOKUP(C168,Katılım!$A$4:$Z$36,26,0),0)","v":0},{"$f":"BA59","v":0},null,null,{"$f":"IFERROR(VLOOKUP(C168,Katılım!$A$4:$G$36,6,0),0)","v":0}]
[]
[56,"E56",null,null,{"$f":"IFERROR(VLOOKUP(C170,Katılım!$A$4:$Z$36,26,0),0)","v":0},{"$f":"AZ60","v":0},{"$f":"IF(AND(F170=0,F171=0),\"\",IF(F170>F171,E170,E171))","v":""},null,{"$f":"IFERROR(VLOOKUP(C170,Katılım!$A$4:$G$36,6,0),0)","v":0},null,null,"E56",56,{"$f":"OFFSET(#REF!,M170,#REF!)","v":{"$error":"#REF!"}},{"$f":"IFERROR(VLOOKUP(N170,Katılım!$A$4:$Z$36,26,0),0)","v":0},{"$f":"IFERROR(VLOOKUP(N170,Katılım!$A$4:$G$36,6,0),0)","v":0}]
["56.56",null,null,null,{"$f":"IFERROR(VLOOKUP(C171,Katılım!$A$4:$Z$36,26,0),0)","v":0},{"$f":"BA60","v":0},null,null,{"$f":"IFERROR(VLOOKUP(C171,Katılım!$A$4:$G$36,6,0),0)","v":0}]
[]
[57,"E57",null,null,{"$f":"IFERROR(VLOOKUP(C173,Katılım!$A$4:$Z$36,26,0),0)","v":0},{"$f":"AZ61","v":0},{"$f":"IF(AND(F173=0,F174=0),\"\",IF(F173>F174,E173,E174))","v":""},null,{"$f":"IFERROR(VLOOKUP(C173,Katılım!$A$4:$G$36,6,0),0)","v":0},null,null,"E57",57,{"$f":"OFFSET(#REF!,M173,#REF!)","v":{"$error":"#REF!"}},{"$f":"IFERROR(VLOOKUP(N173,Katılım!$A$4:$Z$36,26,0),0)","v":0},{"$f":"IFERROR(VLOOKUP(N173,Katılım!$A$4:$G$36,6,0),0)","v":0}]
["57.57",null,null,null,{"$f":"IFERROR(VLOOKUP(C174,Katılım!$A$4:$Z$36,26,0),0)","v":0},{"$f":"BA61","v":0},null,null,{"$f":"IFERROR(VLOOKUP(C174,Katılım!$A$4:$G$36,6,0),0)","v":0}]
[]
[58,"E58",null,null,{"$f":"IFERROR(VLOOKUP(C176,Katılım!$A$4:$Z$36,26,0),0)","v":0},{"$f":"AZ62","v":0},{"$f":"IF(AND(F176=0,F177=0),\"\",IF(F176>F177,E176,E177))","v":""},null,{"$f":"IFERROR(VLOOKUP(C176,Katılım!$A$4:$G$36,6,0),0)","v":0},null,null,"E58",58,{"$f":"OFFSET(#REF!,M176,#REF!)","v":{"$error":"#REF!"}},{"$f":"IFERROR(VLOOKUP(N176,Katılım!$A$4:$Z$36,26,0),0)","v":0},{"$f":"IFERROR(VLOOKUP(N176,Katılım!$A$4:$G$36,6,0),0)","v":0}]
["58.58",null,null,null,{"$f":"IFERROR(VLOOKUP(C177,Katılım!$A$4:$Z$36,26,0),0)","v":0},{"$f":"BA62","v":0},null,null,{"$f":"IFERROR(VLOOKUP(C177,Katılım!$A$4:$G$36,6,0),0)","v":0}]
[]
[59,"E59",null,null,{"$f":"IFERROR(VLOOKUP(C179,Katılım!$A$4:$Z$36,26,0),0)","v":0},{"$f":"AZ63","v":0},{"$f":"IF(AND(F179=0,F180=0),\"\",IF(F179>F180,E179,E180))","v":""},null,{"$f":"IFERROR(VLOOKUP(C179,Katılım!$A$4:$G$36,6,0),0)","v":0},null,null,"E59",59,{"$f":"OFFSET(#REF!,M179,#REF!)","v":{"$error":"#REF!"}},{"$f":"IFERROR(VLOOKUP(N179,Katılım!$A$4:$Z$36,26,0),0)","v":0},{"$f":"IFERROR(VLOOKUP(N179,Katılım!$A$4:$G$36,6,0),0)","v":0}]
["59.59",null,null,null,{"$f":"IFERROR(VLOOKUP(C180,Katılım!$A$4:$Z$36,26,0),0)","v":0},{"$f":"BA63","v":0},null,null,{"$f":"IFERROR(VLOOKUP(C180,Katılım!$A$4:$G$36,6,0),0)","v":0}]
[]
[60,"E60",null,null,{"$f":"IFERROR(VLOOKUP(C182,Katılım!$A$4:$Z$36,26,0),0)","v":0},{"$f":"AZ64","v":0},{"$f":"IF(AND(F182=0,F183=0),\"\",IF(F182>F183,E182,E183))","v":""},null,{"$f":"IFERROR(VLOOKUP(C182,Katılım!$A$4:$G$36,6,0),0)","v":0},null,null,"E60",60,{"$f":"OFFSET(#REF!,M182,#REF!)","v":{"$error":"#REF!"}},{"$f":"IFERROR(VLOOKUP(N182,Katılım!$A$4:$Z$36,26,0),0)","v":0},{"$f":"IFERROR(VLOOKUP(N182,Katılım!$A$4:$G$36,6,0),0)","v":0}]
["60.60",null,null,null,{"$f":"IFERROR(VLOOKUP(C183,Katılım!$A$4:$Z$36,26,0),0)","v":0},{"$f":"BA64","v":0},null,null,{"$f":"IFERROR(VLOOKUP(C183,Katılım!$A$4:$G$36,6,0),0)","v":0}]
[]
[61,"E61",null,null,{"$f":"IFERROR(VLOOKUP(C185,Katılım!$A$4:$Z$36,26,0),0)","v":0},{"$f":"AZ65","v":0},{"$f":"IF(AND(F185=0,F186=0),\"\",IF(F185>F186,E185,E186))","v":""},null,{"$f":"IFERROR(VLOOKUP(C185,Katılım!$A$4:$G$36,6,0),0)","v":0},null,null,"E61",61,{"$f":"OFFSET(#REF!,M185,#REF!)","v":{"$error":"#REF!"}},{"$f":"IFERROR(VLOOKUP(N185,Katılım!$A$4:$Z$36,26,0),0)","v":0},{"$f":"IFERROR(VLOOKUP(N185,Katılım!$A$4:$G$36,6,0),0)","v":0}]
["61.61",null,null,null,{"$f":"IFERROR(VLOOKUP(C186,Katılım!$A$4:$Z$36,26,0),0)","v":0},{"$f":"BA65","v":0},null,null,{"$f":"IFERROR(VLOOKUP(C186,Katılım!$A$4:$G$36,6,0),0)","v":0}]
[]
[62,"E62",null,null,{"$f":"IFERROR(VLOOKUP(C188,Katılım!$A$4:$Z$36,26,0),0)","v":0},{"$f":"AZ66","v":0},{"$f":"IF(AND(F188=0,F189=0),\"\",IF(F188>F189,E188,E189))","v":""},null,{"$f":"IFERROR(VLOOKUP(C188,Katılım!$A$4:$G$36,6,0),0)","v":0},null,null,"E62",62,{"$f":"OFFSET(#REF!,M188,#REF!)","v":{"$error":"#REF!"}},{"$f":"IFERROR(VLOOKUP(N188,Katılım!$A$4:$Z$36,26,0),0)","v":0},{"$f":"IFERROR(VLOOKUP(N188,Katılım!$A$4:$G$36,6,0),0)","v":0}]
["62.62",null,null,null,{"$f":"IFERROR(VLOOKUP(C189,Katılım!$A$4:$Z$36,26,0),0)","v":0},{"$f":"BA66","v":0},null,null,{"$f":"IFERROR(VLOOKUP(C189,Katılım!$A$4:$G$36,6,0),0)","v":0}]
[]
[63,"E63",null,null,{"$f":"IFERROR(VLOOKUP(C191,Katılım!$A$4:$Z$36,26,0),0)","v":0},{"$f":"AZ67","v":0},{"$f":"IF(AND(F191=0,F192=0),\"\",IF(F191>F192,E191,E192))","v":""},null,{"$f":"IFERROR(VLOOKUP(C191,Katılım!$A$4:$G$36,6,0),0)","v":0},null,null,"E63",63,{"$f":"OFFSET(#REF!,M191,#REF!)","v":{"$error":"#REF!"}},{"$f":"IFERROR(VLOOKUP(N191,Katılım!$A$4:$Z$36,26,0),0)","v":0},{"$f":"IFERROR(VLOOKUP(N191,Katılım!$A$4:$G$36,6,0),0)","v":0}]
["63.63",null,null,null,{"$f":"IFERROR(VLOOKUP(C192,Katılım!$A$4:$Z$36,26,0),0)","v":0},{"$f":"BA67","v":0},null,null,{"$f":"IFERROR(VLOOKUP(C192,Katılım!$A$4:$G$36,6,0),0)","v":0}]
[]
[64,"E64",null,null,{"$f":"IFERROR(VLOOKUP(C194,Katılım!$A$4:$Z$36,26,0),0)","v":0},{"$f":"AZ68","v":0},{"$f":"IF(AND(F194=0,F195=0),\"\",IF(F194>F195,E194,E195))","v":""},null,{"$f":"IFERROR(VLOOKUP(C194,Katılım!$A$4:$G$36,6,0),0)","v":0},null,null,"E64",64,{"$f":"OFFSET(#REF!,M194,#REF!)","v":{"$error":"#REF!"}},{"$f":"IFERROR(VLOOKUP(N194,Katılım!$A$4:$Z$36,26,0),0)","v":0},{"$f":"IFERROR(VLOOKUP(N194,Katılım!$A$4:$G$36,6,0),0)","v":0}]
["64.64",null,null,null,{"$f":"IFERROR(VLOOKUP(C195,Katılım!$A$4:$Z$36,26,0),0)","v":0},{"$f":"BA68","v":0},null,null,{"$f":"IFERROR(VLOOKUP(C195,Katılım!$A$4:$G$36,6,0),0)","v":0}]

{"sheet":"Eleme","index":4,"n_rows":769,"n_cols":17,"rows_kept":769,"cut":false,"hidden":false,"merged":[[189,16,189,18],[190,9,190,15],[191,2,191,8],[192,2,192,8],[0,0,0,18],[1,0,1,18],[187,9,187,15],[188,2,188,8],[189,2,189,8],[182,2,182,8],[183,2,183,8],[184,9,184,15],[185,2,185,8],[169,9,169,15],[170,2,170,8],[164,2,164,8],[165,2,165,8],[165,16,165,18],[166,9,166,15],[167,2,167,8],[177,16,177,18],[171,2,171,8],[172,9,172,15],[173,2,173,8],[193,9,193,15],[194,2,194,8],[179,2,179,8],[180,2,180,8],[181,9,181,15],[175,9,175,15],[176,2,176,8],[177,2,177,8],[186,2,186,8],[178,9,178,15],[174,2,174,8],[161,2,161,8],[162,2,162,8],[163,9,163,15],[157,9,157,15],[158,2,158,8],[159,2,159,8],[160,9,160,15],[168,2,168,8],[153,16,153,18],[154,9,154,15],[155,2,155,8],[156,2,156,8],[150,2,150,8],[151,9,151,15],[152,2,152,8],[153,2,153,8],[146,2,146,8],[147,2,147,8],[148,9,148,15],[149,2,149,8],[143,2,143,8],[144,2,144,8],[145,9,145,15],[129,16,129,18],[130,9,130,15],[131,2,131,8],[139,9,139,15],[140,2,140,8],[141,2,141,8],[141,16,141,18],[142,9,142,15],[135,2,135,8],[136,9,136,15],[137,2,137,8],[138,2,138,8],[127,9,127,15],[121,9,121,15],[122,2,122,8],[123,2,123,8],[124,9,124,15],[132,2,132,8],[133,9,133,15],[134,2,134,8],[128,2,128,8],[129,2,129,8],[120,2,120,8],[114,2,114,8],[115,9,115,15],[116,2,116,8],[117,2,117,8],[125,2,125,8],[126,2,126,8],[113,2,113,8],[107,2,107,8],[108,2,108,8],[109,9,109,15],[103,9,103,15],[104,2,104,8],[105,2,105,8],[105,16,105,18],[117,16,117,18],[118,9,118,15],[119,2,119,8],[106,9,106,15],[99,2,99,8],[100,9,100,15],[101,2,101,8],[102,2,102,8],[110,2,110,8],[111,2,111,8],[112,9,112,15],[96,2,96,8],[97,9,97,15],[82,9,82,15],[83,2,83,8],[84,2,84,8],[98,2,98,8],[92,2,92,8],[93,2,93,8],[93,16,93,18],[94,9,94,15],[95,2,95,8],[89,2,89,8],[75,2,75,8],[76,9,76,15],[77,2,77,8],[71,2,71,8],[72,2,72,8],[73,9,73,15],[90,2,90,8],[91,9,91,15],[85,9,85,15],[86,2,86,8],[87,2,87,8],[88,9,88,15],[81,16,81,18],[69,2,69,8],[69,16,69,18],[70,9,70,15],[63,2,63,8],[64,9,64,15],[65,2,65,8],[66,2,66,8],[74,2,74,8],[78,2,78,8],[79,9,79,15],[80,2,80,8],[81,2,81,8],[61,9,61,15],[62,2,62,8],[56,2,56,8],[57,2,57,8],[57,16,57,18],[58,9,58,15],[59,2,59,8],[67,9,67,15],[68,2,68,8],[49,9,49,15],[50,2,50,8],[51,2,51,8],[52,9,52,15],[60,2,60,8],[45,16,45,18],[46,9,46,15],[47,2,47,8],[48,2,48,8],[33,16,33,18],[34,9,34,15],[27,2,27,8],[28,9,28,15],[29,2,29,8],[30,2,30,8],[25,9,25,15],[26,2,26,8],[42,2,42,8],[38,2,38,8],[39,2,39,8],[40,9,40,15],[41,2,41,8],[35,2,35,8],[36,2,36,8],[37,9,37,15],[21,16,21,18],[22,9,22,15],[23,2,23,8],[31,9,31,15],[3,2,3,8],[4,9,4,15],[5,2,5,8],[9,2,9,8],[9,16,9,18],[10,9,10,15],[11,2,11,8],[195,2,195,8],[197,2,197,8],[12,2,12,8],[6,2,6,8],[7,9,7,15],[8,2,8,8],[17,2,17,8],[18,2,18,8],[19,9,19,15],[13,9,13,15],[14,2,14,8],[15,2,15,8],[16,9,16,15],[24,2,24,8],[20,2,20,8],[21,2,21,8],[32,2,32,8],[33,2,33,8],[43,9,43,15],[44,2,44,8],[45,2,45,8],[53,2,53,8],[54,2,54,8],[55,9,55,15],[198,2,198,8],[200,2,200,8],[201,2,201,8],[203,2,203,8],[204,2,204,8],[206,2,206,8],[207,2,207,8],[209,2,209,8],[210,2,210,8],[212,2,212,8],[213,2,213,8],[215,2,215,8],[216,2,216,8],[218,2,218,8],[219,2,219,8],[221,2,221,8],[222,2,222,8],[224,2,224,8],[225,2,225,8],[227,2,227,8],[228,2,228,8],[230,2,230,8],[231,2,231,8],[233,2,233,8],[234,2,234,8],[236,2,236,8],[237,2,237,8],[239,2,239,8],[240,2,240,8],[242,2,242,8],[243,2,243,8],[245,2,245,8],[246,2,246,8],[248,2,248,8],[249,2,249,8],[251,2,251,8],[252,2,252,8],[254,2,254,8],[255,2,255,8],[257,2,257,8],[258,2,258,8],[260,2,260,8],[261,2,261,8],[263,2,263,8],[264,2,264,8],[266,2,266,8],[267,2,267,8],[269,2,269,8],[270,2,270,8],[272,2,272,8],[273,2,273,8],[275,2,275,8],[276,2,276,8],[278,2,278,8],[279,2,279,8],[281,2,281,8],[282,2,282,8],[284,2,284,8],[285,2,285,8],[287,2,287,8],[288,2,288,8],[290,2,290,8],[291,2,291,8],[293,2,293,8],[294,2,294,8],[296,2,296,8],[297,2,297,8],[299,2,299,8],[300,2,300,8],[302,2,302,8],[303,2,303,8],[305,2,305,8],[306,2,306,8],[308,2,308,8],[309,2,309,8],[311,2,311,8],[312,2,312,8],[314,2,314,8],[315,2,315,8],[317,2,317,8],[318,2,318,8],[320,2,320,8],[321,2,321,8],[323,2,323,8],[324,2,324,8],[326,2,326,8],[327,2,327,8],[329,2,329,8],[330,2,330,8],[332,2,332,8],[333,2,333,8],[335,2,335,8],[336,2,336,8],[338,2,338,8],[339,2,339,8],[341,2,341,8],[342,2,342,8],[359,2,359,8],[360,2,360,8],[344,2,344,8],[345,2,345,8],[347,2,347,8],[348,2,348,8],[350,2,350,8],[351,2,351,8],[353,2,353,8],[354,2,354,8],[356,2,356,8],[201,16,201,18],[202,9,202,15],[205,9,205,15],[208,9,208,15],[211,9,211,15],[213,16,213,18],[214,9,214,15],[217,9,217,15],[220,9,220,15],[223,9,223,15],[384,2,384,8],[386,2,386,8],[196,9,196,15],[199,9,199,15],[371,2,371,8],[372,2,372,8],[374,2,374,8],[375,2,375,8],[377,2,377,8],[378,2,378,8],[380,2,380,8],[381,2,381,8],[383,2,383,8],[357,2,357,8],[362,2,362,8],[363,2,363,8],[365,2,365,8],[366,2,366,8],[253,9,253,15],[256,9,256,15],[268,9,268,15],[271,9,271,15],[292,9,292,15],[249,16,249,18],[235,9,235,15],[237,16,237,18],[238,9,238,15],[225,16,225,18],[226,9,226,15],[229,9,229,15],[232,9,232,15],[250,9,250,15],[241,9,241,15],[244,9,244,15],[247,9,247,15],[273,16,273,18],[274,9,274,15],[259,9,259,15],[261,16,261,18],[262,9,262,15],[265,9,265,15],[285,16,285,18],[286,9,286,15],[289,9,289,15],[277,9,277,15],[280,9,280,15],[283,9,283,15],[301,9,301,15],[304,9,304,15],[307,9,307,15],[309,16,309,18],[295,9,295,15],[297,16,297,18],[298,9,298,15],[319,9,319,15],[321,16,321,18],[322,9,322,15],[325,9,325,15],[310,9,310,15],[313,9,313,15],[316,9,316,15],[337,9,337,15],[340,9,340,15],[343,9,343,15],[328,9,328,15],[331,9,331,15],[333,16,333,18],[334,9,334,15],[367,9,367,15],[369,16,369,18],[355,9,355,15],[357,16,357,18],[358,9,358,15],[345,16,345,18],[346,9,346,15],[349,9,349,15],[352,9,352,15],[370,9,370,15],[373,9,373,15],[376,9,376,15],[361,9,361,15],[364,9,364,15],[395,16,395,18],[396,9,396,15],[397,2,397,8],[398,2,398,8],[389,2,389,8],[390,9,390,15],[391,2,391,8],[392,2,392,8],[393,9,393,15],[394,2,394,8],[395,2,395,8],[379,9,379,15],[381,16,381,18],[382,9,382,15],[385,9,385,15],[368,2,368,8],[369,2,369,8],[399,9,399,15],[400,2,400,8],[401,2,401,8],[402,9,402,15],[403,2,403,8],[404,2,404,8],[405,9,405,15],[406,2,406,8],[407,2,407,8],[407,16,407,18],[408,9,408,15],[409,2,409,8],[410,2,410,8],[411,9,411,15],[412,2,412,8],[413,2,413,8],[414,9,414,15],[415,2,415,8],[416,2,416,8],[417,9,417,15],[418,2,418,8],[419,2,419,8],[419,16,419,18],[420,9,420,15],[421,2,421,8],[422,2,422,8],[423,9,423,15],[424,2,424,8],[425,2,425,8],[426,9,426,15],[427,2,427,8],[428,2,428,8],[429,9,429,15],[430,2,430,8],[431,2,431,8],[431,16,431,18],[432,9,432,15],[433,2,433,8],[434,2,434,8],[435,9,435,15],[436,2,436,8],[437,2,437,8],[438,9,438,15],[439,2,439,8],[440,2,440,8],[441,9,441,15],[442,2,442,8],[443,2,443,8],[443,16,443,18],[444,9,444,15],[445,2,445,8],[446,2,446,8],[447,9,447,15],[448,2,448,8],[449,2,449,8],[450,9,450,15],[451,2,451,8],[452,2,452,8],[453,9,453,15],[454,2,454,8],[455,2,455,8],[455,16,455,18],[456,9,456,15],[457,2,457,8],[458,2,458,8],[459,9,459,15],[460,2,460,8],[461,2,461,8],[462,9,462,15],[463,2,463,8],[464,2,464,8],[465,9,465,15],[466,2,466,8],[467,2,467,8],[467,16,467,18],[468,9,468,15],[469,2,469,8],[470,2,470,8],[471,9,471,15],[472,2,472,8],[473,2,473,8],[474,9,474,15],[475,2,475,8],[476,2,476,8],[477,9,477,15],[478,2,478,8],[479,2,479,8],[479,16,479,18],[480,9,480,15],[481,2,481,8],[482,2,482,8],[483,9,483,15],[484,2,484,8],[485,2,485,8],[486,9,486,15],[487,2,487,8],[488,2,488,8],[489,9,489,15],[490,2,490,8],[491,2,491,8],[491,16,491,18],[492,9,492,15],[493,2,493,8],[494,2,494,8],[495,9,495,15],[496,2,496,8],[497,2,497,8],[498,9,498,15],[499,2,499,8],[500,2,500,8],[501,9,501,15],[502,2,502,8],[503,2,503,8],[503,16,503,18],[504,9,504,15],[505,2,505,8],[506,2,506,8],[507,9,507,15],[508,2,508,8],[509,2,509,8],[510,9,510,15],[511,2,511,8],[512,2,512,8],[513,9,513,15],[514,2,514,8],[515,2,515,8],[515,16,515,18],[516,9,516,15],[517,2,517,8],[518,2,518,8],[519,9,519,15],[520,2,520,8],[521,2,521,8],[522,9,522,15],[523,2,523,8],[524,2,524,8],[525,9,525,15],[526,2,526,8],[527,2,527,8],[527,16,527,18],[528,9,528,15],[529,2,529,8],[530,2,530,8],[531,9,531,15],[532,2,532,8],[533,2,533,8],[534,9,534,15],[535,2,535,8],[536,2,536,8],[537,9,537,15],[538,2,538,8],[539,2,539,8],[539,16,539,18],[540,9,540,15],[541,2,541,8],[542,2,542,8],[543,9,543,15],[544,2,544,8],[545,2,545,8],[546,9,546,15],[547,2,547,8],[548,2,548,8],[557,2,557,8],[558,9,558,15],[559,2,559,8],[560,2,560,8],[561,9,561,15],[562,2,562,8],[563,2,563,8],[563,16,563,18],[549,9,549,15],[550,2,550,8],[551,2,551,8],[551,16,551,18],[552,9,552,15],[553,2,553,8],[554,2,554,8],[555,9,555,15],[556,2,556,8],[575,16,575,18],[576,9,576,15],[577,2,577,8],[564,9,564,15],[565,2,565,8],[566,2,566,8],[567,9,567,15],[568,2,568,8],[569,2,569,8],[570,9,570,15],[578,2,578,8],[579,9,579,15],[580,2,580,8],[571,2,571,8],[572,2,572,8],[573,9,573,15],[574,2,574,8],[575,2,575,8],[607,2,607,8],[593,9,593,15],[594,2,594,8],[596,9,596,15],[597,2,597,8],[599,9,599,15],[600,2,600,8],[592,2,592,8],[595,2,595,8],[598,2,598,8],[583,2,583,8],[586,2,586,8],[584,9,584,15],[585,2,585,8],[587,9,587,15],[610,2,610,8],[609,2,609,8],[611,9,611,15],[612,2,612,8],[601,2,601,8],[604,2,604,8],[601,16,601,18],[603,2,603,8],[605,9,605,15],[606,2,606,8],[608,9,608,15],[602,9,602,15],[620,9,620,15],[621,2,621,8],[623,9,623,15],[624,2,624,8],[625,16,625,18],[626,9,626,15],[613,2,613,8],[616,2,616,8],[619,2,619,8],[613,16,613,18],[614,9,614,15],[615,2,615,8],[617,9,617,15],[618,2,618,8],[627,2,627,8],[629,9,629,15],[630,2,630,8],[632,9,632,15],[633,2,633,8],[622,2,622,8],[625,2,625,8],[637,2,637,8],[640,2,640,8],[635,9,635,15],[636,2,636,8],[637,16,637,18],[638,9,638,15],[639,2,639,8],[628,2,628,8],[631,2,631,8],[634,2,634,8],[648,2,648,8],[643,2,643,8],[646,2,646,8],[641,9,641,15],[642,2,642,8],[644,9,644,15],[645,2,645,8],[647,9,647,15],[658,2,658,8],[661,2,661,8],[659,9,659,15],[660,2,660,8],[661,16,661,18],[662,9,662,15],[649,2,649,8],[652,2,652,8],[655,2,655,8],[656,9,656,15],[657,2,657,8],[664,2,664,8],[667,2,667,8],[663,2,663,8],[665,9,665,15],[666,2,666,8],[668,9,668,15],[669,2,669,8],[670,2,670,8],[673,2,673,8],[684,2,684,8],[687,2,687,8],[690,2,690,8],[685,9,685,15],[688,9,688,15],[683,2,683,8],[677,9,677,15],[678,2,678,8],[681,2,681,8],[682,9,682,15],[704,2,704,8],[702,2,702,8],[700,9,700,15],[703,9,703,15],[692,2,692,8],[695,2,695,8],[686,2,686,8],[689,2,689,8],[751,2,751,8],[733,2,733,8],[734,2,734,8],[735,9,735,15],[736,2,736,8],[737,2,737,8],[738,9,738,15],[739,2,739,8],[728,2,728,8],[731,2,731,8],[732,9,732,15],[727,9,727,15],[719,2,719,8],[722,2,722,8],[725,2,725,8],[720,2,720,8],[752,2,752,8],[753,9,753,15],[754,2,754,8],[740,2,740,8],[741,9,741,15],[742,2,742,8],[743,2,743,8],[744,9,744,15],[745,2,745,8],[746,2,746,8],[747,9,747,15],[748,2,748,8],[749,2,749,8],[750,9,750,15],[588,2,588,8],[589,16,589,18],[590,9,590,15],[591,2,591,8],[589,2,589,8],[698,2,698,8],[701,2,701,8],[693,2,693,8],[696,2,696,8],[699,2,699,8],[691,9,691,15],[694,9,694,15],[697,9,697,15],[649,16,649,18],[650,9,650,15],[651,2,651,8],[653,9,653,15],[654,2,654,8],[676,2,676,8],[671,9,671,15],[672,2,672,8],[673,16,673,18],[674,9,674,15],[675,2,675,8],[726,2,726,8],[717,2,717,8],[712,9,712,15],[715,9,715,15],[718,9,718,15],[707,2,707,8],[710,2,710,8],[705,2,705,8],[708,2,708,8],[711,2,711,8],[706,9,706,15],[709,9,709,15],[723,2,723,8],[721,9,721,15],[724,9,724,15],[713,2,713,8],[716,2,716,8],[714,2,714,8],[765,2,765,8],[766,2,766,8],[767,9,767,15],[768,2,768,8],[757,2,757,8],[758,9,758,15],[759,2,759,8],[760,2,760,8],[761,9,761,15],[762,2,762,8],[763,2,763,8],[764,9,764,15]]}
["TÜRKİYE MASA TENİSİ FEDERASYONU\nKÜÇÜKLER KUZEYBATI BÖLGESİ YARIŞMALARI"]
["ERKEK TAKIM  [12-13 Mart 2025 KOCAELİ] [ Eleme ]"]
["Y","#"]
[1,1,"FENERBAHÇE (A) (İST)"]
[null,null,null,null,0,0,null,null,1,""]
[2,256,"BEYKOZ BLD. SPOR (A) (İST)",null,null,null,null,null,null,null,null,null,null,null,null,17]
[3,128,"LÜLEBURGAZ ZİRVE SPOR (A) (KRL)",null,null,null,null,null,null,null,null,0,0]
[null,null,null,null,0,0,null,null,2,""]
[4,129,{"$error":"#N/A"}]
[5,65,{"$error":"#N/A"},null,null,null,null,null,null,null,null,null,null,null,null,null,""]
[null,null,null,null,0,0,null,null,3,""]
[6,192,"İBB SPOR (A) (İST)",null,null,null,null,null,null,null,null,null,null,null,null,18]
[7,64,"PENDİK BLD. SPOR (B) (İST)",null,null,null,null,null,null,null,null,0,0]
[null,null,null,null,0,0,null,null,4,""]
[8,193,{"$error":"#N/A"}]
[9,33,{"$error":"#N/A"}]
[null,null,null,null,0,0,null,null,5,""]
[10,224,"ULUDAĞ OKSİJEN SPOR (A) (BRS)",null,null,null,null,null,null,null,null,null,null,null,null,19]
[11,96,"BOYBEYİ SPOR (A) (SKR)",null,null,null,null,null,null,null,null,0,0]
[null,null,null,null,0,0,null,null,6,""]
[12,161,{"$error":"#N/A"}]
[13,97,{"$error":"#N/A"},null,null,null,null,null,null,null,null,null,null,null,null,null,""]
[null,null,null,null,0,0,null,null,7,""]
[14,160,"DERİNCE GSK (A) (KCL)",null,null,null,null,null,null,null,null,null,null,null,null,20]
[15,32,"TRAKER SPOR (B) (KRL)",null,null,null,null,null,null,null,null,0,0]
[null,null,null,null,0,0,null,null,8,""]
[16,225,{"$error":"#N/A"}]
[17,17,{"$error":"#N/A"}]
[null,null,null,null,0,0,null,null,9,""]
[18,240,{"$error":"#N/A"},null,null,null,null,null,null,null,null,null,null,null,null,21]
[19,112,{"$error":"#N/A"},null,null,null,null,null,null,null,null,0,0]
[null,null,null,null,0,0,null,null,10,""]
[20,145,{"$error":"#N/A"}]
[21,81,{"$error":"#N/A"},null,null,null,null,null,null,null,null,null,null,null,null,null,""]
[null,null,null,null,0,0,null,null,11,""]
[22,176,{"$error":"#N/A"},null,null,null,null,null,null,null,null,null,null,null,null,22]
[23,48,{"$error":"#N/A"},null,null,null,null,null,null,null,null,0,0]
[null,null,null,null,0,0,null,null,12,""]
[24,209,{"$error":"#N/A"}]
[25,49,{"$error":"#N/A"}]
[null,null,null,null,0,0,null,null,13,""]
[26,208,{"$error":"#N/A"},null,null,null,null,null,null,null,null,null,null,null,null,23]
[27,80,{"$error":"#N/A"},null,null,null,null,null,null,null,null,0,0]
[null,null,null,null,0,0,null,null,14,""]
[28,177,{"$error":"#N/A"}]
[29,113,{"$error":"#N/A"},null,null,null,null,null,null,null,null,null,null,null,null,null,""]
[null,null,null,null,0,0,null,null,15,""]
[30,144,{"$error":"#N/A"},null,null,null,null,null,null,null,null,null,null,null,null,24]
[31,16,{"$error":"#N/A"},null,null,null,null,null,null,null,null,0,0]
[null,null,null,null,0,0,null,null,16,""]
[32,241,"LÜLEBURGAZ GENÇLİK SPOR  (A) (KRL)"]
[33,9,"İSTANBUL DSİ (B) (İST)"]
[null,null,null,null,0,0,null,null,17,""]
[34,248,{"$error":"#N/A"},null,null,null,null,null,null,null,null,null,null,null,null,25]
[35,120,{"$error":"#N/A"},null,null,null,null,null,null,null,null,0,0]
[null,null,null,null,0,0,null,null,18,""]
[36,137,{"$error":"#N/A"}]
[37,73,{"$error":"#N/A"},null,null,null,null,null,null,null,null,null,null,null,null,null,""]
[null,null,null,null,0,0,null,null,19,""]
[38,184,{"$error":"#N/A"},null,null,null,null,null,null,null,null,null,null,null,null,26]
[39,56,{"$error":"#N/A"},null,null,null,null,null,null,null,null,0,0]
[null,null,null,null,0,0,null,null,20,""]
[40,201,{"$error":"#N/A"}]
[41,41,{"$error":"#N/A"}]
[null,null,null,null,0,0,null,null,21,""]
[42,216,{"$error":"#N/A"},null,null,null,null,null,null,null,null,null,null,null,null,27]
[43,88,{"$error":"#N/A"},null,null,null,null,null,null,null,null,0,0]
[null,null,null,null,0,0,null,null,22,""]
[44,169,{"$error":"#N/A"}]
[45,105,{"$error":"#N/A"},null,null,null,null,null,null,null,null,null,null,null,null,null,""]
[null,null,null,null,0,0,null,null,23,""]
[46,152,{"$error":"#N/A"},null,null,null,null,null,null,null,null,null,null,null,null,28]
[47,24,{"$error":"#N/A"},null,null,null,null,null,null,null,null,0,0]
[null,null,null,null,0,0,null,null,24,""]
[48,233,{"$error":"#N/A"}]
[49,25,{"$error":"#N/A"}]
[null,null,null,null,0,0,null,null,25,""]
[50,232,{"$error":"#N/A"},null,null,null,null,null,null,null,null,null,null,null,null,29]
[51,104,{"$error":"#N/A"},null,null,null,null,null,null,null,null,0,0]
[null,null,null,null,0,0,null,null,26,""]
[52,153,{"$error":"#N/A"}]
[53,89,{"$error":"#N/A"},null,null,null,null,null,null,null,null,null,null,null,null,null,""]
[null,null,null,null,0,0,null,null,27,""]
[54,168,{"$error":"#N/A"},null,null,null,null,null,null,null,null,null,null,null,null,30]
[55,40,{"$error":"#N/A"},null,null,null,null,null,null,null,null,0,0]
[null,null,null,null,0,0,null,null,28,""]
[56,217,{"$error":"#N/A"}]
[57,57,{"$error":"#N/A"}]
[null,null,null,null,0,0,null,null,29,""]
[58,200,{"$error":"#N/A"},null,null,null,null,null,null,null,null,null,null,null,null,31]
[59,72,{"$error":"#N/A"},null,null,null,null,null,null,null,null,0,0]
[null,null,null,null,0,0,null,null,30,""]
[60,185,{"$error":"#N/A"}]
[61,121,{"$error":"#N/A"},null,null,null,null,null,null,null,null,null,null,null,null,null,""]
[null,null,null,null,0,0,null,null,31,""]
[62,136,{"$error":"#N/A"},null,null,null,null,null,null,null,null,null,null,null,null,32]
[63,249,{"$error":"#N/A"},null,null,null,null,null,null,null,null,0,0]
[null,null,null,null,0,0,null,null,32,""]
[64,8,"EDİRNE YURDUM SPOR (A) (EDR)"]
[65,5,"PENDİK BLD. SPOR (A) (İST)"]
[null,null,null,null,0,0,null,null,33,""]
[66,252,{"$error":"#N/A"},null,null,null,null,null,null,null,null,null,null,null,null,33]
[67,124,{"$error":"#N/A"},null,null,null,null,null,null,null,null,0,0]
[null,null,null,null,0,0,null,null,34,""]
[68,133,{"$error":"#N/A"}]
[69,69,{"$error":"#N/A"},null,null,null,null,null,null,null,null,null,null,null,null,null,""]
[null,null,null,null,0,0,null,null,35,""]
[70,188,{"$error":"#N/A"},null,null,null,null,null,null,null,null,null,null,null,null,34]
[71,60,{"$error":"#N/A"},null,null,null,null,null,null,null,null,0,0]
[null,null,null,null,0,0,null,null,36,""]
[72,197,{"$error":"#N/A"}]
[73,37,{"$error":"#N/A"}]
[null,null,null,null,0,0,null,null,37,""]
[74,220,{"$error":"#N/A"},null,null,null,null,null,null,null,null,null,null,null,null,35]
[75,92,{"$error":"#N/A"},null,null,null,null,null,null,null,null,0,0]
[null,null,null,null,0,0,null,null,38,""]
[76,165,{"$error":"#N/A"}]
[77,101,{"$error":"#N/A"},null,null,null,null,null,null,null,null,null,null,null,null,null,""]
[null,null,null,null,0,0,null,null,39,""]
[78,156,{"$error":"#N/A"},null,null,null,null,null,null,null,null,null,null,null,null,36]
[79,28,{"$error":"#N/A"},null,null,null,null,null,null,null,null,0,0]
[null,null,null,null,0,0,null,null,40,""]
[80,229,{"$error":"#N/A"}]
[81,21,{"$error":"#N/A"}]
[null,null,null,null,0,0,null,null,41,""]
[82,236,{"$error":"#N/A"},null,null,null,null,null,null,null,null,null,null,null,null,37]
[83,108,{"$error":"#N/A"},null,null,null,null,null,null,null,null,0,0]
[null,null,null,null,0,0,null,null,42,""]
[84,149,{"$error":"#N/A"}]
[85,85,{"$error":"#N/A"},null,null,null,null,null,null,null,null,null,null,null,null,null,""]
[null,null,null,null,0,0,null,null,43,""]
[86,172,{"$error":"#N/A"},null,null,null,null,null,null,null,null,null,null,null,null,38]
[87,44,{"$error":"#N/A"},null,null,null,null,null,null,null,null,0,0]
[null,null,null,null,0,0,null,null,44,""]
[88,213,{"$error":"#N/A"}]
[89,53,{"$error":"#N/A"}]
[null,null,null,null,0,0,null,null,45,""]
[90,204,{"$error":"#N/A"},null,null,null,null,null,null,null,null,null,null,null,null,39]
[91,76,{"$error":"#N/A"},null,null,null,null,null,null,null,null,0,0]
[null,null,null,null,0,0,null,null,46,""]
[92,181,{"$error":"#N/A"}]
[93,117,{"$error":"#N/A"},null,null,null,null,null,null,null,null,null,null,null,null,null,""]
[null,null,null,null,0,0,null,null,47,""]
[94,140,{"$error":"#N/A"},null,null,null,null,null,null,null,null,null,null,null,null,40]
[95,12,{"$error":"#N/A"},null,null,null,null,null,null,null,null,0,0]
[null,null,null,null,0,0,null,null,48,""]
[96,245,"YALOVA BLD. GENÇLİK SPOR (B) (YLV)"]
[97,13,"LÜLEBURGAZ ZİRVE SPOR (B) (KRL)"]
[null,null,null,null,0,0,null,null,49,""]
[98,244,{"$error":"#N/A"},null,null,null,null,null,null,null,null,null,null,null,null,41]
[99,116,{"$error":"#N/A"},null,null,null,null,null,null,null,null,0,0]
[null,null,null,null,0,0,null,null,50,""]
[100,141,{"$error":"#N/A"}]
[101,77,{"$error":"#N/A"},null,null,null,null,null,null,null,null,null,null,null,null,null,""]
[null,null,null,null,0,0,null,null,51,""]
[102,180,{"$error":"#N/A"},null,null,null,null,null,null,null,null,null,null,null,null,42]
[103,52,{"$error":"#N/A"},null,null,null,null,null,null,null,null,0,0]
[null,null,null,null,0,0,null,null,52,""]
[104,205,{"$error":"#N/A"}]
[105,45,{"$error":"#N/A"}]
[null,null,null,null,0,0,null,null,53,""]
[106,212,{"$error":"#N/A"},null,null,null,null,null,null,null,null,null,null,null,null,43]
[107,84,{"$error":"#N/A"},null,null,null,null,null,null,null,null,0,0]
[null,null,null,null,0,0,null,null,54,""]
[108,173,{"$error":"#N/A"}]
[109,109,{"$error":"#N/A"},null,null,null,null,null,null,null,null,null,null,null,null,null,""]
[null,null,null,null,0,0,null,null,55,""]
[110,148,{"$error":"#N/A"},null,null,null,null,null,null,null,null,null,null,null,null,44]
[111,20,{"$error":"#N/A"},null,null,null,null,null,null,null,null,0,0]
[null,null,null,null,0,0,null,null,56,""]
[112,237,{"$error":"#N/A"}]
[113,29,{"$error":"#N/A"}]
[null,null,null,null,0,0,null,null,57,""]
[114,228,{"$error":"#N/A"},null,null,null,null,null,null,null,null,null,null,null,null,45]
[115,100,{"$error":"#N/A"},null,null,null,null,null,null,null,null,0,0]
[null,null,null,null,0,0,null,null,58,""]
[116,157,{"$error":"#N/A"}]
[117,93,{"$error":"#N/A"},null,null,null,null,null,null,null,null,null,null,null,null,null,""]
[null,null,null,null,0,0,null,null,59,""]
[118,164,{"$error":"#N/A"},null,null,null,null,null,null,null,null,null,null,null,null,46]
[119,36,{"$error":"#N/A"},null,null,null,null,null,null,null,null,0,0]
[null,null,null,null,0,0,null,null,60,""]
[120,221,{"$error":"#N/A"}]
[121,61,{"$error":"#N/A"}]
[null,null,null,null,0,0,null,null,61,""]
[122,196,{"$error":"#N/A"},null,null,null,null,null,null,null,null,null,null,null,null,47]
[123,68,{"$error":"#N/A"},null,null,null,null,null,null,null,null,0,0]
[null,null,null,null,0,0,null,null,62,""]
[124,189,{"$error":"#N/A"}]
[125,125,{"$error":"#N/A"},null,null,null,null,null,null,null,null,null,null,null,null,null,""]
[null,null,null,null,0,0,null,null,63,""]
[126,132,{"$error":"#N/A"},null,null,null,null,null,null,null,null,null,null,null,null,48]
[127,253,{"$error":"#N/A"},null,null,null,null,null,null,null,null,0,0]
[null,null,null,null,0,0,null,null,64,""]
[128,4,"İSTANBUL DSİ (A) (İST)"]
[129,3,"YILDIZ RAKETLER (A) (İST)"]
[null,null,null,null,0,0,null,null,65,""]
[130,254,"BEYKOZ BLD. SPOR (A) (İST)",null,null,null,null,null,null,null,null,null,null,null,null,49]
[131,126,"LÜLEBURGAZ ZİRVE SPOR (A) (KRL)",null,null,null,null,null,null,null,null,0,0]
[null,null,null,null,0,0,null,null,66,""]
[132,131,{"$error":"#N/A"}]
[133,67,{"$error":"#N/A"},null,null,null,null,null,null,null,null,null,null,null,null,null,""]
[null,null,null,null,0,0,null,null,67,""]
[134,190,"İBB SPOR (A) (İST)",null,null,null,null,null,null,null,null,null,null,null,null,50]
[135,62,"PENDİK BLD. SPOR (B) (İST)",null,null,null,null,null,null,null,null,0,0]
[null,null,null,null,0,0,null,null,68,""]
[136,195,{"$error":"#N/A"}]
[137,35,{"$error":"#N/A"}]
[null,null,null,null,0,0,null,null,69,""]
[138,222,"ULUDAĞ OKSİJEN SPOR (A) (BRS)",null,null,null,null,null,null,null,null,null,null,null,null,51]
[139,94,"BOYBEYİ SPOR (A) (SKR)",null,null,null,null,null,null,null,null,0,0]
[null,null,null,null,0,0,null,null,70,""]
[140,163,{"$error":"#N/A"}]
[141,99,{"$error":"#N/A"},null,null,null,null,null,null,null,null,null,null,null,null,null,""]
[null,null,null,null,0,0,null,null,71,""]
[142,158,"DERİNCE GSK (A) (KCL)",null,null,null,null,null,null,null,null,null,null,null,null,52]
[143,30,"TRAKER SPOR (B) (KRL)",null,null,null,null,null,null,null,null,0,0]
[null,null,null,null,0,0,null,null,72,""]
[144,227,{"$error":"#N/A"}]
[145,19,{"$error":"#N/A"}]
[null,null,null,null,0,0,null,null,73,""]
[146,238,{"$error":"#N/A"},null,null,null,null,null,null,null,null,null,null,null,null,53]
[147,110,{"$error":"#N/A"},null,null,null,null,null,null,null,null,0,0]
[null,null,null,null,0,0,null,null,74,""]
[148,147,{"$error":"#N/A"}]
[149,83,{"$error":"#N/A"},null,null,null,null,null,null,null,null,null,null,null,null,null,""]
[null,null,null,null,0,0,null,null,75,""]
[150,174,{"$error":"#N/A"},null,null,null,null,null,null,null,null,null,null,null,null,54]
[151,46,{"$error":"#N/A"},null,null,null,null,null,null,null,null,0,0]
[null,null,null,null,0,0,null,null,76,""]
[152,211,{"$error":"#N/A"}]
[153,51,{"$error":"#N/A"}]
[null,null,null,null,0,0,null,null,77,""]
[154,206,{"$error":"#N/A"},null,null,null,null,null,null,null,null,null,null,null,null,55]
[155,78,{"$error":"#N/A"},null,null,null,null,null,null,null,null,0,0]
[null,null,null,null,0,0,null,null,78,""]
[156,179,{"$error":"#N/A"}]
[157,115,{"$error":"#N/A"},null,null,null,null,null,null,null,null,null,null,null,null,null,""]
[null,null,null,null,0,0,null,null,79,""]
[158,142,{"$error":"#N/A"},null,null,null,null,null,null,null,null,null,null,null,null,56]
[159,14,{"$error":"#N/A"},null,null,null,null,null,null,null,null,0,0]
[null,null,null,null,0,0,null,null,80,""]
[160,243,"ÇAĞDAŞ KOLEJLİLER (A) (ESK)"]
[161,11,"D.S.İ. BENT SPOR (A) (ESK)"]
[null,null,null,null,0,0,null,null,81,""]
[162,246,{"$error":"#N/A"},null,null,null,null,null,null,null,null,null,null,null,null,57]
[163,118,{"$error":"#N/A"},null,null,null,null,null,null,null,null,0,0]
[null,null,null,null,0,0,null,null,82,""]
[164,139,{"$error":"#N/A"}]
[165,75,{"$error":"#N/A"},null,null,null,null,null,null,null,null,null,null,null,null,null,""]
[null,null,null,null,0,0,null,null,83,""]
[166,182,{"$error":"#N/A"},null,null,null,null,null,null,null,null,null,null,null,null,58]
[167,54,{"$error":"#N/A"},null,null,null,null,null,null,null,null,0,0]
[null,null,null,null,0,0,null,null,84,""]
[168,203,{"$error":"#N/A"}]
[169,43,{"$error":"#N/A"}]
[null,null,null,null,0,0,null,null,85,""]
[170,214,{"$error":"#N/A"},null,null,null,null,null,null,null,null,null,null,null,null,59]
[171,86,{"$error":"#N/A"},null,null,null,null,null,null,null,null,0,0]
[null,null,null,null,0,0,null,null,86,""]
[172,171,{"$error":"#N/A"}]
[173,107,{"$error":"#N/A"},null,null,null,null,null,null,null,null,null,null,null,null,null,""]
[null,null,null,null,0,0,null,null,87,""]
[174,150,{"$error":"#N/A"},null,null,null,null,null,null,null,null,null,null,null,null,60]
[175,22,{"$error":"#N/A"},null,null,null,null,null,null,null,null,0,0]
[null,null,null,null,0,0,null,null,88,""]
[176,235,{"$error":"#N/A"}]
[177,27,{"$error":"#N/A"}]
[null,null,null,null,0,0,null,null,89,""]
[178,230,{"$error":"#N/A"},null,null,null,null,null,null,null,null,null,null,null,null,61]
[179,102,{"$error":"#N/A"},null,null,null,null,null,null,null,null,0,0]
[null,null,null,null,0,0,null,null,90,""]
[180,155,{"$error":"#N/A"}]
[181,91,{"$error":"#N/A"},null,null,null,null,null,null,null,null,null,null,null,null,null,""]
[null,null,null,null,0,0,null,null,91,""]
[182,166,{"$error":"#N/A"},null,null,null,null,null,null,null,null,null,null,null,null,62]
[183,38,{"$error":"#N/A"},null,null,null,null,null,null,null,null,0,0]
[null,null,null,null,0,0,null,null,92,""]
[184,219,{"$error":"#N/A"}]
[185,59,{"$error":"#N/A"}]
[null,null,null,null,0,0,null,null,93,""]
[186,198,{"$error":"#N/A"},null,null,null,null,null,null,null,null,null,null,null,null,63]
[187,70,{"$error":"#N/A"},null,null,null,null,null,null,null,null,0,0]
[null,null,null,null,0,0,null,null,94,""]
[188,187,{"$error":"#N/A"}]
[189,123,{"$error":"#N/A"},null,null,null,null,null,null,null,null,null,null,null,null,null,""]
[null,null,null,null,0,0,null,null,95,""]
[190,134,{"$error":"#N/A"},null,null,null,null,null,null,null,null,null,null,null,null,64]
[191,251,{"$error":"#N/A"},null,null,null,null,null,null,null,null,0,0]
[null,null,null,null,0,0,null,null,96,""]
[192,6,"ÇERKEZKÖY BLD. GSK (A) (TKD)"]
[193,7,"BURSA B. ŞEH. BLD. SPOR (A) (BRS)"]
[null,null,null,null,0,0,null,null,97,""]
[194,250,{"$error":"#N/A"},null,null,null,null,null,null,null,null,null,null,null,null,65]
[195,122,{"$error":"#N/A"},null,null,null,null,null,null,null,null,0,0]
[null,null,null,null,0,0,null,null,98,""]
[196,135,{"$error":"#N/A"}]
[197,71,{"$error":"#N/A"},null,null,null,null,null,null,null,null,null,null,null,null,null,""]
[null,null,null,null,0,0,null,null,99,""]
[198,186,{"$error":"#N/A"},null,null,null,null,null,null,null,null,null,null,null,null,66]
[199,58,{"$error":"#N/A"},null,null,null,null,null,null,null,null,0,0]
[null,null,null,null,0,0,null,null,100,""]
[200,199,{"$error":"#N/A"}]
[201,39,{"$error":"#N/A"}]
[null,null,null,null,0,0,null,null,101,""]
[202,218,{"$error":"#N/A"},null,null,null,null,null,null,null,null,null,null,null,null,67]
[203,90,{"$error":"#N/A"},null,null,null,null,null,null,null,null,0,0]
[null,null,null,null,0,0,null,null,102,""]
[204,167,{"$error":"#N/A"}]
[205,103,{"$error":"#N/A"},null,null,null,null,null,null,null,null,null,null,null,null,null,""]
[null,null,null,null,0,0,null,null,103,""]
[206,154,{"$error":"#N/A"},null,null,null,null,null,null,null,null,null,null,null,null,68]
[207,26,{"$error":"#N/A"},null,null,null,null,null,null,null,null,0,0]
[null,null,null,null,0,0,null,null,104,""]
[208,231,{"$error":"#N/A"}]
[209,23,{"$error":"#N/A"}]
[null,null,null,null,0,0,null,null,105,""]
[210,234,{"$error":"#N/A"},null,null,null,null,null,null,null,null,null,null,null,null,69]
[211,106,{"$error":"#N/A"},null,null,null,null,null,null,null,null,0,0]
[null,null,null,null,0,0,null,null,106,""]
[212,151,{"$error":"#N/A"}]
[213,87,{"$error":"#N/A"},null,null,null,null,null,null,null,null,null,null,null,null,null,""]
[null,null,null,null,0,0,null,null,107,""]
[214,170,{"$error":"#N/A"},null,null,null,null,null,null,null,null,null,null,null,null,70]
[215,42,{"$error":"#N/A"},null,null,null,null,null,null,null,null,0,0]
[null,null,null,null,0,0,null,null,108,""]
[216,215,{"$error":"#N/A"}]
[217,55,{"$error":"#N/A"}]
[null,null,null,null,0,0,null,null,109,""]
[218,202,{"$error":"#N/A"},null,null,null,null,null,null,null,null,null,null,null,null,71]
[219,74,{"$error":"#N/A"},null,null,null,null,null,null,null,null,0,0]
[null,null,null,null,0,0,null,null,110,""]
[220,183,{"$error":"#N/A"}]
[221,119,{"$error":"#N/A"},null,null,null,null,null,null,null,null,null,null,null,null,null,""]
[null,null,null,null,0,0,null,null,111,""]
[222,138,{"$error":"#N/A"},null,null,null,null,null,null,null,null,null,null,null,null,72]
[223,10,{"$error":"#N/A"},null,null,null,null,null,null,null,null,0,0]
[null,null,null,null,0,0,null,null,112,""]
[224,247,"TRAKER SPOR (A) (KRL)"]
[225,15,"YILDIZ RAKETLER (B) (İST)"]
[null,null,null,null,0,0,null,null,113,""]
[226,242,{"$error":"#N/A"},null,null,null,null,null,null,null,null,null,null,null,null,73]
[227,114,{"$error":"#N/A"},null,null,null,null,null,null,null,null,0,0]
[null,null,null,null,0,0,null,null,114,""]
[228,143,{"$error":"#N/A"}]
[229,79,{"$error":"#N/A"},null,null,null,null,null,null,null,null,null,null,null,null,null,""]
[null,null,null,null,0,0,null,null,115,""]
[230,178,{"$error":"#N/A"},null,null,null,null,null,null,null,null,null,null,null,null,74]
[231,50,{"$error":"#N/A"},null,null,null,null,null,null,null,null,0,0]
[null,null,null,null,0,0,null,null,116,""]
[232,207,{"$error":"#N/A"}]
[233,47,{"$error":"#N/A"}]
[null,null,null,null,0,0,null,null,117,""]
[234,210,{"$error":"#N/A"},null,null,null,null,null,null,null,null,null,null,null,null,75]
[235,82,{"$error":"#N/A"},null,null,null,null,null,null,null,null,0,0]
[null,null,null,null,0,0,null,null,118,""]
[236,175,{"$error":"#N/A"}]
[237,111,{"$error":"#N/A"},null,null,null,null,null,null,null,null,null,null,null,null,null,""]
[null,null,null,null,0,0,null,null,119,""]
[238,146,{"$error":"#N/A"},null,null,null,null,null,null,null,null,null,null,null,null,76]
[239,18,{"$error":"#N/A"},null,null,null,null,null,null,null,null,0,0]
[null,null,null,null,0,0,null,null,120,""]
[240,239,{"$error":"#N/A"}]
[241,31,{"$error":"#N/A"}]
[null,null,null,null,0,0,null,null,121,""]
[242,226,{"$error":"#N/A"},null,null,null,null,null,null,null,null,null,null,null,null,77]
[243,98,{"$error":"#N/A"},null,null,null,null,null,null,null,null,0,0]
[null,null,null,null,0,0,null,null,122,""]
[244,159,{"$error":"#N/A"}]
[245,95,{"$error":"#N/A"},null,null,null,null,null,null,null,null,null,null,null,null,null,""]
[null,null,null,null,0,0,null,null,123,""]
[246,162,{"$error":"#N/A"},null,null,null,null,null,null,null,null,null,null,null,null,78]
[247,34,{"$error":"#N/A"},null,null,null,null,null,null,null,null,0,0]
[null,null,null,null,0,0,null,null,124,""]
[248,223,{"$error":"#N/A"}]
[249,63,{"$error":"#N/A"}]
[null,null,null,null,0,0,null,null,125,""]
[250,194,{"$error":"#N/A"},null,null,null,null,null,null,null,null,null,null,null,null,79]
[251,66,{"$error":"#N/A"},null,null,null,null,null,null,null,null,0,0]
[null,null,null,null,0,0,null,null,126,""]
[252,191,{"$error":"#N/A"}]
[253,127,{"$error":"#N/A"},null,null,null,null,null,null,null,null,null,null,null,null,null,""]
[null,null,null,null,0,0,null,null,127,""]
[254,130,{"$error":"#N/A"},null,null,null,null,null,null,null,null,null,null,null,null,80]
[255,255,{"$error":"#N/A"},null,null,null,null,null,null,null,null,0,0]
[null,null,null,null,0,0,null,null,128,""]
[256,2,"YALOVA BLD. GENÇLİK SPOR (A) (YLV)"]
[]
[]
[1,1,"FENERBAHÇE (A) (İST)"]
[null,null,null,null,0,0,null,null,1,""]
[2,128,"ESKİŞEHİR YURDUM SPOR (A) (ESK)",null,null,null,null,null,null,null,null,null,null,null,null,65]
[3,64,"B.B.KAĞITSPOR (A) (KCL)",null,null,null,null,null,null,null,null,0,0]
[null,null,null,null,0,0,null,null,2,""]
[4,65,{"$error":"#N/A"}]
[5,32,{"$error":"#N/A"},null,null,null,null,null,null,null,null,null,null,null,null,null,""]
[null,null,null,null,0,0,null,null,3,""]
[6,97,"PENDİK BLD. SPOR (C) (İST)",null,null,null,null,null,null,null,null,null,null,null,null,66]
[7,33,"ULUDAĞ OKSİJEN SPOR (B) (BRS)",null,null,null,null,null,null,null,null,0,0]
[null,null,null,null,0,0,null,null,4,""]
[8,96,{"$error":"#N/A"}]
[9,16,{"$error":"#N/A"}]
[null,null,null,null,0,0,null,null,5,""]
[10,113,"İBB SPOR (B) (İST)",null,null,null,null,null,null,null,null,null,null,null,null,67]
[11,49,"GENÇ TRAKYA SPOR (A) (EDR)",null,null,null,null,null,null,null,null,0,0]
[null,null,null,null,0,0,null,null,6,""]
[12,80,{"$error":"#N/A"}]
[13,17,{"$error":"#N/A"},null,null,null,null,null,null,null,null,null,null,null,null,null,""]
[null,null,null,null,0,0,null,null,7,""]
[14,112,"KOCAELİ GSIM (B) (KCL)",null,null,null,null,null,null,null,null,null,null,null,null,68]
[15,48,"KOCAELİ GSIM (A) (KCL)",null,null,null,null,null,null,null,null,0,0]
[null,null,null,null,0,0,null,null,8,""]
[16,81,"LÜLEBURGAZ ZİRVE SPOR (B) (KRL)"]
[17,88,"İSTANBUL DSİ (B) (İST)"]
[null,null,null,null,0,0,null,null,9,""]
[18,41,{"$error":"#N/A"},null,null,null,null,null,null,null,null,null,null,null,null,69]
[19,105,{"$error":"#N/A"},null,null,null,null,null,null,null,null,0,0]
[null,null,null,null,0,0,null,null,10,""]
[20,24,{"$error":"#N/A"}]
[21,73,{"$error":"#N/A"},null,null,null,null,null,null,null,null,null,null,null,null,null,""]
[null,null,null,null,0,0,null,null,11,""]
[22,56,{"$error":"#N/A"},null,null,null,null,null,null,null,null,null,null,null,null,70]
[23,120,{"$error":"#N/A"},null,null,null,null,null,null,null,null,0,0]
[null,null,null,null,0,0,null,null,12,""]
[24,9,{"$error":"#N/A"}]
[25,89,{"$error":"#N/A"}]
[null,null,null,null,0,0,null,null,13,""]
[26,40,{"$error":"#N/A"},null,null,null,null,null,null,null,null,null,null,null,null,71]
[27,104,{"$error":"#N/A"},null,null,null,null,null,null,null,null,0,0]
[null,null,null,null,0,0,null,null,14,""]
[28,25,{"$error":"#N/A"}]
[29,72,{"$error":"#N/A"},null,null,null,null,null,null,null,null,null,null,null,null,null,""]
[null,null,null,null,0,0,null,null,15,""]
[30,57,{"$error":"#N/A"},null,null,null,null,null,null,null,null,null,null,null,null,72]
[31,121,{"$error":"#N/A"},null,null,null,null,null,null,null,null,0,0]
[null,null,null,null,0,0,null,null,16,""]
[32,8,"BURSA B. ŞEH. BLD. SPOR (A) (BRS)"]
[33,5,"PENDİK BLD. SPOR (A) (İST)"]
[null,null,null,null,0,0,null,null,17,""]
[34,124,{"$error":"#N/A"},null,null,null,null,null,null,null,null,null,null,null,null,73]
[35,60,{"$error":"#N/A"},null,null,null,null,null,null,null,null,0,0]
[null,null,null,null,0,0,null,null,18,""]
[36,69,{"$error":"#N/A"}]
[37,28,{"$error":"#N/A"},null,null,null,null,null,null,null,null,null,null,null,null,null,""]
[null,null,null,null,0,0,null,null,19,""]
[38,101,{"$error":"#N/A"},null,null,null,null,null,null,null,null,null,null,null,null,74]
[39,37,{"$error":"#N/A"},null,null,null,null,null,null,null,null,0,0]
[null,null,null,null,0,0,null,null,20,""]
[40,92,{"$error":"#N/A"}]
[41,12,{"$error":"#N/A"}]
[null,null,null,null,0,0,null,null,21,""]
[42,117,{"$error":"#N/A"},null,null,null,null,null,null,null,null,null,null,null,null,75]
[43,53,{"$error":"#N/A"},null,null,null,null,null,null,null,null,0,0]
[null,null,null,null,0,0,null,null,22,""]
[44,76,{"$error":"#N/A"}]
[45,21,{"$error":"#N/A"},null,null,null,null,null,null,null,null,null,null,null,null,null,""]
[null,null,null,null,0,0,null,null,23,""]
[46,108,{"$error":"#N/A"},null,null,null,null,null,null,null,null,null,null,null,null,76]
[47,44,{"$error":"#N/A"},null,null,null,null,null,null,null,null,0,0]
[null,null,null,null,0,0,null,null,24,""]
[48,85,"D.S.İ. BENT SPOR (A) (ESK)"]
[49,84,"YILDIZ RAKETLER (B) (İST)"]
[null,null,null,null,0,0,null,null,25,""]
[50,45,{"$error":"#N/A"},null,null,null,null,null,null,null,null,null,null,null,null,77]
[51,109,{"$error":"#N/A"},null,null,null,null,null,null,null,null,0,0]
[null,null,null,null,0,0,null,null,26,""]
[52,20,{"$error":"#N/A"}]
[53,77,{"$error":"#N/A"},null,null,null,null,null,null,null,null,null,null,null,null,null,""]
[null,null,null,null,0,0,null,null,27,""]
[54,52,{"$error":"#N/A"},null,null,null,null,null,null,null,null,null,null,null,null,78]
[55,116,{"$error":"#N/A"},null,null,null,null,null,null,null,null,0,0]
[null,null,null,null,0,0,null,null,28,""]
[56,13,{"$error":"#N/A"}]
[57,93,{"$error":"#N/A"}]
[null,null,null,null,0,0,null,null,29,""]
[58,36,{"$error":"#N/A"},null,null,null,null,null,null,null,null,null,null,null,null,79]
[59,100,{"$error":"#N/A"},null,null,null,null,null,null,null,null,0,0]
[null,null,null,null,0,0,null,null,30,""]
[60,29,{"$error":"#N/A"}]
[61,68,{"$error":"#N/A"},null,null,null,null,null,null,null,null,null,null,null,null,null,""]
[null,null,null,null,0,0,null,null,31,""]
[62,61,{"$error":"#N/A"},null,null,null,null,null,null,null,null,null,null,null,null,80]
[63,125,{"$error":"#N/A"},null,null,null,null,null,null,null,null,0,0]
[null,null,null,null,0,0,null,null,32,""]
[64,4,"YILDIZ RAKETLER (A) (İST)"]
[65,3,"İSTANBUL DSİ (A) (İST)"]
[null,null,null,null,0,0,null,null,33,""]
[66,126,"BEYKOZ BLD. SPOR (A) (İST)",null,null,null,null,null,null,null,null,null,null,null,null,81]
[67,62,"LÜLEBURGAZ ZİRVE SPOR (A) (KRL)",null,null,null,null,null,null,null,null,0,0]
[null,null,null,null,0,0,null,null,34,""]
[68,67,{"$error":"#N/A"}]
[69,30,{"$error":"#N/A"},null,null,null,null,null,null,null,null,null,null,null,null,null,""]
[null,null,null,null,0,0,null,null,35,""]
[70,99,"İBB SPOR (A) (İST)",null,null,null,null,null,null,null,null,null,null,null,null,82]
[71,35,"PENDİK BLD. SPOR (B) (İST)",null,null,null,null,null,null,null,null,0,0]
[null,null,null,null,0,0,null,null,36,""]
[72,94,{"$error":"#N/A"}]
[73,14,{"$error":"#N/A"}]
[null,null,null,null,0,0,null,null,37,""]
[74,115,"ULUDAĞ OKSİJEN SPOR (A) (BRS)",null,null,null,null,null,null,null,null,null,null,null,null,83]
[75,51,"BOYBEYİ SPOR (A) (SKR)",null,null,null,null,null,null,null,null,0,0]
[null,null,null,null,0,0,null,null,38,""]
[76,78,{"$error":"#N/A"}]
[77,19,{"$error":"#N/A"},null,null,null,null,null,null,null,null,null,null,null,null,null,""]
[null,null,null,null,0,0,null,null,39,""]
[78,110,"DERİNCE GSK (A) (KCL)",null,null,null,null,null,null,null,null,null,null,null,null,84]
[79,46,"TRAKER SPOR (B) (KRL)",null,null,null,null,null,null,null,null,0,0]
[null,null,null,null,0,0,null,null,40,""]
[80,83,"LÜLEBURGAZ GENÇLİK SPOR  (A) (KRL)"]
[81,86,"YALOVA BLD. GENÇLİK SPOR (B) (YLV)"]
[null,null,null,null,0,0,null,null,41,""]
[82,43,{"$error":"#N/A"},null,null,null,null,null,null,null,null,null,null,null,null,85]
[83,107,{"$error":"#N/A"},null,null,null,null,null,null,null,null,0,0]
[null,null,null,null,0,0,null,null,42,""]
[84,22,{"$error":"#N/A"}]
[85,75,{"$error":"#N/A"},null,null,null,null,null,null,null,null,null,null,null,null,null,""]
[null,null,null,null,0,0,null,null,43,""]
[86,54,{"$error":"#N/A"},null,null,null,null,null,null,null,null,null,null,null,null,86]
[87,118,{"$error":"#N/A"},null,null,null,null,null,null,null,null,0,0]
[null,null,null,null,0,0,null,null,44,""]
[88,11,{"$error":"#N/A"}]
[89,91,{"$error":"#N/A"}]
[null,null,null,null,0,0,null,null,45,""]
[90,38,{"$error":"#N/A"},null,null,null,null,null,null,null,null,null,null,null,null,87]
[91,102,{"$error":"#N/A"},null,null,null,null,null,null,null,null,0,0]
[null,null,null,null,0,0,null,null,46,""]
[92,27,{"$error":"#N/A"}]
[93,70,{"$error":"#N/A"},null,null,null,null,null,null,null,null,null,null,null,null,null,""]
[null,null,null,null,0,0,null,null,47,""]
[94,59,{"$error":"#N/A"},null,null,null,null,null,null,null,null,null,null,null,null,88]
[95,123,{"$error":"#N/A"},null,null,null,null,null,null,null,null,0,0]
[null,null,null,null,0,0,null,null,48,""]
[96,6,"ÇERKEZKÖY BLD. GSK (A) (TKD)"]
[97,7,"EDİRNE YURDUM SPOR (A) (EDR)"]
[null,null,null,null,0,0,null,null,49,""]
[98,122,{"$error":"#N/A"},null,null,null,null,null,null,null,null,null,null,null,null,89]
[99,58,{"$error":"#N/A"},null,null,null,null,null,null,null,null,0,0]
[null,null,null,null,0,0,null,null,50,""]
[100,71,{"$error":"#N/A"}]
[101,26,{"$error":"#N/A"},null,null,null,null,null,null,null,null,null,null,null,null,null,""]
[null,null,null,null,0,0,null,null,51,""]
[102,103,{"$error":"#N/A"},null,null,null,null,null,null,null,null,null,null,null,null,90]
[103,39,{"$error":"#N/A"},null,null,null,null,null,null,null,null,0,0]
[null,null,null,null,0,0,null,null,52,""]
[104,90,{"$error":"#N/A"}]
[105,10,{"$error":"#N/A"}]
[null,null,null,null,0,0,null,null,53,""]
[106,119,{"$error":"#N/A"},null,null,null,null,null,null,null,null,null,null,null,null,91]
[107,55,{"$error":"#N/A"},null,null,null,null,null,null,null,null,0,0]
[null,null,null,null,0,0,null,null,54,""]
[108,74,{"$error":"#N/A"}]
[109,23,{"$error":"#N/A"},null,null,null,null,null,null,null,null,null,null,null,null,null,""]
[null,null,null,null,0,0,null,null,55,""]
[110,106,{"$error":"#N/A"},null,null,null,null,null,null,null,null,null,null,null,null,92]
[111,42,{"$error":"#N/A"},null,null,null,null,null,null,null,null,0,0]
[null,null,null,null,0,0,null,null,56,""]
[112,87,"TRAKER SPOR (A) (KRL)"]
[113,82,"ÇAĞDAŞ KOLEJLİLER (A) (ESK)"]
[null,null,null,null,0,0,null,null,57,""]
[114,47,{"$error":"#N/A"},null,null,null,null,null,null,null,null,null,null,null,null,93]
[115,111,{"$error":"#N/A"},null,null,null,null,null,null,null,null,0,0]
[null,null,null,null,0,0,null,null,58,""]
[116,18,{"$error":"#N/A"}]
[117,79,{"$error":"#N/A"},null,null,null,null,null,null,null,null,null,null,null,null,null,""]
[null,null,null,null,0,0,null,null,59,""]
[118,50,{"$error":"#N/A"},null,null,null,null,null,null,null,null,null,null,null,null,94]
[119,114,{"$error":"#N/A"},null,null,null,null,null,null,null,null,0,0]
[null,null,null,null,0,0,null,null,60,""]
[120,15,{"$error":"#N/A"}]
[121,95,{"$error":"#N/A"}]
[null,null,null,null,0,0,null,null,61,""]
[122,34,{"$error":"#N/A"},null,null,null,null,null,null,null,null,null,null,null,null,95]
[123,98,{"$error":"#N/A"},null,null,null,null,null,null,null,null,0,0]
[null,null,null,null,0,0,null,null,62,""]
[124,31,{"$error":"#N/A"}]
[125,66,{"$error":"#N/A"},null,null,null,null,null,null,null,null,null,null,null,null,null,""]
[null,null,null,null,0,0,null,null,63,""]
[126,63,{"$error":"#N/A"},null,null,null,null,null,null,null,null,null,null,null,null,96]
[127,127,{"$error":"#N/A"},null,null,null,null,null,null,null,null,0,0]
[null,null,null,null,0,0,null,null,64,""]
[128,2,"YALOVA BLD. GENÇLİK SPOR (A) (YLV)"]
[]
[]
[1,1,"FENERBAHÇE (A) (İST)"]
[null,null,null,null,0,0,null,null,1,""]
[2,64,"ESKİŞEHİR YURDUM SPOR (A) (ESK)",null,null,null,null,null,null,null,null,null,null,null,null,33]
[3,48,"B.B.KAĞITSPOR (A) (KCL)",null,null,null,null,null,null,null,null,0,0]
[null,null,null,null,0,0,null,null,2,""]
[4,32,{"$error":"#N/A"}]
[5,17,{"$error":"#N/A"},null,null,null,null,null,null,null,null,null,null,null,null,null,""]
[null,null,null,null,0,0,null,null,3,""]
[6,33,"PENDİK BLD. SPOR (C) (İST)",null,null,null,null,null,null,null,null,null,null,null,null,34]
[7,49,"PENDİK BLD. SPOR (B) (İST)",null,null,null,null,null,null,null,null,0,0]
[null,null,null,null,0,0,null,null,4,""]
[8,16,"YILDIZ RAKETLER (B) (İST)"]
[9,9,"İSTANBUL DSİ (B) (İST)"]
[null,null,null,null,0,0,null,null,5,""]
[10,56,"İBB SPOR (B) (İST)",null,null,null,null,null,null,null,null,null,null,null,null,35]
[11,40,"GENÇ TRAKYA SPOR (A) (EDR)",null,null,null,null,null,null,null,null,0,0]
[null,null,null,null,0,0,null,null,6,""]
[12,24,{"$error":"#N/A"}]
[13,25,{"$error":"#N/A"},null,null,null,null,null,null,null,null,null,null,null,null,null,""]
[null,null,null,null,0,0,null,null,7,""]
[14,41,"KOCAELİ GSIM (B) (KCL)",null,null,null,null,null,null,null,null,null,null,null,null,36]
[15,57,"KOCAELİ GSIM (A) (KCL)",null,null,null,null,null,null,null,null,0,0]
[null,null,null,null,0,0,null,null,8,""]
[16,8,"EDİRNE YURDUM SPOR (A) (EDR)"]
[17,5,"PENDİK BLD. SPOR (A) (İST)"]
[null,null,null,null,0,0,null,null,9,""]
[18,60,{"$error":"#N/A"},null,null,null,null,null,null,null,null,null,null,null,null,37]
[19,44,{"$error":"#N/A"},null,null,null,null,null,null,null,null,0,0]
[null,null,null,null,0,0,null,null,10,""]
[20,28,{"$error":"#N/A"}]
[21,21,{"$error":"#N/A"},null,null,null,null,null,null,null,null,null,null,null,null,null,""]
[null,null,null,null,0,0,null,null,11,""]
[22,37,{"$error":"#N/A"},null,null,null,null,null,null,null,null,null,null,null,null,38]
[23,53,{"$error":"#N/A"},null,null,null,null,null,null,null,null,0,0]
[null,null,null,null,0,0,null,null,12,""]
[24,12,"D.S.İ. BENT SPOR (A) (ESK)"]
[25,13,"LÜLEBURGAZ ZİRVE SPOR (B) (KRL)"]
[null,null,null,null,0,0,null,null,13,""]
[26,52,{"$error":"#N/A"},null,null,null,null,null,null,null,null,null,null,null,null,39]
[27,36,{"$error":"#N/A"},null,null,null,null,null,null,null,null,0,0]
[null,null,null,null,0,0,null,null,14,""]
[28,20,{"$error":"#N/A"}]
[29,29,{"$error":"#N/A"},null,null,null,null,null,null,null,null,null,null,null,null,null,""]
[null,null,null,null,0,0,null,null,15,""]
[30,45,{"$error":"#N/A"},null,null,null,null,null,null,null,null,null,null,null,null,40]
[31,61,{"$error":"#N/A"},null,null,null,null,null,null,null,null,0,0]
[null,null,null,null,0,0,null,null,16,""]
[32,4,"YILDIZ RAKETLER (A) (İST)"]
[33,3,"İSTANBUL DSİ (A) (İST)"]
[null,null,null,null,0,0,null,null,17,""]
[34,62,"BEYKOZ BLD. SPOR (A) (İST)",null,null,null,null,null,null,null,null,null,null,null,null,41]
[35,46,"LÜLEBURGAZ ZİRVE SPOR (A) (KRL)",null,null,null,null,null,null,null,null,0,0]
[null,null,null,null,0,0,null,null,18,""]
[36,30,{"$error":"#N/A"}]
[37,19,{"$error":"#N/A"},null,null,null,null,null,null,null,null,null,null,null,null,null,""]
[null,null,null,null,0,0,null,null,19,""]
[38,35,"İBB SPOR (A) (İST)",null,null,null,null,null,null,null,null,null,null,null,null,42]
[39,51,"ULUDAĞ OKSİJEN SPOR (B) (BRS)",null,null,null,null,null,null,null,null,0,0]
[null,null,null,null,0,0,null,null,20,""]
[40,14,"ÇAĞDAŞ KOLEJLİLER (A) (ESK)"]
[41,11,"YALOVA BLD. GENÇLİK SPOR (B) (YLV)"]
[null,null,null,null,0,0,null,null,21,""]
[42,54,"ULUDAĞ OKSİJEN SPOR (A) (BRS)",null,null,null,null,null,null,null,null,null,null,null,null,43]
[43,38,"BOYBEYİ SPOR (A) (SKR)",null,null,null,null,null,null,null,null,0,0]
[null,null,null,null,0,0,null,null,22,""]
[44,22,{"$error":"#N/A"}]
[45,27,{"$error":"#N/A"},null,null,null,null,null,null,null,null,null,null,null,null,null,""]
[null,null,null,null,0,0,null,null,23,""]
[46,43,"DERİNCE GSK (A) (KCL)",null,null,null,null,null,null,null,null,null,null,null,null,44]
[47,59,"TRAKER SPOR (B) (KRL)",null,null,null,null,null,null,null,null,0,0]
[null,null,null,null,0,0,null,null,24,""]
[48,6,"ÇERKEZKÖY BLD. GSK (A) (TKD)"]
[49,7,"BURSA B. ŞEH. BLD. SPOR (A) (BRS)"]
[null,null,null,null,0,0,null,null,25,""]
[50,58,{"$error":"#N/A"},null,null,null,null,null,null,null,null,null,null,null,null,45]
[51,42,{"$error":"#N/A"},null,null,null,null,null,null,null,null,0,0]
[null,null,null,null,0,0,null,null,26,""]
[52,26,{"$error":"#N/A"}]
[53,23,{"$error":"#N/A"},null,null,null,null,null,null,null,null,null,null,null,null,null,""]
[null,null,null,null,0,0,null,null,27,""]
[54,39,{"$error":"#N/A"},null,null,null,null,null,null,null,null,null,null,null,null,46]
[55,55,{"$error":"#N/A"},null,null,null,null,null,null,null,null,0,0]
[null,null,null,null,0,0,null,null,28,""]
[56,10,"TRAKER SPOR (A) (KRL)"]
[57,15,"LÜLEBURGAZ GENÇLİK SPOR  (A) (KRL)"]
[null,null,null,null,0,0,null,null,29,""]
[58,50,{"$error":"#N/A"},null,null,null,null,null,null,null,null,null,null,null,null,47]
[59,34,{"$error":"#N/A"},null,null,null,null,null,null,null,null,0,0]
[null,null,null,null,0,0,null,null,30,""]
[60,18,{"$error":"#N/A"}]
[61,31,{"$error":"#N/A"},null,null,null,null,null,null,null,null,null,null,null,null,null,""]
[null,null,null,null,0,0,null,null,31,""]
[62,47,{"$error":"#N/A"},null,null,null,null,null,null,null,null,null,null,null,null,48]
[63,63,{"$error":"#N/A"},null,null,null,null,null,null,null,null,0,0]
[null,null,null,null,0,0,null,null,32,""]
[64,2,"YALOVA BLD. GENÇLİK SPOR (A) (YLV)"]
[]
[]
[1,1,"FENERBAHÇE (A) (İST)"]
[null,null,null,null,3,1,null,null,1,"FENERBAHÇE (A) (İST)",null,null,null,null,null,null,1]
[2,32,"ESKİŞEHİR YURDUM SPOR (A) (ESK)",null,null,null,null,null,null,null,null,null,null,null,null,null,""]
[3,16,"TRAKER SPOR (B) (KRL)"]
[null,null,null,null,3,0,null,null,2,"TRAKER SPOR (B) (KRL)",null,null,null,null,null,null,2]
[4,17,"LÜLEBURGAZ ZİRVE SPOR (B) (KRL)"]
[5,9,"YALOVA BLD. GENÇLİK SPOR (B) (YLV)"]
[null,null,null,null,3,0,null,null,3,"YALOVA BLD. GENÇLİK SPOR (B) (YLV)",null,null,null,null,null,null,3]
[6,24,"ULUDAĞ OKSİJEN SPOR (A) (BRS)"]
[7,25,"KOCAELİ GSIM (A) (KCL)",null,null,null,null,null,null,null,null,null,null,null,null,null,""]
[null,null,null,null,0,3,null,null,4,"BURSA B. ŞEH. BLD. SPOR (A) (BRS)",null,null,null,null,null,null,4]
[8,8,"BURSA B. ŞEH. BLD. SPOR (A) (BRS)"]
[9,5,"PENDİK BLD. SPOR (A) (İST)"]
[null,null,null,null,3,0,null,null,5,"PENDİK BLD. SPOR (A) (İST)",null,null,null,null,null,null,5]
[10,28,"B.B.KAĞITSPOR (A) (KCL)",null,null,null,null,null,null,null,null,null,null,null,null,null,""]
[11,20,"İBB SPOR (B) (İST)"]
[null,null,null,null,1,3,null,null,6,"D.S.İ. BENT SPOR (A) (ESK)",null,null,null,null,null,null,6]
[12,12,"D.S.İ. BENT SPOR (A) (ESK)"]
[13,13,"ÇAĞDAŞ KOLEJLİLER (A) (ESK)"]
[null,null,null,null,1,3,null,null,7,"PENDİK BLD. SPOR (C) (İST)",null,null,null,null,null,null,7]
[14,21,"PENDİK BLD. SPOR (C) (İST)"]
[15,29,"ULUDAĞ OKSİJEN SPOR (B) (BRS)",null,null,null,null,null,null,null,null,null,null,null,null,null,""]
[null,null,null,null,0,3,null,null,8,"YILDIZ RAKETLER (A) (İST)",null,null,null,null,null,null,8]
[16,4,"YILDIZ RAKETLER (A) (İST)"]
[17,3,"İSTANBUL DSİ (A) (İST)"]
[null,null,null,null,3,0,null,null,9,"İSTANBUL DSİ (A) (İST)",null,null,null,null,null,null,9]
[18,30,"PENDİK BLD. SPOR (B) (İST)",null,null,null,null,null,null,null,null,null,null,null,null,null,""]
[19,22,"İBB SPOR (A) (İST)"]
[null,null,null,null,3,1,null,null,10,"İBB SPOR (A) (İST)",null,null,null,null,null,null,10]
[20,11,"İSTANBUL DSİ (B) (İST)"]
[21,14,"LÜLEBURGAZ GENÇLİK SPOR  (A) (KRL)"]
[null,null,null,null,3,0,null,null,11,"LÜLEBURGAZ GENÇLİK SPOR  (A) (KRL)",null,null,null,null,null,null,11]
[22,19,"DERİNCE GSK (A) (KCL)"]
[23,27,"BOYBEYİ SPOR (A) (SKR)",null,null,null,null,null,null,null,null,null,null,null,null,null,""]
[null,null,null,null,0,3,null,null,12,"ÇERKEZKÖY BLD. GSK (A) (TKD)",null,null,null,null,null,null,12]
[24,6,"ÇERKEZKÖY BLD. GSK (A) (TKD)"]
[25,7,"EDİRNE YURDUM SPOR (A) (EDR)"]
[null,null,null,null,3,0,null,null,13,"EDİRNE YURDUM SPOR (A) (EDR)",null,null,null,null,null,null,13]
[26,26,"KOCAELİ GSIM (B) (KCL)",null,null,null,null,null,null,null,null,null,null,null,null,null,""]
[27,18,"GENÇ TRAKYA SPOR (A) (EDR)"]
[null,null,null,null,0,3,null,null,14,"TRAKER SPOR (A) (KRL)",null,null,null,null,null,null,14]
[28,10,"TRAKER SPOR (A) (KRL)"]
[29,15,"YILDIZ RAKETLER (B) (İST)"]
[null,null,null,null,3,2,null,null,15,"YILDIZ RAKETLER (B) (İST)",null,null,null,null,null,null,15]
[30,23,"LÜLEBURGAZ ZİRVE SPOR (A) (KRL)"]
[31,31,"BEYKOZ BLD. SPOR (A) (İST)",null,null,null,null,null,null,null,null,null,null,null,null,null,""]
[null,null,null,null,0,3,null,null,16,"YALOVA BLD. GENÇLİK SPOR (A) (YLV)",null,null,null,null,null,null,16]
[32,2,"YALOVA BLD. GENÇLİK SPOR (A) (YLV)"]
[]
[]
[1,1,"FENERBAHÇE (A) (İST)"]
[null,null,null,null,0,0,null,null,1,""]
[2,16,"İBB SPOR (A) (İST)"]
[3,12,"B.B.KAĞITSPOR (A) (KCL)"]
[null,null,null,null,0,0,null,null,2,""]
[4,8,"BURSA B. ŞEH. BLD. SPOR (A) (BRS)"]
[5,6,"ÇERKEZKÖY BLD. GSK (A) (TKD)"]
[null,null,null,null,0,0,null,null,3,""]
[6,10,"ULUDAĞ OKSİJEN SPOR (B) (BRS)"]
[7,14,"ESKİŞEHİR YURDUM SPOR (A) (ESK)"]
[null,null,null,null,0,0,null,null,4,""]
[8,4,"YILDIZ RAKETLER (A) (İST)"]
[9,3,"İSTANBUL DSİ (A) (İST)"]
[null,null,null,null,0,0,null,null,5,""]
[10,13,"PENDİK BLD. SPOR (B) (İST)"]
[11,9,"PENDİK BLD. SPOR (C) (İST)"]
[null,null,null,null,0,0,null,null,6,""]
[12,5,"PENDİK BLD. SPOR (A) (İST)"]
[13,7,"EDİRNE YURDUM SPOR (A) (EDR)"]
[null,null,null,null,0,0,null,null,7,""]
[14,11,"LÜLEBURGAZ ZİRVE SPOR (A) (KRL)"]
[15,15,"BEYKOZ BLD. SPOR (A) (İST)"]
[null,null,null,null,0,0,null,null,8,""]
[16,2,"YALOVA BLD. GENÇLİK SPOR (A) (YLV)"]
[]
[]
[1,1,"FENERBAHÇE (A) (İST)"]
[null,null,null,null,0,0,null,null,1,""]
[2,16,"ESKİŞEHİR YURDUM SPOR (A) (ESK)"]
[3,12,"LÜLEBURGAZ ZİRVE SPOR (A) (KRL)"]
[null,null,null,null,0,0,null,null,2,""]
[4,8,"İSTANBUL DSİ (A) (İST)"]
[5,6,"YILDIZ RAKETLER (A) (İST)"]
[null,null,null,null,0,0,null,null,3,""]
[6,10,"BEYKOZ BLD. SPOR (A) (İST)"]
[7,14,"B.B.KAĞITSPOR (A) (KCL)"]
[null,null,null,null,0,0,null,null,4,""]
[8,4,"YALOVA BLD. GENÇLİK SPOR (A) (YLV)"]

{"sheet":"32DE","index":5,"n_rows":98,"n_cols":105,"rows_kept":98,"cut":false,"hidden":true,"merged":[[4,88,4,89],[4,90,4,91],[4,92,4,93],[4,94,4,95],[4,96,4,97],[4,98,4,99],[94,36,94,42],[95,43,95,49],[96,36,96,42],[87,50,87,56],[89,50,89,56],[83,50,83,56],[85,50,85,56],[60,57,60,63],[54,64,54,70],[48,57,48,63],[38,71,38,77],[37,50,37,56],[12,50,12,56],[97,43,97,49],[3,24,4,45],[90,29,90,35],[91,29,91,35],[91,43,91,49],[92,36,92,42],[93,29,93,35],[93,43,93,49],[86,43,86,49],[48,29,48,35],[48,43,48,49],[88,29,88,35],[88,43,88,49],[89,36,89,42],[82,36,82,42],[83,36,83,42],[84,43,84,49],[85,36,85,42],[79,15,79,21],[79,43,79,49],[80,8,80,14],[80,36,80,42],[80,50,80,56],[81,43,81,49],[76,8,76,14],[76,29,76,35],[76,57,76,63],[77,15,77,21],[77,43,77,49],[78,8,78,14],[78,22,78,28],[78,50,78,56],[74,8,74,14],[74,22,74,28],[74,36,74,42],[74,57,74,63],[75,15,75,21],[75,50,75,56],[70,57,70,63],[71,15,71,21],[71,43,71,49],[72,8,72,14],[72,29,72,35],[73,15,73,21],[73,50,73,56],[67,15,67,21],[68,8,68,14],[68,29,68,35],[68,50,68,56],[69,15,69,21],[70,8,70,14],[70,22,70,28],[64,8,64,14],[64,29,64,35],[64,43,64,49],[65,15,65,21],[66,8,66,14],[66,22,66,28],[66,36,66,42],[61,15,61,21],[62,8,62,14],[62,22,62,28],[62,64,62,70],[63,15,63,21],[58,8,58,14],[58,22,58,28],[58,36,58,42],[59,15,59,21],[60,8,60,14],[60,29,60,35],[55,15,55,21],[56,8,56,14],[56,29,56,35],[56,71,56,77],[57,15,57,21],[51,15,51,21],[51,50,51,56],[52,8,52,14],[52,29,52,35],[53,15,53,21],[54,8,54,14],[54,22,54,28],[54,43,54,49],[49,15,49,21],[50,8,50,14],[50,22,50,28],[50,36,50,42],[43,8,43,14],[44,1,44,7],[44,15,44,21],[45,1,45,7],[46,8,46,14],[47,1,47,7],[39,1,39,7],[39,15,39,21],[40,8,40,14],[41,1,41,7],[42,1,42,7],[42,29,42,35],[34,8,34,14],[35,1,35,7],[36,1,36,7],[37,8,37,14],[38,1,38,7],[30,1,30,7],[31,8,31,14],[31,29,31,35],[32,1,32,7],[32,15,32,21],[33,1,33,7],[25,8,25,14],[26,1,26,7],[27,1,27,7],[27,15,27,21],[28,8,28,14],[29,1,29,7],[21,1,21,7],[22,8,22,14],[23,1,23,7],[24,1,24,7],[24,64,24,70],[17,1,17,7],[17,29,17,35],[18,1,18,7],[18,22,18,28],[19,8,19,14],[20,1,20,7],[20,15,20,21],[13,8,13,14],[14,1,14,7],[15,1,15,7],[15,15,15,21],[16,8,16,14],[8,1,8,7],[8,15,8,21],[9,1,9,7],[10,8,10,14],[11,1,11,7],[12,1,12,7],[4,8,4,14],[5,1,5,7],[6,1,6,7],[6,29,6,35],[7,8,7,14],[0,1,0,7],[1,8,1,14],[2,1,2,7],[3,1,3,7],[3,15,3,21],[0,24,2,45]]}
[1,{"$f":"IF(#REF!=2,Eleme!#REF!,IF(#REF!=3,Eleme!#REF!,IF(#REF!=4,Eleme!#REF!,IF(#REF!=5,Eleme!#REF!))))","v":{"$error":"#REF!"}},null,null,null,null,null,null,null,null,null,null,null,null,null,null,null,null,null,null,null,null,null,null,{"$f":"+Katılım!A1","v":"TÜRKİYE MASA TENİSİ FEDERASYONU\nKÜÇÜKLER KUZEYBATI BÖLGESİ YARIŞMALARI"},null,null,null,null,null,null,null,null,null,null,null,null,null,null,null,null,null,null,null,null,null,null,null,null,null,null,null,null,null,null,null,null,null,null,null,null,null,null,null,null,null,null,null,null,null,null,null,null,null,null,null,null,null,null,null,null,null,null,null,null,null,null,null,null,null,null,null,null,null,null,null,null,null,null,null,null,null,null,"1st Round",1]
[null,null,null,{"$f":"CU6","v":0},{"$f":"CV6","v":0},"Y1",null,1,{"$f":"IF(AND(D2=0,E2=0),\"\",IF(D2>E2,B1,B3))","v":""},null,null,null,null,null,null,null,null,null,null,null,null,null,null,null,null,null,null,null,null,null,null,null,null,null,null,null,null,null,null,null,null,null,null,null,null,null,null,null,null,null,null,null,null,null,null,null,null,null,null,null,null,null,null,null,null,null,null,null,null,null,null,null,null,null,null,null,null,null,null,null,null,null,null,null,null,null,null,null,null,null,null,null,null,null,null,null,null,null,null,null,null,null,null,"2sn Round"]
[2,{"$f":"IF(#REF!=2,Eleme!#REF!,IF(#REF!=3,Eleme!#REF!,IF(#REF!=4,Eleme!#REF!,IF(#REF!=5,Eleme!#REF!))))","v":{"$error":"#REF!"}},null,null,null,null,null,null,null,null,null,null,null,null,17,null,null,null,null,null,null,null,null,null,null,null,null,null,null,null,null,null,null,null,null,null,null,null,null,null,null,null,null,null,null,null,null,null,null,null,null,null,null,null,null,null,null,null,null,null,null,null,null,null,null,null,null,null,null,null,null,null,null,null,null,null,null,null,null,null,null,null,null,null,null,null,null,null,null,null,null,null,null,null,null,null,null,null,null,null,null,null,null,"3th Round"]
[3,{"$f":"IF(#REF!=2,Eleme!#REF!,IF(#REF!=3,Eleme!#REF!,IF(#REF!=4,Eleme!#REF!,IF(#REF!=5,Eleme!#REF!))))","v":{"$error":"#REF!"}},null,null,null,null,null,null,null,null,{"$f":"CU22","v":0},{"$f":"CV22","v":0},"Y17",null,null,{"$f":"IF(AND(K4=0,L4=0),\"\",IF(K4>L4,I2,I5))","v":""},null,null,null,null,null,null,null,null,{"$f":"Katılım!AC2&\" \"&Katılım!AE3","v":"ERKEK TAKIM  [12-13 Mart 2025 KOCAELİ] [ Ana Tablo ]"},null,null,null,null,null,null,null,null,null,null,null,null,null,null,null,null,null,null,null,null,null,null,null,null,null,null,null,null,null,null,null,null,null,null,null,null,null,null,null,null,null,null,null,null,null,null,null,null,null,null,null,null,null,null,null,null,null,null,null,null,null,null,null,null,null,null,null,null,null,null,null,null,null,null,null,null,null,null,"4th Round"]
[null,null,null,{"$f":"CU7","v":0},{"$f":"CV7","v":0},"Y2",null,2,{"$f":"IF(AND(D5=0,E5=0),\"\",IF(D5>E5,B4,B6))","v":""},null,null,null,null,null,null,null,null,null,null,null,null,33,null,null,null,null,null,null,null,null,null,null,null,null,null,null,null,null,null,null,null,null,null,null,null,null,null,null,null,null,null,null,null,null,null,null,null,null,null,null,null,null,null,null,null,null,null,null,null,null,null,null,null,null,null,null,null,null,null,null,null,"#","Date","Time","Table","Competition","Player A","Player B","Set1",null,"Set2",null,"Set3",null,"Set4",null,"Set5",null,"Result",null,null,null,null,"5th Round"]
[4,{"$f":"IF(#REF!=2,Eleme!#REF!,IF(#REF!=3,Eleme!#REF!,IF(#REF!=4,Eleme!#REF!,IF(#REF!=5,Eleme!#REF!))))","v":{"$error":"#REF!"}},null,null,null,null,null,null,null,null,null,null,null,null,null,null,null,null,null,null,null,null,null,null,null,null,null,null,null,null,null,null,null,null,null,null,null,null,null,null,null,null,null,null,null,null,null,null,null,null,null,null,null,null,null,null,null,null,null,null,null,null,null,null,null,null,null,null,null,null,null,null,null,null,null,null,null,null,null,null,null,1,null,null,null,null,{"$f":"B1","v":{"$error":"#REF!"}},{"$f":"B3","v":{"$error":"#REF!"}},null,null,null,null,null,null,null,null,null,null,null,null,null,null,null,"6th Round"]
[5,{"$f":"IF(#REF!=2,Eleme!#REF!,IF(#REF!=3,Eleme!#REF!,IF(#REF!=4,Eleme!#REF!,IF(#REF!=5,Eleme!#REF!))))","v":{"$error":"#REF!"}},null,null,null,null,null,null,null,null,null,null,null,null,null,null,null,{"$f":"CU38","v":0},{"$f":"CV38","v":0},"Y25",null,null,null,null,null,null,null,null,null,{"$f":"IF(AND(R7=0,S7=0),\"\",IF(R7>S7,P4,P9))","v":""},null,null,null,null,null,null,null,null,null,null,null,null,null,null,null,null,null,null,null,null,null,null,null,null,null,null,null,null,null,null,null,null,null,null,null,null,null,null,null,null,null,null,null,null,null,null,null,null,null,null,null,2,null,null,null,null,{"$f":"B4","v":{"$error":"#REF!"}},{"$f":"B6","v":{"$error":"#REF!"}},null,null,null,null,null,null,null,null,null,null,null,null,null,null,null,"7th Round"]
[null,null,null,{"$f":"CU8","v":0},{"$f":"CV8","v":0},"Y3",null,3,{"$f":"IF(AND(D8=0,E8=0),\"\",IF(D8>E8,B7,B9))","v":""},null,null,null,null,null,null,null,null,null,null,null,null,null,null,null,null,null,null,null,null,null,null,null,null,null,null,49,null,null,null,null,null,null,null,null,null,null,null,null,null,null,null,null,null,null,null,null,null,null,null,null,null,null,null,null,null,null,null,null,null,null,null,null,null,null,null,null,null,null,null,null,null,3,null,null,null,null,{"$f":"B7","v":{"$error":"#REF!"}},{"$f":"B9","v":{"$error":"#REF!"}},null,null,null,null,null,null,null,null,null,null,null,null,null,null,null,"8th Round"]
[6,{"$f":"IF(#REF!=2,Eleme!#REF!,IF(#REF!=3,Eleme!#REF!,IF(#REF!=4,Eleme!#REF!,IF(#REF!=5,Eleme!#REF!))))","v":{"$error":"#REF!"}},null,null,null,null,null,null,null,null,null,null,null,null,18,{"$f":"IF(AND(K10=0,L10=0),\"\",IF(K10>L10,I8,I11))","v":""},null,null,null,null,null,null,null,null,null,null,null,null,null,null,null,null,null,null,null,null,null,null,null,null,null,null,null,null,null,null,null,null,null,null,null,null,null,null,null,null,null,null,null,null,null,null,null,null,null,null,null,null,null,null,null,null,null,null,null,null,null,null,null,null,null,4,null,null,null,null,{"$f":"B10","v":{"$error":"#REF!"}},{"$f":"B12","v":{"$error":"#REF!"}},null,null,null,null,null,null,null,null,null,null,null,null,null,null,null,"9th Round"]
[7,{"$f":"IF(#REF!=2,Eleme!#REF!,IF(#REF!=3,Eleme!#REF!,IF(#REF!=4,Eleme!#REF!,IF(#REF!=5,Eleme!#REF!))))","v":{"$error":"#REF!"}},null,null,null,null,null,null,null,null,{"$f":"CU23","v":0},{"$f":"CV23","v":0},"Y18",null,null,null,null,null,null,null,null,null,null,null,null,null,null,null,null,null,null,null,null,null,null,null,null,null,null,null,null,null,null,null,null,null,null,null,null,null,null,null,null,null,null,null,null,null,null,null,null,null,null,null,null,null,null,null,null,null,null,null,null,null,null,null,null,null,null,null,null,5,null,null,null,null,{"$f":"B13","v":{"$error":"#REF!"}},{"$f":"B15","v":{"$error":"#REF!"}},null,null,null,null,null,null,null,null,null,null,null,null,null,null,null,"10th Round"]
[null,null,null,{"$f":"CU9","v":0},{"$f":"CV9","v":0},"Y4",null,4,{"$f":"IF(AND(D11=0,E11=0),\"\",IF(D11>E11,B10,B12))","v":""},null,null,null,null,null,null,null,null,null,null,null,null,null,null,null,null,null,null,null,null,null,null,null,null,null,null,null,null,null,null,null,null,null,null,null,null,null,null,null,null,null,null,null,null,null,null,null,null,null,null,null,null,null,null,null,null,null,null,null,null,null,null,null,null,null,null,null,null,null,null,null,null,6,null,null,null,null,{"$f":"B16","v":{"$error":"#REF!"}},{"$f":"B18","v":{"$error":"#REF!"}}]
[8,{"$f":"IF(#REF!=2,Eleme!#REF!,IF(#REF!=3,Eleme!#REF!,IF(#REF!=4,Eleme!#REF!,IF(#REF!=5,Eleme!#REF!))))","v":{"$error":"#REF!"}},null,null,null,null,null,null,null,null,null,null,null,null,null,null,null,null,null,null,null,null,null,null,null,null,null,null,null,null,null,null,null,null,null,null,null,null,null,null,null,null,null,null,null,null,null,null,null,null,null,null,null,null,null,null,null,null,null,null,null,null,null,null,null,null,null,null,null,null,null,null,null,null,null,null,null,null,null,null,null,7,null,null,null,null,{"$f":"B19","v":{"$error":"#REF!"}},{"$f":"B21","v":{"$error":"#REF!"}}]
[9,{"$f":"IF(#REF!=2,Eleme!#REF!,IF(#REF!=3,Eleme!#REF!,IF(#REF!=4,Eleme!#REF!,IF(#REF!=5,Eleme!#REF!))))","v":{"$error":"#REF!"}},null,null,null,null,null,null,null,null,null,null,null,null,null,null,null,null,null,null,null,null,null,null,null,null,null,null,null,null,null,{"$f":"CU54","v":0},{"$f":"CV54","v":0},"Y29",null,null,null,null,null,null,null,null,null,null,null,null,null,null,null,null,{"$f":"IF(AND(AF13=0,AG13=0),\"\",IF(AF13>AG13,AD7,AD18))","v":""},null,null,null,null,null,null,null,null,null,null,null,null,null,null,null,null,null,null,null,null,null,null,null,null,null,null,null,null,null,null,8,null,null,null,null,{"$f":"B22","v":{"$error":"#REF!"}},{"$f":"B24","v":{"$error":"#REF!"}}]
[null,null,null,{"$f":"CU10","v":0},{"$f":"CV10","v":0},"Y5",null,5,{"$f":"IF(AND(D14=0,E14=0),\"\",IF(D14>E14,B13,B15))","v":""},null,null,null,null,null,null,null,null,null,null,null,null,null,null,null,null,null,null,null,null,null,null,null,null,null,null,null,null,null,null,null,null,null,null,null,null,null,null,null,null,null,null,null,null,null,null,null,68,null,null,null,null,null,null,null,null,null,null,null,null,null,null,null,null,null,null,null,null,null,null,null,null,9,null,null,null,null,{"$f":"B25","v":{"$error":"#REF!"}},{"$f":"B27","v":{"$error":"#REF!"}}]
[10,{"$f":"IF(#REF!=2,Eleme!#REF!,IF(#REF!=3,Eleme!#REF!,IF(#REF!=4,Eleme!#REF!,IF(#REF!=5,Eleme!#REF!))))","v":{"$error":"#REF!"}},null,null,null,null,null,null,null,null,null,null,null,null,19,null,null,null,null,null,null,null,null,null,null,null,null,null,null,null,null,null,null,null,null,null,null,null,null,null,null,null,null,null,null,null,null,null,null,null,null,null,null,null,null,null,null,null,null,null,null,null,null,null,null,null,null,null,null,null,null,null,null,null,null,null,null,null,null,null,null,10,null,null,null,null,{"$f":"B28","v":{"$error":"#REF!"}},{"$f":"B30","v":{"$error":"#REF!"}}]
[11,{"$f":"IF(#REF!=2,Eleme!#REF!,IF(#REF!=3,Eleme!#REF!,IF(#REF!=4,Eleme!#REF!,IF(#REF!=5,Eleme!#REF!))))","v":{"$error":"#REF!"}},null,null,null,null,null,null,null,null,{"$f":"CU24","v":0},{"$f":"CV24","v":0},"Y19",null,null,{"$f":"IF(AND(K16=0,L16=0),\"\",IF(K16>L16,I14,I17))","v":""},null,null,null,null,null,null,null,null,null,null,null,null,null,null,null,null,null,null,null,null,null,null,null,null,null,null,null,null,null,null,null,null,null,null,null,null,null,null,null,null,null,null,null,null,null,null,null,null,null,null,null,null,null,null,null,null,null,null,null,null,null,null,null,null,null,11,null,null,null,null,{"$f":"B31","v":{"$error":"#REF!"}},{"$f":"B33","v":{"$error":"#REF!"}}]
[null,null,null,{"$f":"CU11","v":0},{"$f":"CV11","v":0},"Y6",null,6,{"$f":"IF(AND(D17=0,E17=0),\"\",IF(D17>E17,B16,B18))","v":""},null,null,null,null,null,null,null,null,null,null,null,null,34,null,null,null,null,null,null,null,null,null,null,null,null,null,null,null,null,null,null,null,null,null,null,null,null,null,null,null,null,null,null,null,null,null,null,null,null,null,null,null,null,null,null,null,null,null,null,null,null,null,null,null,null,null,null,null,null,null,null,null,12,null,null,null,null,{"$f":"B34","v":{"$error":"#REF!"}},{"$f":"B36","v":{"$error":"#REF!"}}]
[12,{"$f":"IF(#REF!=2,Eleme!#REF!,IF(#REF!=3,Eleme!#REF!,IF(#REF!=4,Eleme!#REF!,IF(#REF!=5,Eleme!#REF!))))","v":{"$error":"#REF!"}},null,null,null,null,null,null,null,null,null,null,null,null,null,null,null,null,null,null,null,null,null,null,null,null,null,null,null,{"$f":"IF(AND(R19=0,S19=0),\"\",IF(R19>S19,P16,P21))","v":""},null,null,null,null,null,null,null,null,null,null,null,null,null,null,null,null,null,null,null,null,null,null,null,null,null,null,null,null,null,null,null,null,null,null,null,null,null,null,null,null,null,null,null,null,null,null,null,null,null,null,null,13,null,null,null,null,{"$f":"B37","v":{"$error":"#REF!"}},{"$f":"B39","v":{"$error":"#REF!"}}]
[13,{"$f":"IF(#REF!=2,Eleme!#REF!,IF(#REF!=3,Eleme!#REF!,IF(#REF!=4,Eleme!#REF!,IF(#REF!=5,Eleme!#REF!))))","v":{"$error":"#REF!"}},null,null,null,null,null,null,null,null,null,null,null,null,null,null,null,{"$f":"CU39","v":0},{"$f":"CV39","v":0},"Y26",null,null,null,null,null,null,null,null,null,null,null,null,null,null,null,null,null,null,null,null,null,null,null,null,null,null,null,null,null,null,null,null,null,null,null,null,null,null,null,null,null,null,null,null,null,null,null,null,null,null,null,null,null,null,null,null,null,null,null,null,null,14,null,null,null,null,{"$f":"B40","v":{"$error":"#REF!"}},{"$f":"B42","v":{"$error":"#REF!"}}]
[null,null,null,{"$f":"CU12","v":0},{"$f":"CV12","v":0},"Y7",null,7,{"$f":"IF(AND(D20=0,E20=0),\"\",IF(D20>E20,B19,B21))","v":""},null,null,null,null,null,null,null,null,null,null,null,null,null,null,null,null,null,null,null,null,null,null,null,null,null,null,null,null,null,null,null,null,null,null,null,null,null,null,null,null,null,null,null,null,null,null,null,null,null,null,null,null,null,null,null,null,null,null,null,null,null,null,null,null,null,null,null,null,null,null,null,null,15,null,null,null,null,{"$f":"B43","v":{"$error":"#REF!"}},{"$f":"B45","v":{"$error":"#REF!"}}]
[14,{"$f":"IF(#REF!=2,Eleme!#REF!,IF(#REF!=3,Eleme!#REF!,IF(#REF!=4,Eleme!#REF!,IF(#REF!=5,Eleme!#REF!))))","v":{"$error":"#REF!"}},null,null,null,null,null,null,null,null,null,null,null,null,20,{"$f":"IF(AND(K22=0,L22=0),\"\",IF(K22>L22,I20,I23))","v":""},null,null,null,null,null,null,null,null,null,null,null,null,null,null,null,null,null,null,null,null,null,null,null,null,null,null,null,null,null,null,null,null,null,null,null,null,null,null,null,null,null,null,null,null,null,null,null,null,null,null,null,null,null,null,null,null,null,null,null,null,null,null,null,null,null,16,null,null,null,null,{"$f":"B46","v":{"$error":"#REF!"}},{"$f":"B48","v":{"$error":"#REF!"}}]
[15,{"$f":"IF(#REF!=2,Eleme!#REF!,IF(#REF!=3,Eleme!#REF!,IF(#REF!=4,Eleme!#REF!,IF(#REF!=5,Eleme!#REF!))))","v":{"$error":"#REF!"}},null,null,null,null,null,null,null,null,{"$f":"CU25","v":0},{"$f":"CV25","v":0},"Y20",null,null,null,null,null,null,null,null,null,null,null,null,null,null,null,null,null,null,null,null,null,null,null,null,null,null,null,null,null,null,null,null,null,null,null,null,null,null,null,null,null,null,null,null,null,null,null,null,null,null,null,null,null,null,null,null,null,null,null,null,null,null,null,null,null,null,null,null,17,null,null,null,null,{"$f":"I2","v":""},{"$f":"I5","v":""}]
[null,null,null,{"$f":"CU13","v":0},{"$f":"CV13","v":0},"Y8",null,8,{"$f":"IF(AND(D23=0,E23=0),\"\",IF(D23>E23,B22,B24))","v":""},null,null,null,null,null,null,null,null,null,null,null,null,null,null,null,null,null,null,null,null,null,null,null,null,null,null,null,null,null,null,null,null,null,null,null,null,null,null,null,null,null,null,null,null,null,null,null,null,null,null,null,null,null,null,null,null,null,null,null,null,null,null,null,null,null,null,null,null,null,null,null,null,18,null,null,null,null,{"$f":"I8","v":""},{"$f":"I11","v":""}]
[16,{"$f":"IF(#REF!=2,Eleme!#REF!,IF(#REF!=3,Eleme!#REF!,IF(#REF!=4,Eleme!#REF!,IF(#REF!=5,Eleme!#REF!))))","v":{"$error":"#REF!"}},null,null,null,null,null,null,null,null,null,null,null,null,null,null,null,null,null,null,null,null,null,null,null,null,null,null,null,null,null,null,null,null,null,null,null,null,null,null,null,null,null,null,null,null,null,null,null,null,null,null,null,null,null,null,null,null,null,null,null,null,null,null,null,null,null,null,null,null,null,null,null,null,null,null,null,null,null,null,null,19,null,null,null,null,{"$f":"I14","v":""},{"$f":"I17","v":""}]
[17,{"$f":"IF(#REF!=2,Eleme!#REF!,IF(#REF!=3,Eleme!#REF!,IF(#REF!=4,Eleme!#REF!,IF(#REF!=5,Eleme!#REF!))))","v":{"$error":"#REF!"}},null,null,null,null,null,null,null,null,null,null,null,null,null,{"$f":"IF(AND(K22=0,L22=0),\"\",IF(K22<L22,I20,I23))","v":""},null,null,null,null,null,null,null,null,null,null,null,null,null,null,null,null,null,null,null,null,null,null,null,null,null,null,null,null,null,null,null,null,null,null,null,null,{"$f":"CU73","v":0},{"$f":"CV73","v":0},"Y31",null,null,null,null,null,null,null,null,null,{"$f":"IF(AND(BA25=0,BB25=0),\"\",IF(BA25>BB25,AY13,AY38))","v":""},null,null,null,null,null,null,null,null,null,null,null,null,null,null,null,null,20,null,null,null,null,{"$f":"I20","v":""},{"$f":"I23","v":""}]
[null,null,null,{"$f":"CU14","v":0},{"$f":"CV14","v":0},"Y9",null,9,{"$f":"IF(AND(D26=0,E26=0),\"\",IF(D26>E26,B25,B27))","v":""},null,null,null,null,null,null,null,null,null,null,null,null,null,null,null,null,null,null,null,null,null,null,null,null,null,null,null,null,null,null,null,null,null,null,null,null,null,null,null,null,null,null,null,null,null,null,null,null,null,null,null,null,null,null,null,null,null,null,null,null,null,72,null,null,null,null,null,null,null,null,null,null,21,null,null,null,null,{"$f":"I26","v":""},{"$f":"I29","v":""}]
[18,{"$f":"IF(#REF!=2,Eleme!#REF!,IF(#REF!=3,Eleme!#REF!,IF(#REF!=4,Eleme!#REF!,IF(#REF!=5,Eleme!#REF!))))","v":{"$error":"#REF!"}},null,null,null,null,null,null,null,null,null,null,null,null,21,null,null,null,null,null,null,null,null,null,null,null,null,null,null,null,null,null,null,null,null,null,null,null,null,null,null,null,null,null,null,null,null,null,null,null,null,null,null,null,null,null,null,null,null,null,null,null,null,null,null,null,null,null,null,null,null,null,null,null,null,null,null,null,null,null,null,22,null,null,null,null,{"$f":"I32","v":""},{"$f":"I35","v":""}]
[19,{"$f":"IF(#REF!=2,Eleme!#REF!,IF(#REF!=3,Eleme!#REF!,IF(#REF!=4,Eleme!#REF!,IF(#REF!=5,Eleme!#REF!))))","v":{"$error":"#REF!"}},null,null,null,null,null,null,null,null,{"$f":"CU26","v":0},{"$f":"CV26","v":0},"Y21",null,null,{"$f":"IF(AND(K28=0,L28=0),\"\",IF(K28>L28,I26,I29))","v":""},null,null,null,null,null,null,null,null,null,null,null,null,null,null,null,null,null,null,null,null,null,null,null,null,null,null,null,null,null,null,null,null,null,null,null,null,null,null,null,null,null,null,null,null,null,null,null,null,null,null,null,null,null,null,null,null,null,null,null,null,null,null,null,null,null,23,null,null,null,null,{"$f":"I38","v":""},{"$f":"I41","v":""}]
[null,null,null,{"$f":"CU15","v":0},{"$f":"CV15","v":0},"Y10",null,10,{"$f":"IF(AND(D29=0,E29=0),\"\",IF(D29>E29,B28,B30))","v":""},null,null,null,null,null,null,null,null,null,null,null,null,35,null,null,null,null,null,null,null,null,null,null,null,null,null,null,null,null,null,null,null,null,null,null,null,null,null,null,null,null,null,null,null,null,null,null,null,null,null,null,null,null,null,null,null,null,null,null,null,null,null,null,null,null,null,null,null,null,null,null,null,24,null,null,null,null,{"$f":"I44","v":""},{"$f":"I47","v":""}]
[20,{"$f":"IF(#REF!=2,Eleme!#REF!,IF(#REF!=3,Eleme!#REF!,IF(#REF!=4,Eleme!#REF!,IF(#REF!=5,Eleme!#REF!))))","v":{"$error":"#REF!"}},null,null,null,null,null,null,null,null,null,null,null,null,null,null,null,null,null,null,null,null,null,null,null,null,null,null,null,null,null,null,null,null,null,null,null,null,null,null,null,null,null,null,null,null,null,null,null,null,null,null,null,null,null,null,null,null,null,null,null,null,null,null,null,null,null,null,null,null,null,null,null,null,null,null,null,null,null,null,null,25,null,null,null,null,{"$f":"I51","v":""},{"$f":"I53","v":""}]
[21,{"$f":"IF(#REF!=2,Eleme!#REF!,IF(#REF!=3,Eleme!#REF!,IF(#REF!=4,Eleme!#REF!,IF(#REF!=5,Eleme!#REF!))))","v":{"$error":"#REF!"}},null,null,null,null,null,null,null,null,null,null,null,null,null,null,null,{"$f":"CU40","v":0},{"$f":"CV40","v":0},"Y27",null,null,null,null,null,null,null,null,null,null,null,null,null,null,null,null,null,null,null,null,null,null,null,null,null,null,null,null,null,null,null,null,null,null,null,null,null,null,null,null,null,null,null,null,null,null,null,null,null,null,null,null,null,null,null,null,null,null,null,null,null,26,null,null,null,null,{"$f":"I55","v":""},{"$f":"I57","v":""}]
[null,null,null,{"$f":"CU16","v":0},{"$f":"CV16","v":0},"Y11",null,11,{"$f":"IF(AND(D32=0,E32=0),\"\",IF(D32>E32,B31,B33))","v":""},null,null,null,null,null,null,null,null,null,null,null,null,null,null,null,null,null,null,null,null,{"$f":"IF(AND(R31=0,S31=0),\"\",IF(R31>S31,P28,P33))","v":""},null,null,null,null,null,null,null,null,null,null,null,null,null,null,null,null,null,null,null,null,null,null,null,null,null,null,null,null,null,null,null,null,null,null,null,null,null,null,null,null,null,null,null,null,null,null,null,null,null,null,null,27,null,null,null,null,{"$f":"I59","v":""},{"$f":"I61","v":""}]
[22,{"$f":"IF(#REF!=2,Eleme!#REF!,IF(#REF!=3,Eleme!#REF!,IF(#REF!=4,Eleme!#REF!,IF(#REF!=5,Eleme!#REF!))))","v":{"$error":"#REF!"}},null,null,null,null,null,null,null,null,null,null,null,null,22,{"$f":"IF(AND(K34=0,L34=0),\"\",IF(K34>L34,I32,I35))","v":""},null,null,null,null,null,null,null,null,null,null,null,null,null,null,null,null,null,null,null,50,null,null,null,null,null,null,null,null,null,null,null,null,null,null,null,null,null,null,null,null,null,null,null,null,null,null,null,null,null,null,null,null,null,null,null,null,null,null,null,null,null,null,null,null,null,28,null,null,null,null,{"$f":"I63","v":""},{"$f":"I65","v":""}]
[23,{"$f":"IF(#REF!=2,Eleme!#REF!,IF(#REF!=3,Eleme!#REF!,IF(#REF!=4,Eleme!#REF!,IF(#REF!=5,Eleme!#REF!))))","v":{"$error":"#REF!"}},null,null,null,null,null,null,null,null,{"$f":"CU27","v":0},{"$f":"CV27","v":0},"Y22",null,null,null,null,null,null,null,null,null,null,null,null,null,null,null,null,null,null,null,null,null,null,null,null,null,null,null,null,null,null,null,null,null,null,null,null,null,null,null,null,null,null,null,null,null,null,null,null,null,null,null,null,null,null,null,null,null,null,null,null,null,null,null,null,null,null,null,null,29,null,null,null,null,{"$f":"I67","v":""},{"$f":"I69","v":""}]
[null,null,null,{"$f":"CU17","v":0},{"$f":"CV17","v":0},"Y12",null,12,{"$f":"IF(AND(D35=0,E35=0),\"\",IF(D35>E35,B34,B36))","v":""},null,null,null,null,null,null,null,null,null,null,null,null,null,null,null,null,null,null,null,null,null,null,null,null,null,null,null,null,null,null,null,null,null,null,null,null,null,null,null,null,null,null,null,null,null,null,null,null,null,null,null,null,null,null,null,null,null,null,null,null,null,null,null,null,null,null,null,null,null,null,null,null,30,null,null,null,null,{"$f":"I71","v":""},{"$f":"I73","v":""}]
[24,{"$f":"IF(#REF!=2,Eleme!#REF!,IF(#REF!=3,Eleme!#REF!,IF(#REF!=4,Eleme!#REF!,IF(#REF!=5,Eleme!#REF!))))","v":{"$error":"#REF!"}},null,null,null,null,null,null,null,null,null,null,null,null,null,null,null,null,null,null,null,null,null,null,null,null,null,null,null,null,null,null,null,null,null,null,null,null,null,null,null,null,null,null,null,null,null,null,null,null,null,null,null,null,null,null,null,null,null,null,null,null,null,null,null,null,null,null,null,null,null,null,null,null,null,null,null,null,null,null,null,31,null,null,null,null,{"$f":"I75","v":""},{"$f":"I77","v":""}]
[25,{"$f":"IF(#REF!=2,Eleme!#REF!,IF(#REF!=3,Eleme!#REF!,IF(#REF!=4,Eleme!#REF!,IF(#REF!=5,Eleme!#REF!))))","v":{"$error":"#REF!"}},null,null,null,null,null,null,null,null,null,null,null,null,null,null,null,null,null,null,null,null,null,null,null,null,null,null,null,null,null,null,null,null,null,null,null,null,null,null,null,null,null,null,null,null,null,null,null,null,null,null,null,null,null,null,null,null,null,null,null,null,null,null,null,null,null,null,null,null,null,null,null,null,null,null,null,null,null,null,null,32,null,null,null,null,{"$f":"I79","v":""},{"$f":"I81","v":""}]
[null,null,null,{"$f":"CU18","v":0},{"$f":"CV18","v":0},"Y13",null,13,{"$f":"IF(AND(D38=0,E38=0),\"\",IF(D38>E38,B37,B39))","v":""},null,null,null,null,null,null,null,null,null,null,null,null,null,null,null,null,null,null,null,null,null,null,{"$f":"CU55","v":0},{"$f":"CV55","v":0},"Y30",null,null,null,null,null,null,null,null,null,null,null,null,null,null,null,null,{"$f":"IF(AND(AF38=0,AG38=0),\"\",IF(AF38>AG38,AD32,AD43))","v":""},null,null,null,null,null,null,null,null,null,null,null,null,null,null,null,null,null,null,null,null,null,null,null,null,null,null,null,null,null,null,33,null,null,null,null,{"$f":"P4","v":""},{"$f":"P9","v":""}]
[26,{"$f":"IF(#REF!=2,Eleme!#REF!,IF(#REF!=3,Eleme!#REF!,IF(#REF!=4,Eleme!#REF!,IF(#REF!=5,Eleme!#REF!))))","v":{"$error":"#REF!"}},null,null,null,null,null,null,null,null,null,null,null,null,23,null,null,null,null,null,null,null,null,null,null,null,null,null,null,null,null,null,null,null,null,null,null,null,null,null,null,null,null,null,null,null,null,null,null,null,null,null,null,null,null,null,null,null,null,null,null,null,null,null,null,null,{"$f":"CU77","v":0},{"$f":"CV77","v":0},"Y32",null,null,{"$f":"IF(AND(BO39=0,BP39=0),\"\",IF(BO39>BP39,BM25,BM55))","v":""},null,null,null,null,null,null,"1.",null,null,34,null,null,null,null,{"$f":"P16","v":""},{"$f":"P21","v":""}]
[27,{"$f":"IF(#REF!=2,Eleme!#REF!,IF(#REF!=3,Eleme!#REF!,IF(#REF!=4,Eleme!#REF!,IF(#REF!=5,Eleme!#REF!))))","v":{"$error":"#REF!"}},null,null,null,null,null,null,null,null,{"$f":"CU28","v":0},{"$f":"CV28","v":0},"Y23",null,null,{"$f":"IF(AND(K40=0,L40=0),\"\",IF(K40>L40,I38,I41))","v":""},null,null,null,null,null,null,null,null,null,null,null,null,null,null,null,null,null,null,null,null,null,null,null,null,null,null,null,null,null,null,null,null,null,null,null,null,null,null,null,null,null,null,null,null,null,null,null,null,null,null,null,null,null,null,null,null,null,null,null,null,null,null,null,null,null,35,null,null,null,null,{"$f":"P28","v":""},{"$f":"P33","v":""}]
[null,null,null,{"$f":"CU19","v":0},{"$f":"CV19","v":0},"Y14",null,14,{"$f":"IF(AND(D41=0,E41=0),\"\",IF(D41>E41,B40,B42))","v":""},null,null,null,null,null,null,null,null,null,null,null,null,36,null,null,null,null,null,null,null,null,null,null,null,null,null,null,null,null,null,null,null,null,null,null,null,null,null,null,null,null,null,null,null,null,null,null,null,null,null,null,null,null,null,null,null,null,null,null,null,null,null,null,null,null,null,null,null,null,null,null,null,36,null,null,null,null,{"$f":"P40","v":""},{"$f":"P45","v":""}]
[28,{"$f":"IF(#REF!=2,Eleme!#REF!,IF(#REF!=3,Eleme!#REF!,IF(#REF!=4,Eleme!#REF!,IF(#REF!=5,Eleme!#REF!))))","v":{"$error":"#REF!"}},null,null,null,null,null,null,null,null,null,null,null,null,null,null,null,null,null,null,null,null,null,null,null,null,null,null,null,null,null,null,null,null,null,null,null,null,null,null,null,null,null,null,null,null,null,null,null,null,null,null,null,null,null,null,null,null,null,null,null,null,null,null,null,null,null,null,null,null,null,null,null,null,null,null,null,null,null,null,null,37,null,null,null,null,{"$f":"P50","v":""},{"$f":"P52","v":""}]
[29,{"$f":"IF(#REF!=2,Eleme!#REF!,IF(#REF!=3,Eleme!#REF!,IF(#REF!=4,Eleme!#REF!,IF(#REF!=5,Eleme!#REF!))))","v":{"$error":"#REF!"}},null,null,null,null,null,null,null,null,null,null,null,null,null,null,null,{"$f":"CU41","v":0},{"$f":"CV41","v":0},"Y28",null,null,null,null,null,null,null,null,null,{"$f":"IF(AND(R43=0,S43=0),\"\",IF(R43>S43,P40,P45))","v":""},null,null,null,null,null,null,null,null,null,null,null,null,null,null,null,null,null,null,null,null,null,null,null,null,null,null,null,null,null,null,null,null,null,null,null,null,null,null,null,null,null,null,null,null,null,null,null,null,null,null,null,38,null,null,null,null,{"$f":"P54","v":""},{"$f":"P56","v":""}]
[null,null,null,{"$f":"CU20","v":0},{"$f":"CV20","v":0},"Y15",null,15,{"$f":"IF(AND(D44=0,E44=0),\"\",IF(D44>E44,B43,B45))","v":""},null,null,null,null,null,null,null,null,null,null,null,null,null,null,null,null,null,null,null,null,null,null,null,null,null,null,null,null,null,null,null,null,null,null,null,null,null,null,null,null,null,null,null,null,null,null,null,null,null,null,null,null,null,null,null,null,null,null,null,null,null,null,null,null,null,null,null,null,null,null,null,null,39,null,null,null,null,{"$f":"P58","v":""},{"$f":"P60","v":""}]
[30,{"$f":"IF(#REF!=2,Eleme!#REF!,IF(#REF!=3,Eleme!#REF!,IF(#REF!=4,Eleme!#REF!,IF(#REF!=5,Eleme!#REF!))))","v":{"$error":"#REF!"}},null,null,null,null,null,null,null,null,null,null,null,null,24,{"$f":"IF(AND(K46=0,L46=0),\"\",IF(K46>L46,I44,I47))","v":""},null,null,null,null,null,null,null,null,null,null,null,null,null,null,null,null,null,null,null,null,null,null,null,null,null,null,null,null,null,null,null,null,null,null,null,null,null,null,null,null,null,null,null,null,null,null,null,null,null,null,null,null,null,null,null,null,null,null,null,null,null,null,null,null,null,40,null,null,null,null,{"$f":"P62","v":""},{"$f":"P64","v":""}]
[31,{"$f":"IF(#REF!=2,Eleme!#REF!,IF(#REF!=3,Eleme!#REF!,IF(#REF!=4,Eleme!#REF!,IF(#REF!=5,Eleme!#REF!))))","v":{"$error":"#REF!"}},null,null,null,null,null,null,null,null,{"$f":"CU29","v":0},{"$f":"CV29","v":0},"Y24",null,null,null,null,null,null,null,null,null,null,null,null,null,null,null,null,null,null,null,null,null,null,null,null,null,null,null,null,null,null,null,null,null,null,null,null,null,null,null,null,null,null,null,null,null,null,null,null,null,null,null,null,null,null,null,null,null,null,null,null,null,null,null,null,null,null,null,null,41,null,null,null,null,{"$f":"P66","v":""},{"$f":"P68","v":""}]
[null,null,null,{"$f":"CU21","v":0},{"$f":"CV21","v":0},"Y16",null,16,{"$f":"IF(AND(D47=0,E47=0),\"\",IF(D47>E47,B46,B48))","v":""},null,null,null,null,null,null,null,null,null,null,null,null,null,null,null,null,null,null,null,null,null,null,null,null,null,null,null,null,null,null,null,null,null,null,null,null,null,null,null,null,null,null,null,null,null,null,null,null,null,null,null,null,null,null,null,null,null,null,null,null,null,null,null,null,null,null,null,null,null,null,null,null,42,null,null,null,null,{"$f":"P70","v":""},{"$f":"P72","v":""}]
[32,{"$f":"IF(#REF!=2,Eleme!#REF!,IF(#REF!=3,Eleme!#REF!,IF(#REF!=4,Eleme!#REF!,IF(#REF!=5,Eleme!#REF!))))","v":{"$error":"#REF!"}},null,null,null,null,null,null,null,null,null,null,null,null,null,null,null,null,null,null,null,null,null,null,null,null,null,null,null,null,null,null,null,null,null,null,null,null,null,null,null,null,null,null,null,null,null,null,null,null,null,null,null,null,null,null,null,null,null,null,null,null,null,null,null,null,null,null,null,null,null,null,null,null,null,null,null,null,null,null,null,43,null,null,null,null,{"$f":"P74","v":""},{"$f":"P76","v":""}]
[null,null,null,null,null,null,null,null,null,null,null,null,null,null,null,null,null,null,null,null,null,null,null,null,null,null,null,null,"Y25",{"$f":"IF(AND(R7=0,S7=0),\"\",IF(R7<S7,P4,P9))","v":""},null,null,null,null,null,null,null,null,null,null,null,null,"Y30",{"$f":"IF(AND(AF38=0,AG38=0),\"\",IF(AF38<AG38,AD32,AD43))","v":""},null,null,null,null,null,null,null,null,null,null,null,null,"Y31",{"$f":"IF(AND(BA25=0,BB25=0),\"\",IF(BA25<BB25,AY13,AY38))","v":""},null,null,null,null,null,null,null,null,null,null,null,null,null,null,null,null,null,null,null,null,null,null,null,44,null,null,null,null,{"$f":"P78","v":""},{"$f":"P80","v":""}]
[null,null,null,null,null,null,null,null,null,null,null,null,null,null,"Y24",{"$f":"IF(AND(K46=0,L46=0),\"\",IF(K46<L46,I44,I47))","v":""},null,null,null,null,null,null,null,null,null,null,null,null,null,null,null,null,null,null,null,51,null,null,null,null,null,null,null,null,null,null,null,null,null,63,null,null,null,null,null,null,null,null,null,null,null,null,null,71,null,null,null,null,null,null,null,null,null,null,null,null,null,null,null,null,null,45,null,null,null,null,{"$f":"W51","v":""},{"$f":"W55","v":""}]
[null,null,null,null,null,null,null,"Y1",{"$f":"IF(AND(D2=0,E2=0),\"\",IF(D2<E2,B1,B3))","v":""},null,null,null,null,null,null,null,null,{"$f":"CU42","v":0},{"$f":"CV42","v":0},"YE",null,37,{"$f":"IF(AND(R51=0,S51=0),\"\",IF(R51>S51,P50,P52))","v":""},null,null,null,null,null,null,null,null,{"$f":"CU56","v":0},{"$f":"CV56","v":0},"Y37",null,null,{"$f":"IF(AND(AF51=0,AG51=0),\"\",IF(AF51>AG51,AD49,AD53))","v":""},null,null,null,null,null,null,null,null,null,null,null,null,null,null,null,null,null,null,null,null,null,null,null,null,null,null,null,null,null,null,null,null,null,null,null,null,null,null,null,null,null,null,null,null,46,null,null,null,null,{"$f":"W59","v":""},{"$f":"W63","v":""}]
[null,null,null,null,null,null,null,null,null,null,{"$f":"CU30","v":0},{"$f":"CV30","v":0},"Y.Elenir",null,25,{"$f":"IF(AND(K52=0,L52=0),\"\",IF(K52>L52,I51,I53))","v":""},null,null,null,null,null,null,null,null,null,null,null,null,45,null,null,null,null,null,null,null,null,null,null,null,null,null,57,null,null,null,null,null,null,null,{"$f":"IF(AND(AT53=0,AU53=0),\"\",IF(AT53>AU53,AR49,AR55))","v":""},null,null,null,null,null,null,null,null,null,null,null,null,null,null,null,null,null,null,null,null,null,null,null,null,null,null,null,null,null,null,47,null,null,null,null,{"$f":"W67","v":""},{"$f":"W71","v":""}]
[null,null,null,null,null,null,null,"Y2",{"$f":"IF(AND(D5=0,E5=0),\"\",IF(D5<E5,B4,B6))","v":""},null,null,null,null,null,null,null,null,null,null,null,null,null,null,null,null,{"$f":"CU50","v":0},{"$f":"CV50","v":0},"Y33",null,{"$f":"IF(AND(Z53=0,AA53=0),\"\",IF(Z53>AA53,W51,W55))","v":""},null,null,null,null,null,null,null,null,null,null,null,null,null,null,null,{"$f":"CU68","v":0},{"$f":"CV68","v":0},"Y43",null,null,null,null,null,null,null,null,69,null,null,null,null,null,null,null,null,null,null,null,null,null,null,null,null,null,null,null,null,null,null,null,null,48,null,null,null,null,{"$f":"W75","v":""},{"$f":"W79","v":""}]
[null,null,null,null,null,null,null,null,null,null,null,null,null,null,"Y23",{"$f":"IF(AND(K40=0,L40=0),\"\",IF(K40<L40,I38,I41))","v":""},null,null,null,null,null,null,null,null,null,null,null,null,null,null,null,null,null,null,null,null,null,null,null,null,null,null,null,null,null,null,null,null,null,null,null,null,null,null,null,null,null,null,null,null,null,null,null,null,null,null,null,null,null,null,null,null,null,null,null,null,null,null,null,null,null,49,null,null,null,null,{"$f":"AD7","v":""},{"$f":"AD18","v":""}]
[null,null,null,null,null,null,null,"Y3",{"$f":"IF(AND(D8=0,E8=0),\"\",IF(D8<E8,B7,B9))","v":""},null,null,null,null,null,null,null,null,{"$f":"CU43","v":0},{"$f":"CV43","v":0},"YE",null,38,{"$f":"IF(AND(R55=0,S55=0),\"\",IF(R55>S55,P54,P56))","v":""},null,null,null,null,null,null,null,null,null,null,null,null,null,null,null,null,null,null,null,null,{"$f":"IF(AND(AM56=0,AN56=0),\"\",IF(AM56>AN56,AK51,AK59))","v":""},null,null,null,null,null,null,null,null,null,null,null,null,null,null,null,null,{"$f":"CU76","v":0},{"$f":"CV76","v":0},"Y46",null,{"$f":"IF(AND(BI55=0,BJ55=0),\"\",IF(BI55>BJ55,BF49,BF61))","v":""},null,null,null,null,null,null,null,null,null,null,null,null,null,null,null,null,50,null,null,null,null,{"$f":"AD32","v":""},{"$f":"AD43","v":""}]
[null,null,null,null,null,null,null,null,null,null,{"$f":"CU31","v":0},{"$f":"CV31","v":0},"YE",null,26,{"$f":"IF(AND(K56=0,L56=0),\"\",IF(K56>L56,I55,I57))","v":""},null,null,null,null,null,null,null,null,null,null,null,null,null,null,null,null,null,null,null,null,null,null,{"$f":"CU62","v":0},{"$f":"CV62","v":0},"Y41",null,null,null,null,null,null,null,null,null,null,null,null,null,null,null,null,null,null,null,null,null,null,null,null,null,null,null,null,null,null,null,null,null,null,null,null,null,null,null,null,51,null,null,null,null,{"$f":"AD49","v":""},{"$f":"AD53","v":""}]
[null,null,null,null,null,null,null,"Y4",{"$f":"IF(AND(D11=0,E11=0),\"\",IF(D11<E11,B10,B12))","v":""},null,null,null,null,null,null,null,null,null,null,null,null,null,null,null,null,null,null,null,"Y26",{"$f":"IF(AND(R19=0,S19=0),\"\",IF(R19<S19,P16,P21))","v":""},null,null,null,null,null,null,null,null,null,null,null,null,null,null,null,null,null,null,null,null,null,null,null,null,null,null,null,null,null,null,null,null,null,null,null,null,null,null,null,null,"Y32",{"$f":"IF(AND(BO39=0,BP39=0),\"\",IF(BO39<BP39,BM25,BM55))","v":""},null,null,null,null,null,null,"2.",null,null,52,null,null,null,null,{"$f":"AD57","v":""},{"$f":"AD61","v":""}]
[null,null,null,null,null,null,null,null,null,null,null,null,null,null,"Y22",{"$f":"IF(AND(K34=0,L34=0),\"\",IF(K34<L34,I32,I35))","v":""},null,null,null,null,null,null,null,null,null,null,null,null,null,null,null,null,null,null,null,52,null,null,null,null,null,null,null,null,null,null,null,null,null,null,null,null,null,null,null,null,null,null,null,null,null,null,null,null,null,null,null,null,null,null,null,null,null,null,null,null,null,null,null,null,null,53,null,null,null,null,{"$f":"AD65","v":""},{"$f":"AD69","v":""}]
[null,null,null,null,null,null,null,"Y5",{"$f":"IF(AND(D14=0,E14=0),\"\",IF(D14<E14,B13,B15))","v":""},null,null,null,null,null,null,null,null,{"$f":"CU44","v":0},{"$f":"CV44","v":0},"YE",null,39,{"$f":"IF(AND(R59=0,S59=0),\"\",IF(R59>S59,P58,P60))","v":""},null,null,null,null,null,null,null,null,{"$f":"CU57","v":0},{"$f":"CV57","v":0},"Y38",null,null,{"$f":"IF(AND(AF59=0,AG59=0),\"\",IF(AF59>AG59,AD57,AD61))","v":""},null,null,null,null,null,null,null,null,null,null,null,null,null,null,null,null,null,null,null,null,null,null,null,null,null,null,null,null,null,null,null,null,null,null,null,null,null,null,null,null,null,null,null,null,54,null,null,null,null,{"$f":"AD73","v":""},{"$f":"AD77","v":""}]
[null,null,null,null,null,null,null,null,null,null,{"$f":"CU32","v":0},{"$f":"CV32","v":0},"YE",null,27,{"$f":"IF(AND(K60=0,L60=0),\"\",IF(K60>L60,I59,I61))","v":""},null,null,null,null,null,null,null,null,null,null,null,null,46,null,null,null,null,null,null,null,null,null,null,null,null,null,null,null,null,null,null,null,null,null,null,null,null,null,null,null,null,null,null,null,null,null,null,null,null,null,null,null,null,null,null,null,null,null,null,null,null,null,null,null,null,55,null,null,null,null,{"$f":"AD89","v":""},{"$f":"AD91","v":""}]
[null,null,null,null,null,null,null,"Y6",{"$f":"IF(AND(D17=0,E17=0),\"\",IF(D17<E17,B16,B18))","v":""},null,null,null,null,null,null,null,null,null,null,null,null,null,null,null,null,{"$f":"CU51","v":0},{"$f":"CV51","v":0},"Y34",null,{"$f":"IF(AND(Z61=0,AA61=0),\"\",IF(Z61>AA61,W59,W63))","v":""},null,null,null,null,null,null,null,null,null,null,null,null,null,null,null,null,null,null,null,null,null,null,{"$f":"CU74","v":0},{"$f":"CV74","v":0},"Y45",null,null,{"$f":"IF(AND(BA61=0,BB61=0),\"\",IF(BA61>BB61,AY52,AY69))","v":""},null,null,null,null,null,null,null,null,null,null,null,null,null,null,null,null,null,null,null,null,null,null,null,56,null,null,null,null,{"$f":"AD92","v":""},{"$f":"AD94","v":""}]
[null,null,null,null,null,null,null,null,null,null,null,null,null,null,"Y21",{"$f":"IF(AND(K28=0,L28=0),\"\",IF(K28<L28,I26,I29))","v":""},null,null,null,null,null,null,null,null,null,null,null,null,null,null,null,null,null,null,null,null,null,null,null,null,null,null,null,null,null,null,null,null,null,null,null,null,null,null,null,null,null,null,null,null,null,null,null,null,null,null,null,null,null,null,null,null,null,null,null,null,null,null,null,null,null,57,null,null,null,null,{"$f":"AK51","v":""},{"$f":"AK59","v":""}]
[null,null,null,null,null,null,null,"Y7",{"$f":"IF(AND(D20=0,E20=0),\"\",IF(D20<E20,B19,B21))","v":""},null,null,null,null,null,null,null,null,{"$f":"CU45","v":0},{"$f":"CV45","v":0},"YE",null,40,{"$f":"IF(AND(R63=0,S63=0),\"\",IF(R63>S63,P62,P64))","v":""},null,null,null,null,null,null,null,null,null,null,null,null,null,null,null,null,null,null,null,null,null,null,null,null,null,null,null,null,null,null,null,null,null,null,null,null,null,null,null,null,"Y46",{"$f":"IF(AND(BI55=0,BJ55=0),\"\",IF(BI55<BJ55,BF49,BF61))","v":""},null,null,null,null,null,null,"3.",null,null,null,null,null,null,null,null,null,58,null,null,null,null,{"$f":"AK67","v":""},{"$f":"AK75","v":""}]
[null,null,null,null,null,null,null,null,null,null,{"$f":"CU33","v":0},{"$f":"CV33","v":0},"YE",null,28,{"$f":"IF(AND(K64=0,L64=0),\"\",IF(K64>L64,I63,I65))","v":""},null,null,null,null,null,null,null,null,null,null,null,null,null,null,null,null,null,null,null,null,null,null,null,null,null,null,null,null,null,null,null,null,null,null,null,null,null,null,null,null,null,null,null,null,null,null,null,null,null,null,null,null,null,null,null,null,null,null,null,null,null,null,null,null,null,59,null,null,null,null,{"$f":"AK81","v":""},{"$f":"AK83","v":""}]
[null,null,null,null,null,null,null,"Y8",{"$f":"IF(AND(D23=0,E23=0),\"\",IF(D23<E23,B22,B24))","v":""},null,null,null,null,null,null,null,null,null,null,null,null,null,null,null,null,null,null,null,"Y27",{"$f":"IF(AND(R31=0,S31=0),\"\",IF(R31<S31,P28,P33))","v":""},null,null,null,null,null,null,null,null,null,null,null,null,"Y29",{"$f":"IF(AND(AF13=0,AG13=0),\"\",IF(AF13<AG13,AD7,AD18))","v":""},null,null,null,null,null,null,null,null,null,null,null,null,null,null,null,null,null,null,null,null,null,null,null,null,null,null,null,null,null,null,null,null,null,null,null,null,null,60,null,null,null,null,{"$f":"AK84","v":""},{"$f":"AK86","v":""}]
[null,null,null,null,null,null,null,null,null,null,null,null,null,null,"Y20",{"$f":"IF(AND(K22=0,L22=0),\"\",IF(K22<L22,I20,I23))","v":""},null,null,null,null,null,null,null,null,null,null,null,null,null,null,null,null,null,null,null,53,null,null,null,null,null,null,null,null,null,null,null,null,null,64,null,null,null,null,null,null,null,null,null,null,null,null,null,null,null,null,null,null,null,null,null,null,null,null,null,null,null,null,null,null,null,61,null,null,null,null,{"$f":"AK90","v":""},{"$f":"AK93","v":""}]
[null,null,null,null,null,null,null,"Y9",{"$f":"IF(AND(D26=0,E26=0),\"\",IF(D26<E26,B25,B27))","v":""},null,null,null,null,null,null,null,null,{"$f":"CU46","v":0},{"$f":"CV46","v":0},"YE",null,41,{"$f":"IF(AND(R67=0,S67=0),\"\",IF(R67>S67,P66,P68))","v":""},null,null,null,null,null,null,null,null,{"$f":"CU58","v":0},{"$f":"CV58","v":0},"Y39",null,null,{"$f":"IF(AND(AF67=0,AG67=0),\"\",IF(AF67>AG67,AD65,AD69))","v":""},null,null,null,null,null,null,null,null,null,null,null,null,null,null,null,null,null,null,null,null,null,null,null,null,null,null,null,null,null,null,null,null,null,null,null,null,null,null,null,null,null,null,null,null,62,null,null,null,null,{"$f":"AK95","v":""},{"$f":"AK97","v":""}]
[null,null,null,null,null,null,null,null,null,null,{"$f":"CU34","v":0},{"$f":"CV34","v":0},"YE",null,29,{"$f":"IF(AND(K68=0,L68=0),\"\",IF(K68>L68,I67,I69))","v":""},null,null,null,null,null,null,null,null,null,null,null,null,47,null,null,null,null,null,null,null,null,null,null,null,null,null,null,null,null,null,null,null,null,null,null,null,null,null,null,null,null,null,null,null,null,null,null,null,null,null,null,null,null,null,null,null,null,null,null,null,null,null,null,null,null,63,null,null,null,null,{"$f":"AR49","v":""},{"$f":"AR55","v":""}]
[null,null,null,null,null,null,null,"Y10",{"$f":"IF(AND(D29=0,E29=0),\"\",IF(D29<E29,B28,B30))","v":""},null,null,null,null,null,null,null,null,null,null,null,null,null,null,null,null,{"$f":"CU52","v":0},{"$f":"CV52","v":0},"Y35",null,{"$f":"IF(AND(Z69=0,AA69=0),\"\",IF(Z69>AA69,W67,W71))","v":""},null,null,null,null,null,null,null,null,null,null,null,null,58,null,null,{"$f":"CU69","v":0},{"$f":"CV69","v":0},"Y44",null,null,{"$f":"IF(AND(AT69=0,AU69=0),\"\",IF(AT69>AU69,AR65,AR72))","v":""},null,null,null,null,null,null,null,null,null,null,null,null,null,null,null,null,null,null,null,null,null,null,null,null,null,null,null,null,null,null,64,null,null,null,null,{"$f":"AR65","v":""},{"$f":"AR72","v":""}]
[null,null,null,null,null,null,null,null,null,null,null,null,null,null,"Y19",{"$f":"IF(AND(K16=0,L16=0),\"\",IF(K16<L16,I14,I17))","v":""},null,null,null,null,null,null,null,null,null,null,null,null,null,null,null,null,null,null,null,null,null,null,null,null,null,null,null,null,null,null,null,null,null,null,null,null,null,null,null,null,null,null,null,null,null,null,null,null,null,null,null,null,null,null,null,null,null,null,null,null,null,null,null,null,null,65,null,null,null,null,{"$f":"AR78","v":""},{"$f":"AR80","v":""}]
[null,null,null,null,null,null,null,"Y11",{"$f":"IF(AND(D32=0,E32=0),\"\",IF(D32<E32,B31,B33))","v":""},null,null,null,null,null,null,null,null,{"$f":"CU47","v":0},{"$f":"CV47","v":0},"YE",null,42,{"$f":"IF(AND(R71=0,S71=0),\"\",IF(R71>S71,P70,P72))","v":""},null,null,null,null,null,null,null,null,null,null,null,null,null,null,null,null,null,null,null,null,null,null,null,null,null,null,null,null,null,null,null,null,null,"Y45",{"$f":"IF(AND(BA61=0,BB61=0),\"\",IF(BA61<BB61,AY52,AY69))","v":""},null,null,null,null,null,null,"4.",null,null,null,null,null,null,null,null,null,null,null,null,null,null,null,null,66,null,null,null,null,{"$f":"AR82","v":""},{"$f":"AR85","v":""}]
[null,null,null,null,null,null,null,null,null,null,{"$f":"CU35","v":0},{"$f":"CV35","v":0},"YE",null,30,{"$f":"IF(AND(K72=0,L72=0),\"\",IF(K72>L72,I71,I73))","v":""},null,null,null,null,null,null,null,null,null,null,null,null,null,null,null,null,null,null,null,null,null,null,{"$f":"CU63","v":0},{"$f":"CV63","v":0},"Y42",null,null,{"$f":"IF(AND(AM72=0,AN72=0),\"\",IF(AM72>AN72,AK67,AK75))","v":""},null,null,null,null,null,null,null,null,null,null,null,null,null,null,null,null,null,null,null,null,null,null,null,null,null,null,null,null,null,null,null,null,null,null,null,null,null,67,null,null,null,null,{"$f":"AR87","v":""},{"$f":"AR89","v":""}]
[null,null,null,null,null,null,null,"Y12",{"$f":"IF(AND(D35=0,E35=0),\"\",IF(D35<E35,B34,B36))","v":""},null,null,null,null,null,null,null,null,null,null,null,null,null,null,null,null,null,null,null,"Y28",{"$f":"IF(AND(R43=0,S43=0),\"\",IF(R43<S43,P40,P45))","v":""},null,null,null,null,null,null,null,null,null,null,null,null,null,null,null,null,null,null,null,null,null,null,null,null,null,null,null,null,null,null,null,null,null,null,null,null,null,null,null,null,null,null,null,null,null,null,null,null,null,null,null,68,null,null,null,null,{"$f":"AY13","v":""},{"$f":"AY38","v":""}]
[null,null,null,null,null,null,null,null,null,null,null,null,null,null,"Y18",{"$f":"IF(AND(K10=0,L10=0),\"\",IF(K10<L10,I8,I11))","v":""},null,null,null,null,null,null,null,null,null,null,null,null,null,null,null,null,null,null,null,54,null,null,null,null,null,null,null,null,null,null,null,null,null,"Y43",{"$f":"IF(AND(AT53=0,AU53=0),\"\",IF(AT53<AU53,AR49,AR55))","v":""},null,null,null,null,null,null,null,null,null,null,null,null,null,null,null,null,null,null,null,null,null,null,null,null,null,null,null,null,null,null,69,null,null,null,null,{"$f":"AY52","v":""},{"$f":"AY69","v":""}]
[null,null,null,null,null,null,null,"Y13",{"$f":"IF(AND(D38=0,E38=0),\"\",IF(D38<E38,B37,B39))","v":""},null,null,null,null,null,null,null,null,{"$f":"CU48","v":0},{"$f":"CV48","v":0},"YE",null,43,{"$f":"IF(AND(R75=0,S75=0),\"\",IF(R75>S75,P74,P76))","v":""},null,null,null,null,null,null,null,null,{"$f":"CU59","v":0},{"$f":"CV59","v":0},"Y40",null,null,{"$f":"IF(AND(AF75=0,AG75=0),\"\",IF(AF75>AG75,AD73,AD77))","v":""},null,null,null,null,null,null,null,null,null,null,null,null,null,null,null,{"$f":"CU75","v":0},{"$f":"CV75","v":0},"Y56",null,70,{"$f":"IF(AND(BA75=0,BB75=0),\"\",IF(BA75>BB75,AY74,AY76))","v":""},null,null,null,null,null,null,"5.",null,null,null,null,null,null,null,null,null,null,null,null,null,null,null,null,70,null,null,null,null,{"$f":"AY74","v":""},{"$f":"AY76","v":""}]
[null,null,null,null,null,null,null,null,null,null,{"$f":"CU36","v":0},{"$f":"CV36","v":0},"YE",null,31,{"$f":"IF(AND(K76=0,L76=0),\"\",IF(K76>L76,I75,I77))","v":""},null,null,null,null,null,null,null,null,null,null,null,null,48,null,null,null,null,null,null,null,null,null,null,null,null,null,null,null,null,null,null,null,null,"Y44",{"$f":"IF(AND(AT69=0,AU69=0),\"\",IF(AT69<AU69,AR65,AR72))","v":""},null,null,null,null,null,null,null,null,null,null,null,null,null,null,null,null,null,null,null,null,null,null,null,null,null,null,null,null,null,null,71,null,null,null,null,{"$f":"BF49","v":""},{"$f":"BF61","v":""}]
[null,null,null,null,null,null,null,"Y14",{"$f":"IF(AND(D41=0,E41=0),\"\",IF(D41<E41,B40,B42))","v":""},null,null,null,null,null,null,null,null,null,null,null,null,null,null,null,null,{"$f":"CU53","v":0},{"$f":"CV53","v":0},"Y36",null,{"$f":"IF(AND(Z77=0,AA77=0),\"\",IF(Z77>AA77,W75,W79))","v":""},null,null,null,null,null,null,null,null,null,null,null,null,null,null,null,null,null,null,null,null,null,null,null,null,null,null,"Y56",{"$f":"IF(AND(BA75=0,BB75=0),\"\",IF(BA75<BB75,AY74,AY76))","v":""},null,null,null,null,null,null,"6.",null,null,null,null,null,null,null,null,null,null,null,null,null,null,null,null,72,null,null,null,null,{"$f":"BM25","v":""},{"$f":"BM55","v":""}]
[null,null,null,null,null,null,null,null,null,null,null,null,null,null,"Y17",{"$f":"IF(AND(K4=0,L4=0),\"\",IF(K4<L4,I2,I5))","v":""},null,null,null,null,null,null,null,null,null,null,null,null,null,null,null,null,null,null,null,null,null,null,null,null,null,null,"Y41",{"$f":"IF(AND(AM56=0,AN56=0),\"\",IF(AM56<AN56,AK51,AK59))","v":""}]
[null,null,null,null,null,null,null,"Y15",{"$f":"IF(AND(D44=0,E44=0),\"\",IF(D44<E44,B43,B45))","v":""},null,null,null,null,null,null,null,null,{"$f":"CU49","v":0},{"$f":"CV49","v":0},"YE",null,44,{"$f":"IF(AND(R79=0,S79=0),\"\",IF(R79>S79,P78,P80))","v":""},null,null,null,null,null,null,null,null,null,null,null,null,null,null,null,null,null,null,null,null,null,null,{"$f":"CU70","v":0},{"$f":"CV70","v":0},"Y53",null,65,{"$f":"IF(AND(AT79=0,AU79=0),\"\",IF(AT79>AU79,AR78,AR80))","v":""},null,null,null,null,null,null,"7."]
[null,null,null,null,null,null,null,null,null,null,{"$f":"CU37","v":0},{"$f":"CV37","v":0},"YE",null,32,{"$f":"IF(AND(K80=0,L80=0),\"\",IF(K80>L80,I79,I81))","v":""},null,null,null,null,null,null,null,null,null,null,null,null,null,null,null,null,null,null,null,null,null,null,null,null,null,null,"Y42",{"$f":"IF(AND(AM72=0,AN72=0),\"\",IF(AM72<AN72,AK67,AK75))","v":""}]
[null,null,null,null,null,null,null,"Y16",{"$f":"IF(AND(D47=0,E47=0),\"\",IF(D47<E47,B46,B48))","v":""},null,null,null,null,null,null,null,null,null,null,null,null,null,null,null,null,null,null,null,null,null,null,null,null,null,null,"Y37",{"$f":"IF(AND(AF51=0,AG51=0),\"\",IF(AF51<AG51,AD49,AD53))","v":""},null,null,null,null,null,null,null,null,null,null,null,null,"Y53",{"$f":"IF(AND(AT79=0,AU79=0),\"\",IF(AT79<AU79,AR78,AR80))","v":""},null,null,null,null,null,null,"8."]
[null,null,null,null,null,null,null,null,null,null,null,null,null,null,null,null,null,null,null,null,null,null,null,null,null,null,null,null,null,null,null,null,null,null,null,null,null,null,{"$f":"CU64","v":0},{"$f":"CV64","v":0},"Y49",null,59,{"$f":"IF(AND(AM82=0,AN82=0),\"\",IF(AM82>AN82,AK81,AK83))","v":""}]
[null,null,null,null,null,null,null,null,null,null,null,null,null,null,null,null,null,null,null,null,null,null,null,null,null,null,null,null,null,null,null,null,null,null,null,"Y38",{"$f":"IF(AND(AF59=0,AG59=0),\"\",IF(AF59<AG59,AD57,AD61))","v":""},null,null,null,null,null,null,null,null,null,null,null,null,66]
[null,null,null,null,null,null,null,null,null,null,null,null,null,null,null,null,null,null,null,null,null,null,null,null,null,null,null,null,null,null,null,null,null,null,null,"Y39",{"$f":"IF(AND(AF67=0,AG67=0),\"\",IF(AF67<AG67,AD65,AD69))","v":""},null,null,null,null,null,null,null,null,{"$f":"CU71","v":0},{"$f":"CV71","v":0},"Y54",null,null,{"$f":"IF(AND(AT84=0,AU84=0),\"\",IF(AT84>AU84,AR82,AR85))","v":""},null,null,null,null,null,null,"9."]
[null,null,null,null,null,null,null,null,null,null,null,null,null,null,null,null,null,null,null,null,null,null,null,null,null,null,null,null,null,null,null,null,null,null,null,null,null,null,{"$f":"CU65","v":0},{"$f":"CV65","v":0},"Y50",null,60,{"$f":"IF(AND(AM85=0,AN85=0),\"\",IF(AM85>AN85,AK84,AK86))","v":""}]
[null,null,null,null,null,null,null,null,null,null,null,null,null,null,null,null,null,null,null,null,null,null,null,null,null,null,null,null,null,null,null,null,null,null,null,"Y40",{"$f":"IF(AND(AF75=0,AG75=0),\"\",IF(AF75<AG75,AD73,AD77))","v":""},null,null,null,null,null,null,null,null,null,null,null,null,"Y54",{"$f":"IF(AND(AT84=0,AU84=0),\"\",IF(AT84<AU84,AR82,AR85))","v":""},null,null,null,null,null,null,"10."]
[null,null,null,null,null,null,null,null,null,null,null,null,null,null,null,null,null,null,null,null,null,null,null,null,null,null,null,null,null,null,null,null,null,null,null,null,null,null,null,null,null,null,"Y49",{"$f":"IF(AND(AM82=0,AN82=0),\"\",IF(AM82<AN82,AK81,AK83))","v":""}]
[null,null,null,null,null,null,null,null,null,null,null,null,null,null,null,null,null,null,null,null,null,null,null,null,null,null,null,null,null,null,null,null,null,null,null,null,null,null,null,null,null,null,null,null,null,{"$f":"CU72","v":0},{"$f":"CV72","v":0},"Y55",null,67,{"$f":"IF(AND(AT88=0,AU88=0),\"\",IF(AT88>AU88,AR87,AR89))","v":""},null,null,null,null,null,null,"11."]
[null,null,null,null,null,null,null,null,null,null,null,null,null,null,null,null,null,null,null,null,null,null,null,null,null,null,null,null,"Y33",{"$f":"IF(AND(Z53=0,AA53=0),\"\",IF(Z53<AA53,W51,W55))","v":""},null,null,null,null,null,null,null,null,null,null,null,null,"Y50",{"$f":"IF(AND(AM85=0,AN85=0),\"\",IF(AM85<AN85,AK84,AK86))","v":""}]
[null,null,null,null,null,null,null,null,null,null,null,null,null,null,null,null,null,null,null,null,null,null,null,null,null,null,null,null,null,null,null,{"$f":"CU60","v":0},{"$f":"CV60","v":0},"Y47",null,55,{"$f":"IF(AND(AF90=0,AG90=0),\"\",IF(AF90>AG90,AD89,AD91))","v":""},null,null,null,null,null,null,null,null,null,null,null,null,"Y55",{"$f":"IF(AND(AT88=0,AU88=0),\"\",IF(AT88<AU88,AR87,AR89))","v":""},null,null,null,null,null,null,"12."]
[null,null,null,null,null,null,null,null,null,null,null,null,null,null,null,null,null,null,null,null,null,null,null,null,null,null,null,null,"Y34",{"$f":"IF(AND(Z61=0,AA61=0),\"\",IF(Z61<AA61,W59,W63))","v":""},null,null,null,null,null,null,null,null,null,null,null,null,61]
[null,null,null,null,null,null,null,null,null,null,null,null,null,null,null,null,null,null,null,null,null,null,null,null,null,null,null,null,"Y35",{"$f":"IF(AND(Z69=0,AA69=0),\"\",IF(Z69<AA69,W67,W71))","v":""},null,null,null,null,null,null,null,null,{"$f":"CU66","v":0},{"$f":"CV66","v":0},"Y51",null,null,{"$f":"IF(AND(AM92=0,AN92=0),\"\",IF(AM92>AN92,AK90,AK93))","v":""},null,null,null,null,null,null,"13."]
[null,null,null,null,null,null,null,null,null,null,null,null,null,null,null,null,null,null,null,null,null,null,null,null,null,null,null,null,null,null,null,{"$f":"CU61","v":0},{"$f":"CV61","v":0},"Y48",null,56,{"$f":"IF(AND(AF93=0,AG93=0),\"\",IF(AF93>AG93,AD92,AD94))","v":""}]
[null,null,null,null,null,null,null,null,null,null,null,null,null,null,null,null,null,null,null,null,null,null,null,null,null,null,null,null,"Y36",{"$f":"IF(AND(Z77=0,AA77=0),\"\",IF(Z77<AA77,W75,W79))","v":""},null,null,null,null,null,null,null,null,null,null,null,null,"Y51",{"$f":"IF(AND(AM92=0,AN92=0),\"\",IF(AM92<AN92,AK90,AK93))","v":""},null,null,null,null,null,null,"14."]
[null,null,null,null,null,null,null,null,null,null,null,null,null,null,null,null,null,null,null,null,null,null,null,null,null,null,null,null,null,null,null,null,null,null,null,"Y47",{"$f":"IF(AND(AF90=0,AG90=0),\"\",IF(AF90<AG90,AD89,AD91))","v":""}]
[null,null,null,null,null,null,null,null,null,null,null,null,null,null,null,null,null,null,null,null,null,null,null,null,null,null,null,null,null,null,null,null,null,null,null,null,null,null,{"$f":"CU67","v":0},{"$f":"CV67","v":0},"Y52",null,62,{"$f":"IF(AND(AM96=0,AN96=0),\"\",IF(AM96>AN96,AK95,AK97))","v":""},null,null,null,null,null,null,"15."]
[null,null,null,null,null,null,null,null,null,null,null,null,null,null,null,null,null,null,null,null,null,null,null,null,null,null,null,null,null,null,null,null,null,null,null,"Y48",{"$f":"IF(AND(AF93=0,AG93=0),\"\",IF(AF93<AG93,AD92,AD94))","v":""}]
[null,null,null,null,null,null,null,null,null,null,null,null,null,null,null,null,null,null,null,null,null,null,null,null,null,null,null,null,null,null,null,null,null,null,null,null,null,null,null,null,null,null,"Y52",{"$f":"IF(AND(AM96=0,AN96=0),\"\",IF(AM96<AN96,AK95,AK97))","v":""},null,null,null,null,null,null,"16."]

{"sheet":"32DE(16)","index":6,"n_rows":84,"n_cols":105,"rows_kept":84,"cut":false,"hidden":true,"merged":[[39,36,39,42],[59,22,59,28],[0,24,2,43],[3,24,4,43],[82,29,82,35],[83,36,83,42],[45,29,45,35],[46,36,46,42],[48,22,48,28],[51,36,51,42],[53,29,53,35],[54,36,54,42],[61,29,61,35],[47,29,47,35],[48,36,48,42],[49,29,49,35],[50,22,50,28],[81,36,81,42],[79,36,79,42],[78,29,78,35],[79,22,79,28],[80,29,80,35],[77,22,77,28],[75,22,75,28],[76,36,76,42],[73,22,73,28],[73,36,73,42],[74,29,74,35],[69,15,69,21],[70,29,70,35],[71,36,71,42],[66,15,66,21],[66,29,66,35],[67,15,67,21],[67,36,67,42],[56,36,56,42],[57,29,57,35],[54,22,54,28],[55,29,55,35],[68,22,68,28],[72,29,72,35],[52,22,52,28],[45,1,45,7],[46,8,46,14],[47,1,47,7],[64,15,64,21],[65,22,65,28],[63,15,63,21],[64,36,64,42],[60,15,60,21],[61,15,61,21],[62,22,62,28],[58,36,58,42],[58,15,58,21],[40,8,40,14],[41,1,41,7],[42,1,42,7],[42,22,42,28],[43,8,43,14],[44,1,44,7],[44,15,44,21],[36,1,36,7],[37,8,37,14],[37,29,37,35],[38,1,38,7],[39,1,39,7],[39,15,39,21],[31,22,31,28],[32,1,32,7],[32,15,32,21],[33,1,33,7],[34,8,34,14],[35,1,35,7],[27,1,27,7],[27,15,27,21],[28,8,28,14],[29,1,29,7],[30,1,30,7],[31,8,31,14],[22,8,22,14],[23,1,23,7],[24,1,24,7],[24,36,24,42],[25,8,25,14],[26,1,26,7],[18,1,18,7],[19,8,19,14],[20,1,20,7],[20,15,20,21],[21,1,21,7],[14,1,14,7],[15,1,15,7],[15,15,15,21],[16,8,16,14],[17,1,17,7],[17,22,17,28],[9,1,9,7],[10,8,10,14],[11,1,11,7],[12,1,12,7],[12,29,12,35],[13,8,13,14],[5,1,5,7],[6,1,6,7],[6,22,6,28],[7,8,7,14],[8,1,8,7],[8,15,8,21],[4,88,4,89],[4,90,4,91],[4,92,4,93],[4,94,4,95],[4,96,4,97],[4,98,4,99],[0,1,0,7],[1,8,1,14],[2,1,2,7],[3,1,3,7],[3,15,3,21],[4,8,4,14]]}
[1,{"$f":"IF(#REF!=2,Eleme!#REF!,IF(#REF!=3,Eleme!#REF!,IF(#REF!=4,Eleme!#REF!,IF(#REF!=5,Eleme!#REF!))))","v":{"$error":"#REF!"}},null,null,null,null,null,null,null,null,null,null,null,null,null,null,null,null,null,null,null,null,null,null,{"$f":"+Katılım!A1","v":"TÜRKİYE MASA TENİSİ FEDERASYONU\nKÜÇÜKLER KUZEYBATI BÖLGESİ YARIŞMALARI"},null,null,null,null,null,null,null,null,null,null,null,null,null,null,null,null,null,null,null,null,null,null,null,null,null,null,null,null,null,null,null,null,null,null,null,null,null,null,null,null,null,null,null,null,null,null,null,null,null,null,null,null,null,null,null,null,null,null,null,null,null,null,null,null,null,null,null,null,null,null,null,null,null,null,null,null,null,null,"1st Round",1]
[null,null,null,{"$f":"CU6","v":0},{"$f":"CV6","v":0},null,null,1,{"$f":"IF(AND(D2=0,E2=0),\"\",IF(D2>E2,B1,B3))","v":""},null,null,null,null,null,null,null,null,null,null,null,null,null,null,null,null,null,null,null,null,null,null,null,null,null,null,null,null,null,null,null,null,null,null,null,null,null,null,null,null,null,null,null,null,null,null,null,null,null,null,null,null,null,null,null,null,null,null,null,null,null,null,null,null,null,null,null,null,null,null,null,null,null,null,null,null,null,null,null,null,null,null,null,null,null,null,null,null,null,null,null,null,null,null,"2sn Round"]
[2,{"$f":"IF(#REF!=2,Eleme!#REF!,IF(#REF!=3,Eleme!#REF!,IF(#REF!=4,Eleme!#REF!,IF(#REF!=5,Eleme!#REF!))))","v":{"$error":"#REF!"}},null,null,null,null,null,null,null,null,null,null,null,null,17,null,null,null,null,null,null,null,null,null,null,null,null,null,null,null,null,null,null,null,null,null,null,null,null,null,null,null,null,null,null,null,null,null,null,null,null,null,null,null,null,null,null,null,null,null,null,null,null,null,null,null,null,null,null,null,null,null,null,null,null,null,null,null,null,null,null,null,null,null,null,null,null,null,null,null,null,null,null,null,null,null,null,null,null,null,null,null,null,"3th Round"]
[3,{"$f":"IF(#REF!=2,Eleme!#REF!,IF(#REF!=3,Eleme!#REF!,IF(#REF!=4,Eleme!#REF!,IF(#REF!=5,Eleme!#REF!))))","v":{"$error":"#REF!"}},null,null,null,null,null,null,null,null,{"$f":"CU22","v":0},{"$f":"CV22","v":0},"Y-1",null,null,{"$f":"IF(AND(K4=0,L4=0),\"\",IF(K4>L4,I2,I5))","v":""},null,null,null,null,null,null,null,null,{"$f":"Katılım!AC2&\" \"&Katılım!AE3","v":"ERKEK TAKIM  [12-13 Mart 2025 KOCAELİ] [ Ana Tablo ]"},null,null,null,null,null,null,null,null,null,null,null,null,null,null,null,null,null,null,null,null,null,null,null,null,null,null,null,null,null,null,null,null,null,null,null,null,null,null,null,null,null,null,null,null,null,null,null,null,null,null,null,null,null,null,null,null,null,null,null,null,null,null,null,null,null,null,null,null,null,null,null,null,null,null,null,null,null,null,"4th Round"]
[null,null,null,{"$f":"CU7","v":0},{"$f":"CV7","v":0},null,null,2,{"$f":"IF(AND(D5=0,E5=0),\"\",IF(D5>E5,B4,B6))","v":""},null,null,null,null,null,null,null,null,null,null,null,null,25,null,null,null,null,null,null,null,null,null,null,null,null,null,null,null,null,null,null,null,null,null,null,null,null,null,null,null,null,null,null,null,null,null,null,null,null,null,null,null,null,null,null,null,null,null,null,null,null,null,null,null,null,null,null,null,null,null,null,null,"#","Date","Time","Table","Competition","Player A","Player B","Set1",null,"Set2",null,"Set3",null,"Set4",null,"Set5",null,"Result",null,null,null,null,"5th Round"]
[4,{"$f":"IF(#REF!=2,Eleme!#REF!,IF(#REF!=3,Eleme!#REF!,IF(#REF!=4,Eleme!#REF!,IF(#REF!=5,Eleme!#REF!))))","v":{"$error":"#REF!"}},null,null,null,null,null,null,null,null,null,null,null,null,null,null,null,null,null,null,null,null,null,null,null,null,null,null,null,null,null,null,null,null,null,null,null,null,null,null,null,null,null,null,null,null,null,null,null,null,null,null,null,null,null,null,null,null,null,null,null,null,null,null,null,null,null,null,null,null,null,null,null,null,null,null,null,null,null,null,null,1,null,null,null,null,{"$f":"B1","v":{"$error":"#REF!"}},{"$f":"B3","v":{"$error":"#REF!"}},null,null,null,null,null,null,null,null,null,null,null,null,null,null,null,"6th Round"]
[5,{"$f":"IF(#REF!=2,Eleme!#REF!,IF(#REF!=3,Eleme!#REF!,IF(#REF!=4,Eleme!#REF!,IF(#REF!=5,Eleme!#REF!))))","v":{"$error":"#REF!"}},null,null,null,null,null,null,null,null,null,null,null,null,null,null,null,{"$f":"CU30","v":0},{"$f":"CV30","v":0},"Y-9",null,null,{"$f":"IF(AND(R7=0,S7=0),\"\",IF(R7>S7,P4,P9))","v":""},null,null,null,null,null,null,null,null,null,null,null,null,null,null,null,null,null,null,null,null,null,null,null,null,null,null,null,null,null,null,null,null,null,null,null,null,null,null,null,null,null,null,null,null,null,null,null,null,null,null,null,null,null,null,null,null,null,null,2,null,null,null,null,{"$f":"B4","v":{"$error":"#REF!"}},{"$f":"B6","v":{"$error":"#REF!"}},null,null,null,null,null,null,null,null,null,null,null,null,null,null,null,"7th Round"]
[null,null,null,{"$f":"CU8","v":0},{"$f":"CV8","v":0},null,null,3,{"$f":"IF(AND(D8=0,E8=0),\"\",IF(D8>E8,B7,B9))","v":""},null,null,null,null,null,null,null,null,null,null,null,null,null,null,null,null,null,null,null,33,null,null,null,null,null,null,null,null,null,null,null,null,null,null,null,null,null,null,null,null,null,null,null,null,null,null,null,null,null,null,null,null,null,null,null,null,null,null,null,null,null,null,null,null,null,null,null,null,null,null,null,null,3,null,null,null,null,{"$f":"B7","v":{"$error":"#REF!"}},{"$f":"B9","v":{"$error":"#REF!"}},null,null,null,null,null,null,null,null,null,null,null,null,null,null,null,"8th Round"]
[6,{"$f":"IF(#REF!=2,Eleme!#REF!,IF(#REF!=3,Eleme!#REF!,IF(#REF!=4,Eleme!#REF!,IF(#REF!=5,Eleme!#REF!))))","v":{"$error":"#REF!"}},null,null,null,null,null,null,null,null,null,null,null,null,18,{"$f":"IF(AND(K10=0,L10=0),\"\",IF(K10>L10,I8,I11))","v":""},null,null,null,null,null,null,null,null,null,null,null,null,null,null,null,null,null,null,null,null,null,null,null,null,null,null,null,null,null,null,null,null,null,null,null,null,null,null,null,null,null,null,null,null,null,null,null,null,null,null,null,null,null,null,null,null,null,null,null,null,null,null,null,null,null,4,null,null,null,null,{"$f":"B10","v":{"$error":"#REF!"}},{"$f":"B12","v":{"$error":"#REF!"}},null,null,null,null,null,null,null,null,null,null,null,null,null,null,null,"9th Round"]
[7,{"$f":"IF(#REF!=2,Eleme!#REF!,IF(#REF!=3,Eleme!#REF!,IF(#REF!=4,Eleme!#REF!,IF(#REF!=5,Eleme!#REF!))))","v":{"$error":"#REF!"}},null,null,null,null,null,null,null,null,{"$f":"CU23","v":0},{"$f":"CV23","v":0},"Y-2",null,null,null,null,null,null,null,null,null,null,null,null,null,null,null,null,null,null,null,null,null,null,null,null,null,null,null,null,null,null,null,null,null,null,null,null,null,null,null,null,null,null,null,null,null,null,null,null,null,null,null,null,null,null,null,null,null,null,null,null,null,null,null,null,null,null,null,null,5,null,null,null,null,{"$f":"B13","v":{"$error":"#REF!"}},{"$f":"B15","v":{"$error":"#REF!"}},null,null,null,null,null,null,null,null,null,null,null,null,null,null,null,"10th Round"]
[null,null,null,{"$f":"CU9","v":0},{"$f":"CV9","v":0},null,null,4,{"$f":"IF(AND(D11=0,E11=0),\"\",IF(D11>E11,B10,B12))","v":""},null,null,null,null,null,null,null,null,null,null,null,null,null,null,null,null,null,null,null,null,null,null,null,null,null,null,null,null,null,null,null,null,null,null,null,null,null,null,null,null,null,null,null,null,null,null,null,null,null,null,null,null,null,null,null,null,null,null,null,null,null,null,null,null,null,null,null,null,null,null,null,null,6,null,null,null,null,{"$f":"B16","v":{"$error":"#REF!"}},{"$f":"B18","v":{"$error":"#REF!"}}]
[8,{"$f":"IF(#REF!=2,Eleme!#REF!,IF(#REF!=3,Eleme!#REF!,IF(#REF!=4,Eleme!#REF!,IF(#REF!=5,Eleme!#REF!))))","v":{"$error":"#REF!"}},null,null,null,null,null,null,null,null,null,null,null,null,null,null,null,null,null,null,null,null,null,null,null,null,null,null,null,null,null,null,null,null,null,null,null,null,null,null,null,null,null,null,null,null,null,null,null,null,null,null,null,null,null,null,null,null,null,null,null,null,null,null,null,null,null,null,null,null,null,null,null,null,null,null,null,null,null,null,null,7,null,null,null,null,{"$f":"B19","v":{"$error":"#REF!"}},{"$f":"B21","v":{"$error":"#REF!"}}]
[9,{"$f":"IF(#REF!=2,Eleme!#REF!,IF(#REF!=3,Eleme!#REF!,IF(#REF!=4,Eleme!#REF!,IF(#REF!=5,Eleme!#REF!))))","v":{"$error":"#REF!"}},null,null,null,null,null,null,null,null,null,null,null,null,null,null,null,null,null,null,null,null,null,null,{"$f":"CU38","v":0},{"$f":"CV38","v":0},"Y-17",null,null,{"$f":"IF(AND(Y13=0,Z13=0),\"\",IF(Y13>Z13,W7,W18))","v":""},null,null,null,null,null,null,null,null,null,null,null,null,null,null,null,null,null,null,null,null,null,null,null,null,null,null,null,null,null,null,null,null,null,null,null,null,null,null,null,null,null,null,null,null,null,null,null,null,null,null,null,8,null,null,null,null,{"$f":"B22","v":{"$error":"#REF!"}},{"$f":"B24","v":{"$error":"#REF!"}}]
[null,null,null,{"$f":"CU10","v":0},{"$f":"CV10","v":0},null,null,5,{"$f":"IF(AND(D14=0,E14=0),\"\",IF(D14>E14,B13,B15))","v":""},null,null,null,null,null,null,null,null,null,null,null,null,null,null,null,null,null,null,null,null,null,null,null,null,null,null,41,null,null,null,null,null,null,null,null,null,null,null,null,null,null,null,null,null,null,null,null,null,null,null,null,null,null,null,null,null,null,null,null,null,null,null,null,null,null,null,null,null,null,null,null,null,9,null,null,null,null,{"$f":"B25","v":{"$error":"#REF!"}},{"$f":"B27","v":{"$error":"#REF!"}}]
[10,{"$f":"IF(#REF!=2,Eleme!#REF!,IF(#REF!=3,Eleme!#REF!,IF(#REF!=4,Eleme!#REF!,IF(#REF!=5,Eleme!#REF!))))","v":{"$error":"#REF!"}},null,null,null,null,null,null,null,null,null,null,null,null,19,null,null,null,null,null,null,null,null,null,null,null,null,null,null,null,null,null,null,null,null,null,null,null,null,null,null,null,null,null,null,null,null,null,null,null,null,null,null,null,null,null,null,null,null,null,null,null,null,null,null,null,null,null,null,null,null,null,null,null,null,null,null,null,null,null,null,10,null,null,null,null,{"$f":"B28","v":{"$error":"#REF!"}},{"$f":"B30","v":{"$error":"#REF!"}}]
[11,{"$f":"IF(#REF!=2,Eleme!#REF!,IF(#REF!=3,Eleme!#REF!,IF(#REF!=4,Eleme!#REF!,IF(#REF!=5,Eleme!#REF!))))","v":{"$error":"#REF!"}},null,null,null,null,null,null,null,null,{"$f":"CU24","v":0},{"$f":"CV24","v":0},"Y-3",null,null,{"$f":"IF(AND(K16=0,L16=0),\"\",IF(K16>L16,I14,I17))","v":""},null,null,null,null,null,null,null,null,null,null,null,null,null,null,null,null,null,null,null,null,null,null,null,null,null,null,null,null,null,null,null,null,null,null,null,null,null,null,null,null,null,null,null,null,null,null,null,null,null,null,null,null,null,null,null,null,null,null,null,null,null,null,null,null,null,11,null,null,null,null,{"$f":"B31","v":{"$error":"#REF!"}},{"$f":"B33","v":{"$error":"#REF!"}}]
[null,null,null,{"$f":"CU11","v":0},{"$f":"CV11","v":0},null,null,6,{"$f":"IF(AND(D17=0,E17=0),\"\",IF(D17>E17,B16,B18))","v":""},null,null,null,null,null,null,null,null,null,null,null,null,26,null,null,null,null,null,null,null,null,null,null,null,null,null,null,null,null,null,null,null,null,null,null,null,null,null,null,null,null,null,null,null,null,null,null,null,null,null,null,null,null,null,null,null,null,null,null,null,null,null,null,null,null,null,null,null,null,null,null,null,12,null,null,null,null,{"$f":"B34","v":{"$error":"#REF!"}},{"$f":"B36","v":{"$error":"#REF!"}}]
[12,{"$f":"IF(#REF!=2,Eleme!#REF!,IF(#REF!=3,Eleme!#REF!,IF(#REF!=4,Eleme!#REF!,IF(#REF!=5,Eleme!#REF!))))","v":{"$error":"#REF!"}},null,null,null,null,null,null,null,null,null,null,null,null,null,null,null,null,null,null,null,null,{"$f":"IF(AND(R19=0,S19=0),\"\",IF(R19>S19,P16,P21))","v":""},null,null,null,null,null,null,null,null,null,null,null,null,null,null,null,null,null,null,null,null,null,null,null,null,null,null,null,null,null,null,null,null,null,null,null,null,null,null,null,null,null,null,null,null,null,null,null,null,null,null,null,null,null,null,null,null,null,null,13,null,null,null,null,{"$f":"B37","v":{"$error":"#REF!"}},{"$f":"B39","v":{"$error":"#REF!"}}]
[13,{"$f":"IF(#REF!=2,Eleme!#REF!,IF(#REF!=3,Eleme!#REF!,IF(#REF!=4,Eleme!#REF!,IF(#REF!=5,Eleme!#REF!))))","v":{"$error":"#REF!"}},null,null,null,null,null,null,null,null,null,null,null,null,null,null,null,{"$f":"CU31","v":0},{"$f":"CV31","v":0},"Y-10",null,null,null,null,null,null,null,null,null,null,null,null,null,null,null,null,null,null,null,null,null,null,null,null,null,null,null,null,null,null,null,null,null,null,null,null,null,null,null,null,null,null,null,null,null,null,null,null,null,null,null,null,null,null,null,null,null,null,null,null,null,14,null,null,null,null,{"$f":"B40","v":{"$error":"#REF!"}},{"$f":"B42","v":{"$error":"#REF!"}}]
[null,null,null,{"$f":"CU12","v":0},{"$f":"CV12","v":0},null,null,7,{"$f":"IF(AND(D20=0,E20=0),\"\",IF(D20>E20,B19,B21))","v":""},null,null,null,null,null,null,null,null,null,null,null,null,null,null,null,null,null,null,null,null,null,null,null,null,null,null,null,null,null,null,null,null,null,null,null,null,null,null,null,null,null,null,null,null,null,null,null,null,null,null,null,null,null,null,null,null,null,null,null,null,null,null,null,null,null,null,null,null,null,null,null,null,15,null,null,null,null,{"$f":"B43","v":{"$error":"#REF!"}},{"$f":"B45","v":{"$error":"#REF!"}}]
[14,{"$f":"IF(#REF!=2,Eleme!#REF!,IF(#REF!=3,Eleme!#REF!,IF(#REF!=4,Eleme!#REF!,IF(#REF!=5,Eleme!#REF!))))","v":{"$error":"#REF!"}},null,null,null,null,null,null,null,null,null,null,null,null,20,{"$f":"IF(AND(K22=0,L22=0),\"\",IF(K22>L22,I20,I23))","v":""},null,null,null,null,null,null,null,null,null,null,null,null,null,null,null,null,null,null,null,null,null,null,null,null,null,null,null,null,null,null,null,null,null,null,null,null,null,null,null,null,null,null,null,null,null,null,null,null,null,null,null,null,null,null,null,null,null,null,null,null,null,null,null,null,null,16,null,null,null,null,{"$f":"B46","v":{"$error":"#REF!"}},{"$f":"B48","v":{"$error":"#REF!"}}]
[15,{"$f":"IF(#REF!=2,Eleme!#REF!,IF(#REF!=3,Eleme!#REF!,IF(#REF!=4,Eleme!#REF!,IF(#REF!=5,Eleme!#REF!))))","v":{"$error":"#REF!"}},null,null,null,null,null,null,null,null,{"$f":"CU25","v":0},{"$f":"CV25","v":0},"Y-4",null,null,null,null,null,null,null,null,null,null,null,null,null,null,null,null,null,null,null,null,null,null,null,null,null,null,null,null,null,null,null,null,null,null,null,null,null,null,null,null,null,null,null,null,null,null,null,null,null,null,null,null,null,null,null,null,null,null,null,null,null,null,null,null,null,null,null,null,17,null,null,null,null,{"$f":"I2","v":""},{"$f":"I5","v":""}]
[null,null,null,{"$f":"CU13","v":0},{"$f":"CV13","v":0},null,null,8,{"$f":"IF(AND(D23=0,E23=0),\"\",IF(D23>E23,B22,B24))","v":""},null,null,null,null,null,null,null,null,null,null,null,null,null,null,null,null,null,null,null,null,null,null,null,null,null,null,null,null,null,null,null,null,null,null,null,null,null,null,null,null,null,null,null,null,null,null,null,null,null,null,null,null,null,null,null,null,null,null,null,null,null,null,null,null,null,null,null,null,null,null,null,null,18,null,null,null,null,{"$f":"I8","v":""},{"$f":"I11","v":""}]
[16,{"$f":"IF(#REF!=2,Eleme!#REF!,IF(#REF!=3,Eleme!#REF!,IF(#REF!=4,Eleme!#REF!,IF(#REF!=5,Eleme!#REF!))))","v":{"$error":"#REF!"}},null,null,null,null,null,null,null,null,null,null,null,null,null,null,null,null,null,null,null,null,null,null,null,null,null,null,null,null,null,null,null,null,null,null,null,null,null,null,null,null,null,null,null,null,null,null,null,null,null,null,null,null,null,null,null,null,null,null,null,null,null,null,null,null,null,null,null,null,null,null,null,null,null,null,null,null,null,null,null,19,null,null,null,null,{"$f":"I14","v":""},{"$f":"I17","v":""}]
[17,{"$f":"IF(#REF!=2,Eleme!#REF!,IF(#REF!=3,Eleme!#REF!,IF(#REF!=4,Eleme!#REF!,IF(#REF!=5,Eleme!#REF!))))","v":{"$error":"#REF!"}},null,null,null,null,null,null,null,null,null,null,null,null,null,{"$f":"IF(AND(K22=0,L22=0),\"\",IF(K22<L22,I20,I23))","v":""},null,null,null,null,null,null,null,null,null,null,null,null,null,null,null,{"$f":"CU46","v":0},{"$f":"CV46","v":0},"Y-25",null,null,{"$f":"IF(AND(AF25=0,AG25=0),\"\",IF(AF25>AG25,AD13,AD38))","v":""},null,null,null,null,null,null,"1.",null,null,null,null,null,null,null,null,null,null,null,null,null,null,null,null,null,null,null,null,null,null,null,null,null,null,null,null,null,null,null,null,null,null,null,null,null,20,null,null,null,null,{"$f":"I20","v":""},{"$f":"I23","v":""}]
[null,null,null,{"$f":"CU14","v":0},{"$f":"CV14","v":0},null,null,9,{"$f":"IF(AND(D26=0,E26=0),\"\",IF(D26>E26,B25,B27))","v":""},null,null,null,null,null,null,null,null,null,null,null,null,null,null,null,null,null,null,null,null,null,null,null,null,null,null,null,null,null,null,null,null,null,null,null,null,null,null,null,null,null,null,null,null,null,null,null,null,null,null,null,null,null,null,null,null,null,null,null,null,null,null,null,null,null,null,null,null,null,null,null,null,21,null,null,null,null,{"$f":"I26","v":""},{"$f":"I29","v":""}]
[18,{"$f":"IF(#REF!=2,Eleme!#REF!,IF(#REF!=3,Eleme!#REF!,IF(#REF!=4,Eleme!#REF!,IF(#REF!=5,Eleme!#REF!))))","v":{"$error":"#REF!"}},null,null,null,null,null,null,null,null,null,null,null,null,21,null,null,null,null,null,null,null,null,null,null,null,null,null,null,null,null,null,null,null,null,null,null,null,null,null,null,null,null,null,null,null,null,null,null,null,null,null,null,null,null,null,null,null,null,null,null,null,null,null,null,null,null,null,null,null,null,null,null,null,null,null,null,null,null,null,null,22,null,null,null,null,{"$f":"I32","v":""},{"$f":"I35","v":""}]
[19,{"$f":"IF(#REF!=2,Eleme!#REF!,IF(#REF!=3,Eleme!#REF!,IF(#REF!=4,Eleme!#REF!,IF(#REF!=5,Eleme!#REF!))))","v":{"$error":"#REF!"}},null,null,null,null,null,null,null,null,{"$f":"CU26","v":0},{"$f":"CV26","v":0},"Y-5",null,null,{"$f":"IF(AND(K28=0,L28=0),\"\",IF(K28>L28,I26,I29))","v":""},null,null,null,null,null,null,null,null,null,null,null,null,null,null,null,null,null,null,null,null,null,null,null,null,null,null,null,null,null,null,null,null,null,null,null,null,null,null,null,null,null,null,null,null,null,null,null,null,null,null,null,null,null,null,null,null,null,null,null,null,null,null,null,null,null,23,null,null,null,null,{"$f":"I38","v":""},{"$f":"I41","v":""}]
[null,null,null,{"$f":"CU15","v":0},{"$f":"CV15","v":0},null,null,10,{"$f":"IF(AND(D29=0,E29=0),\"\",IF(D29>E29,B28,B30))","v":""},null,null,null,null,null,null,null,null,null,null,null,null,27,null,null,null,null,null,null,null,null,null,null,null,null,null,null,null,null,null,null,null,null,null,null,null,null,null,null,null,null,null,null,null,null,null,null,null,null,null,null,null,null,null,null,null,null,null,null,null,null,null,null,null,null,null,null,null,null,null,null,null,24,null,null,null,null,{"$f":"I44","v":""},{"$f":"I47","v":""}]
[20,{"$f":"IF(#REF!=2,Eleme!#REF!,IF(#REF!=3,Eleme!#REF!,IF(#REF!=4,Eleme!#REF!,IF(#REF!=5,Eleme!#REF!))))","v":{"$error":"#REF!"}},null,null,null,null,null,null,null,null,null,null,null,null,null,null,null,null,null,null,null,null,null,null,null,null,null,null,null,null,null,null,null,null,null,null,null,null,null,null,null,null,null,null,null,null,null,null,null,null,null,null,null,null,null,null,null,null,null,null,null,null,null,null,null,null,null,null,null,null,null,null,null,null,null,null,null,null,null,null,null,25,null,null,null,null,{"$f":"P4","v":""},{"$f":"P9","v":""}]
[21,{"$f":"IF(#REF!=2,Eleme!#REF!,IF(#REF!=3,Eleme!#REF!,IF(#REF!=4,Eleme!#REF!,IF(#REF!=5,Eleme!#REF!))))","v":{"$error":"#REF!"}},null,null,null,null,null,null,null,null,null,null,null,null,null,null,null,{"$f":"CU32","v":0},{"$f":"CV32","v":0},"Y-11",null,null,null,null,null,null,null,null,null,null,null,null,null,null,null,null,null,null,null,null,null,null,null,null,null,null,null,null,null,null,null,null,null,null,null,null,null,null,null,null,null,null,null,null,null,null,null,null,null,null,null,null,null,null,null,null,null,null,null,null,null,26,null,null,null,null,{"$f":"P16","v":""},{"$f":"P21","v":""}]
[null,null,null,{"$f":"CU16","v":0},{"$f":"CV16","v":0},null,null,11,{"$f":"IF(AND(D32=0,E32=0),\"\",IF(D32>E32,B31,B33))","v":""},null,null,null,null,null,null,null,null,null,null,null,null,null,{"$f":"IF(AND(R31=0,S31=0),\"\",IF(R31>S31,P28,P33))","v":""},null,null,null,null,null,null,null,null,null,null,null,null,null,null,null,null,null,null,null,null,null,null,null,null,null,null,null,null,null,null,null,null,null,null,null,null,null,null,null,null,null,null,null,null,null,null,null,null,null,null,null,null,null,null,null,null,null,null,27,null,null,null,null,{"$f":"P28","v":""},{"$f":"P33","v":""}]
[22,{"$f":"IF(#REF!=2,Eleme!#REF!,IF(#REF!=3,Eleme!#REF!,IF(#REF!=4,Eleme!#REF!,IF(#REF!=5,Eleme!#REF!))))","v":{"$error":"#REF!"}},null,null,null,null,null,null,null,null,null,null,null,null,22,{"$f":"IF(AND(K34=0,L34=0),\"\",IF(K34>L34,I32,I35))","v":""},null,null,null,null,null,null,null,null,null,null,null,null,34,null,null,null,null,null,null,null,null,null,null,null,null,null,null,null,null,null,null,null,null,null,null,null,null,null,null,null,null,null,null,null,null,null,null,null,null,null,null,null,null,null,null,null,null,null,null,null,null,null,null,null,null,28,null,null,null,null,{"$f":"P40","v":""},{"$f":"P45","v":""}]
[23,{"$f":"IF(#REF!=2,Eleme!#REF!,IF(#REF!=3,Eleme!#REF!,IF(#REF!=4,Eleme!#REF!,IF(#REF!=5,Eleme!#REF!))))","v":{"$error":"#REF!"}},null,null,null,null,null,null,null,null,{"$f":"CU27","v":0},{"$f":"CV27","v":0},"Y-6",null,null,null,null,null,null,null,null,null,null,null,null,null,null,null,null,null,null,null,null,null,null,null,null,null,null,null,null,null,null,null,null,null,null,null,null,null,null,null,null,null,null,null,null,null,null,null,null,null,null,null,null,null,null,null,null,null,null,null,null,null,null,null,null,null,null,null,null,29,null,null,null,null,{"$f":"P59","v":""},{"$f":"P61","v":""}]
[null,null,null,{"$f":"CU17","v":0},{"$f":"CV17","v":0},null,null,12,{"$f":"IF(AND(D35=0,E35=0),\"\",IF(D35>E35,B34,B36))","v":""},null,null,null,null,null,null,null,null,null,null,null,null,null,null,null,null,null,null,null,null,null,null,null,null,null,null,null,null,null,null,null,null,null,null,null,null,null,null,null,null,null,null,null,null,null,null,null,null,null,null,null,null,null,null,null,null,null,null,null,null,null,null,null,null,null,null,null,null,null,null,null,null,30,null,null,null,null,{"$f":"P62","v":""},{"$f":"P64","v":""}]
[24,{"$f":"IF(#REF!=2,Eleme!#REF!,IF(#REF!=3,Eleme!#REF!,IF(#REF!=4,Eleme!#REF!,IF(#REF!=5,Eleme!#REF!))))","v":{"$error":"#REF!"}},null,null,null,null,null,null,null,null,null,null,null,null,null,null,null,null,null,null,null,null,null,null,null,null,null,null,null,null,null,null,null,null,null,null,null,null,null,null,null,null,null,null,null,null,null,null,null,null,null,null,null,null,null,null,null,null,null,null,null,null,null,null,null,null,null,null,null,null,null,null,null,null,null,null,null,null,null,null,null,31,null,null,null,null,{"$f":"P65","v":""},{"$f":"P67","v":""}]
[25,{"$f":"IF(#REF!=2,Eleme!#REF!,IF(#REF!=3,Eleme!#REF!,IF(#REF!=4,Eleme!#REF!,IF(#REF!=5,Eleme!#REF!))))","v":{"$error":"#REF!"}},null,null,null,null,null,null,null,null,null,null,null,null,null,null,null,null,null,null,null,null,null,null,null,null,null,null,null,null,null,null,null,null,null,null,null,null,null,null,null,null,null,null,null,null,null,null,null,null,null,null,null,null,null,null,null,null,null,null,null,null,null,null,null,null,null,null,null,null,null,null,null,null,null,null,null,null,null,null,null,32,null,null,null,null,{"$f":"P68","v":""},{"$f":"P70","v":""}]
[null,null,null,{"$f":"CU18","v":0},{"$f":"CV18","v":0},null,null,13,{"$f":"IF(AND(D38=0,E38=0),\"\",IF(D38>E38,B37,B39))","v":""},null,null,null,null,null,null,null,null,null,null,null,null,null,null,null,{"$f":"CU39","v":0},{"$f":"CV39","v":0},"Y-18",null,null,{"$f":"IF(AND(Y38=0,Z38=0),\"\",IF(Y38>Z38,W32,W43))","v":""},null,null,null,null,null,null,null,null,null,null,null,null,null,null,null,null,null,null,null,null,null,null,null,null,null,null,null,null,null,null,null,null,null,null,null,null,null,null,null,null,null,null,null,null,null,null,null,null,null,null,null,33,null,null,null,null,{"$f":"W7","v":""},{"$f":"W18","v":""}]
[26,{"$f":"IF(#REF!=2,Eleme!#REF!,IF(#REF!=3,Eleme!#REF!,IF(#REF!=4,Eleme!#REF!,IF(#REF!=5,Eleme!#REF!))))","v":{"$error":"#REF!"}},null,null,null,null,null,null,null,null,null,null,null,null,23,null,null,null,null,null,null,null,null,null,null,null,null,null,null,null,null,null,null,null,null,null,null,null,null,null,null,null,null,null,null,null,null,null,null,null,null,null,null,null,null,null,null,null,null,null,null,null,null,null,null,null,null,null,null,null,null,null,null,null,null,null,null,null,null,null,null,34,null,null,null,null,{"$f":"W32","v":""},{"$f":"W43","v":""}]
[27,{"$f":"IF(#REF!=2,Eleme!#REF!,IF(#REF!=3,Eleme!#REF!,IF(#REF!=4,Eleme!#REF!,IF(#REF!=5,Eleme!#REF!))))","v":{"$error":"#REF!"}},null,null,null,null,null,null,null,null,{"$f":"CU28","v":0},{"$f":"CV28","v":0},"Y-7",null,null,{"$f":"IF(AND(K40=0,L40=0),\"\",IF(K40>L40,I38,I41))","v":""},null,null,null,null,null,null,null,null,null,null,null,null,null,null,null,null,null,null,null,25,{"$f":"IF(AND(AF25=0,AG25=0),\"\",IF(AF25<AG25,AD13,AD38))","v":""},null,null,null,null,null,null,"2.",null,null,null,null,null,null,null,null,null,null,null,null,null,null,null,null,null,null,null,null,null,null,null,null,null,null,null,null,null,null,null,null,null,null,null,null,null,35,null,null,null,null,{"$f":"W49","v":""},{"$f":"W51","v":""}]
[null,null,null,{"$f":"CU19","v":0},{"$f":"CV19","v":0},null,null,14,{"$f":"IF(AND(D41=0,E41=0),\"\",IF(D41>E41,B40,B42))","v":""},null,null,null,null,null,null,null,null,null,null,null,null,28,null,null,null,null,null,null,null,null,null,null,null,null,null,null,null,null,null,null,null,null,null,null,null,null,null,null,null,null,null,null,null,null,null,null,null,null,null,null,null,null,null,null,null,null,null,null,null,null,null,null,null,null,null,null,null,null,null,null,null,36,null,null,null,null,{"$f":"W53","v":""},{"$f":"W55","v":""}]
[28,{"$f":"IF(#REF!=2,Eleme!#REF!,IF(#REF!=3,Eleme!#REF!,IF(#REF!=4,Eleme!#REF!,IF(#REF!=5,Eleme!#REF!))))","v":{"$error":"#REF!"}},null,null,null,null,null,null,null,null,null,null,null,null,null,null,null,null,null,null,null,null,null,null,null,null,null,null,null,null,null,null,null,null,null,null,null,null,null,null,null,null,null,null,null,null,null,null,null,null,null,null,null,null,null,null,null,null,null,null,null,null,null,null,null,null,null,null,null,null,null,null,null,null,null,null,null,null,null,null,null,37,null,null,null,null,{"$f":"W60","v":""},{"$f":"W63","v":""}]
[29,{"$f":"IF(#REF!=2,Eleme!#REF!,IF(#REF!=3,Eleme!#REF!,IF(#REF!=4,Eleme!#REF!,IF(#REF!=5,Eleme!#REF!))))","v":{"$error":"#REF!"}},null,null,null,null,null,null,null,null,null,null,null,null,null,null,null,{"$f":"CU33","v":0},{"$f":"CV33","v":0},"Y-12",null,null,{"$f":"IF(AND(R43=0,S43=0),\"\",IF(R43>S43,P40,P45))","v":""},null,null,null,null,null,null,null,null,null,null,null,null,null,null,null,null,null,null,null,null,null,null,null,null,null,null,null,null,null,null,null,null,null,null,null,null,null,null,null,null,null,null,null,null,null,null,null,null,null,null,null,null,null,null,null,null,null,null,38,null,null,null,null,{"$f":"W66","v":""},{"$f":"W69","v":""}]
[null,null,null,{"$f":"CU20","v":0},{"$f":"CV20","v":0},null,null,15,{"$f":"IF(AND(D44=0,E44=0),\"\",IF(D44>E44,B43,B45))","v":""},null,null,null,null,null,null,null,null,null,null,null,null,null,null,null,null,null,null,null,null,null,null,null,null,null,null,null,null,null,null,null,null,null,null,null,null,null,null,null,null,null,null,null,null,null,null,null,null,null,null,null,null,null,null,null,null,null,null,null,null,null,null,null,null,null,null,null,null,null,null,null,null,39,null,null,null,null,{"$f":"W74","v":""},{"$f":"W76","v":""}]
[30,{"$f":"IF(#REF!=2,Eleme!#REF!,IF(#REF!=3,Eleme!#REF!,IF(#REF!=4,Eleme!#REF!,IF(#REF!=5,Eleme!#REF!))))","v":{"$error":"#REF!"}},null,null,null,null,null,null,null,null,null,null,null,null,24,{"$f":"IF(AND(K46=0,L46=0),\"\",IF(K46>L46,I44,I47))","v":""},null,null,null,null,null,null,null,null,null,null,null,null,null,null,null,null,null,null,null,null,null,null,null,null,null,null,null,null,null,null,null,null,null,null,null,null,null,null,null,null,null,null,null,null,null,null,null,null,null,null,null,null,null,null,null,null,null,null,null,null,null,null,null,null,null,40,null,null,null,null,{"$f":"W78","v":""},{"$f":"W80","v":""}]
[31,{"$f":"IF(#REF!=2,Eleme!#REF!,IF(#REF!=3,Eleme!#REF!,IF(#REF!=4,Eleme!#REF!,IF(#REF!=5,Eleme!#REF!))))","v":{"$error":"#REF!"}},null,null,null,null,null,null,null,null,{"$f":"CU29","v":0},{"$f":"CV29","v":0},"Y-8",null,null,null,null,null,null,null,null,null,null,null,null,null,null,null,17,{"$f":"IF(AND(Y13=0,Z13=0),\"\",IF(Y13<Z13,W7,W18))","v":""},null,null,null,null,null,null,null,null,null,null,null,null,null,null,null,null,null,null,null,null,null,null,null,null,null,null,null,null,null,null,null,null,null,null,null,null,null,null,null,null,null,null,null,null,null,null,null,null,null,null,null,41,null,null,null,null,{"$f":"AD13","v":""},{"$f":"AD38","v":""}]
[null,null,null,{"$f":"CU21","v":0},{"$f":"CV21","v":0},null,null,16,{"$f":"IF(AND(D47=0,E47=0),\"\",IF(D47>E47,B46,B48))","v":""},null,null,null,null,null,null,null,null,null,null,null,null,null,null,null,null,null,null,null,null,null,null,{"$f":"CU47","v":0},{"$f":"+CV47","v":0},"Y-26",null,42,{"$f":"IF(AND(AF47=0,AG47=0),\"\",IF(AF47>AG47,AD46,AD48))","v":""},null,null,null,null,null,null,"3.",null,null,null,null,null,null,null,null,null,null,null,null,null,null,null,null,null,null,null,null,null,null,null,null,null,null,null,null,null,null,null,null,null,null,null,null,null,42,null,null,null,null,{"$f":"AD46","v":""},{"$f":"AD48","v":""}]
[32,{"$f":"IF(#REF!=2,Eleme!#REF!,IF(#REF!=3,Eleme!#REF!,IF(#REF!=4,Eleme!#REF!,IF(#REF!=5,Eleme!#REF!))))","v":{"$error":"#REF!"}},null,null,null,null,null,null,null,null,null,null,null,null,null,null,null,null,null,null,null,null,null,null,null,null,null,null,18,{"$f":"IF(AND(Y38=0,Z38=0),\"\",IF(Y38<Z38,W32,W43))","v":""},null,null,null,null,null,null,null,null,null,null,null,null,null,null,null,null,null,null,null,null,null,null,null,null,null,null,null,null,null,null,null,null,null,null,null,null,null,null,null,null,null,null,null,null,null,null,null,null,null,null,null,43,null,null,null,null,{"$f":"AD50","v":""},{"$f":"AD54","v":""}]
[null,null,null,null,null,null,null,null,null,null,null,null,null,null,null,null,null,null,null,null,null,9,{"$f":"IF(AND(R7=0,S7=0),\"\",IF(R7<S7,P4,P9))","v":""},null,null,null,null,null,null,null,null,null,null,null,null,26,{"$f":"IF(AND(AF47=0,AG47=0),\"\",IF(AF47<AG47,AD46,AD48))","v":""},null,null,null,null,null,null,"4.",null,null,null,null,null,null,null,null,null,null,null,null,null,null,null,null,null,null,null,null,null,null,null,null,null,null,null,null,null,null,null,null,null,null,null,null,null,44,null,null,null,null,{"$f":"AD56","v":""},{"$f":"AD58","v":""}]
[null,null,null,null,null,null,null,null,null,null,null,null,null,null,null,null,null,null,null,null,null,null,null,null,{"$f":"CU40","v":0},{"$f":"+CV40","v":0},"Y-19",null,35,{"$f":"IF(AND(Y50=0,Z50=0),\"\",IF(Y50>Z50,W49,W51))","v":""},null,null,null,null,null,null,null,null,null,null,null,null,null,null,null,null,null,null,null,null,null,null,null,null,null,null,null,null,null,null,null,null,null,null,null,null,null,null,null,null,null,null,null,null,null,null,null,null,null,null,null,45,null,null,null,null,{"$f":"AD62","v":""},{"$f":"AD67","v":""}]
[null,null,null,null,null,null,null,null,null,null,null,null,null,null,null,null,null,null,null,null,null,10,{"$f":"IF(AND(R19=0,S19=0),\"\",IF(R19<S19,P16,P21))","v":""},null,null,null,null,null,null,null,null,null,null,null,null,43,null,null,null,null,null,null,null,null,null,null,null,null,null,null,null,null,null,null,null,null,null,null,null,null,null,null,null,null,null,null,null,null,null,null,null,null,null,null,null,null,null,null,null,null,null,46,null,null,null,null,{"$f":"AD71","v":""},{"$f":"AD73","v":""}]
[null,null,null,null,null,null,null,null,null,null,null,null,null,null,null,null,null,null,null,null,null,null,null,null,null,null,null,null,null,null,null,{"$f":"CU48","v":0},{"$f":"+CV48","v":0},"Y-27",null,null,{"$f":"IF(AND(AF52=0,AG52=0),\"\",IF(AF52>AG52,AD50,AD54))","v":""},null,null,null,null,null,null,"5.",null,null,null,null,null,null,null,null,null,null,null,null,null,null,null,null,null,null,null,null,null,null,null,null,null,null,null,null,null,null,null,null,null,null,null,null,null,47,null,null,null,null,{"$f":"AD75","v":""},{"$f":"AD79","v":""}]
[null,null,null,null,null,null,null,null,null,null,null,null,null,null,null,null,null,null,null,null,null,11,{"$f":"IF(AND(R31=0,S31=0),\"\",IF(R31<S31,P28,P33))","v":""},null,null,null,null,null,null,null,null,null,null,null,null,null,null,null,null,null,null,null,null,null,null,null,null,null,null,null,null,null,null,null,null,null,null,null,null,null,null,null,null,null,null,null,null,null,null,null,null,null,null,null,null,null,null,null,null,null,null,48,null,null,null,null,{"$f":"AD81","v":""},{"$f":"AD83","v":""}]
[null,null,null,null,null,null,null,null,null,null,null,null,null,null,null,null,null,null,null,null,null,null,null,null,{"$f":"CU41","v":0},{"$f":"+CV41","v":0},"Y-20",null,36,{"$f":"IF(AND(Y54=0,Z54=0),\"\",IF(Y54>Z54,W53,W55))","v":""}]
[null,null,null,null,null,null,null,null,null,null,null,null,null,null,null,null,null,null,null,null,null,12,{"$f":"IF(AND(R43=0,S43=0),\"\",IF(R43<S43,P40,P45))","v":""},null,null,null,null,null,null,null,null,null,null,null,null,27,{"$f":"IF(AND(AF52=0,AG52=0),\"\",IF(AF52<AG52,AD50,AD54))","v":""},null,null,null,null,null,null,"6."]
[null,null,null,null,null,null,null,null,null,null,null,null,null,null,null,null,null,null,null,null,null,null,null,null,null,null,null,null,19,{"$f":"IF(AND(Y50=0,Z50=0),\"\",IF(Y50<Z50,W49,W51))","v":""}]
[null,null,null,null,null,null,null,null,null,null,null,null,null,null,null,null,null,null,null,null,null,null,null,null,null,null,null,null,null,null,null,{"$f":"CU49","v":0},{"$f":"+CV49","v":0},"Y-28",null,44,{"$f":"IF(AND(AF57=0,AG57=0),\"\",IF(AF57>AG57,AD56,AD58))","v":""},null,null,null,null,null,null,"7."]
[null,null,null,null,null,null,null,null,null,null,null,null,null,null,null,null,null,null,null,null,null,null,null,null,null,null,null,null,20,{"$f":"IF(AND(Y54=0,Z54=0),\"\",IF(Y54<Z54,W53,W55))","v":""}]
[null,null,null,null,null,null,null,null,null,null,null,null,null,null,1,{"$f":"IF(AND(K4=0,L4=0),\"\",IF(K4<L4,I2,I5))","v":""},null,null,null,null,null,null,null,null,null,null,null,null,null,null,null,null,null,null,null,28,{"$f":"IF(AND(AF57=0,AG57=0),\"\",IF(AF57<AG57,AD56,AD58))","v":""},null,null,null,null,null,null,"8."]
[null,null,null,null,null,null,null,null,null,null,null,null,null,null,null,null,null,{"$f":"CU34","v":0},{"$f":"CV34","v":0},"Y-13",null,29,{"$f":"IF(AND(R60=0,S60=0),\"\",IF(R60>S60,P59,P61))","v":""}]
[null,null,null,null,null,null,null,null,null,null,null,null,null,null,2,{"$f":"IF(AND(K10=0,L10=0),\"\",IF(K10<L10,I8,I11))","v":""},null,null,null,null,null,null,null,null,null,null,null,null,37]
[null,null,null,null,null,null,null,null,null,null,null,null,null,null,3,{"$f":"IF(AND(K16=0,L16=0),\"\",IF(K16<L16,I14,I17))","v":""},null,null,null,null,null,null,null,null,{"$f":"CU42","v":0},{"$f":"CV42","v":0},"Y-21",null,null,{"$f":"IF(AND(Y62=0,Z62=0),\"\",IF(Y62>Z62,W60,W63))","v":""}]
[null,null,null,null,null,null,null,null,null,null,null,null,null,null,null,null,null,{"$f":"CU35","v":0},{"$f":"CV35","v":0},"Y-14",null,30,{"$f":"IF(AND(R63=0,S63=0),\"\",IF(R63>S63,P62,P64))","v":""},null,null,null,null,null,null,null,null,null,null,null,null,45]
[null,null,null,null,null,null,null,null,null,null,null,null,null,null,4,{"$f":"IF(AND(K22=0,L22=0),\"\",IF(K22<L22,I20,I23))","v":""}]
[null,null,null,null,null,null,null,null,null,null,null,null,null,null,5,{"$f":"IF(AND(K28=0,L28=0),\"\",IF(K28<L28,I26,I29))","v":""},null,null,null,null,null,null,null,null,null,null,null,null,null,null,null,{"$f":"CU50","v":0},{"$f":"+CV50","v":0},"Y-29",null,null,{"$f":"IF(AND(AF65=0,AG65=0),\"\",IF(AF65>AG65,AD62,AD67))","v":""},null,null,null,null,null,null,"9."]
[null,null,null,null,null,null,null,null,null,null,null,null,null,null,null,null,null,{"$f":"CU36","v":0},{"$f":"CV36","v":0},"Y-15",null,31,{"$f":"IF(AND(R66=0,S66=0),\"\",IF(R66>S66,P65,P67))","v":""}]
[null,null,null,null,null,null,null,null,null,null,null,null,null,null,6,{"$f":"IF(AND(K34=0,L34=0),\"\",IF(K34<L34,I32,I35))","v":""},null,null,null,null,null,null,null,null,null,null,null,null,38,{"$f":"IF(AND(Y68=0,Z68=0),\"\",IF(Y68>Z68,W66,W69))","v":""}]
[null,null,null,null,null,null,null,null,null,null,null,null,null,null,7,{"$f":"IF(AND(K40=0,L40=0),\"\",IF(K40<L40,I38,I41))","v":""},null,null,null,null,null,null,null,null,{"$f":"CU43","v":0},{"$f":"CV43","v":0},"Y-22",null,null,null,null,null,null,null,null,29,{"$f":"IF(AND(AF65=0,AG65=0),\"\",IF(AF65<AG65,AD62,AD67))","v":""},null,null,null,null,null,null,"10."]
[null,null,null,null,null,null,null,null,null,null,null,null,null,null,null,null,null,{"$f":"CU37","v":0},{"$f":"CV37","v":0},"Y-16",null,32,{"$f":"IF(AND(R69=0,S69=0),\"\",IF(R69>S69,P68,P70))","v":""}]
[null,null,null,null,null,null,null,null,null,null,null,null,null,null,8,{"$f":"IF(AND(K46=0,L46=0),\"\",IF(K46<L46,I44,I47))","v":""}]
[null,null,null,null,null,null,null,null,null,null,null,null,null,null,null,null,null,null,null,null,null,null,null,null,null,null,null,null,21,{"$f":"IF(AND(Y62=0,Z62=0),\"\",IF(Y62<Z62,W60,W63))","v":""}]
[null,null,null,null,null,null,null,null,null,null,null,null,null,null,null,null,null,null,null,null,null,null,null,null,null,null,null,null,null,null,null,{"$f":"CU51","v":0},{"$f":"+CV51","v":0},"Y-30",null,46,{"$f":"IF(AND(AF72=0,AG72=0),\"\",IF(AF72>AG72,AD71,AD73))","v":""},null,null,null,null,null,null,"11."]
[null,null,null,null,null,null,null,null,null,null,null,null,null,null,null,null,null,null,null,null,null,null,null,null,null,null,null,null,22,{"$f":"IF(AND(Y68=0,Z68=0),\"\",IF(Y68<Z68,W66,W69))","v":""}]
[null,null,null,null,null,null,null,null,null,null,null,null,null,null,null,null,null,null,null,null,null,13,{"$f":"IF(AND(R60=0,S60=0),\"\",IF(R60<S60,P59,P61))","v":""},null,null,null,null,null,null,null,null,null,null,null,null,30,{"$f":"IF(AND(AF72=0,AG72=0),\"\",IF(AF72<AG72,AD71,AD73))","v":""},null,null,null,null,null,null,"12."]
[null,null,null,null,null,null,null,null,null,null,null,null,null,null,null,null,null,null,null,null,null,null,null,null,{"$f":"CU44","v":0},{"$f":"+CV44","v":0},"Y-23",null,39,{"$f":"IF(AND(Y75=0,Z75=0),\"\",IF(Y75>Z75,W74,W76))","v":""}]
[null,null,null,null,null,null,null,null,null,null,null,null,null,null,null,null,null,null,null,null,null,14,{"$f":"IF(AND(R63=0,S63=0),\"\",IF(R63<S63,P62,P64))","v":""},null,null,null,null,null,null,null,null,null,null,null,null,47]
[null,null,null,null,null,null,null,null,null,null,null,null,null,null,null,null,null,null,null,null,null,null,null,null,null,null,null,null,null,null,null,{"$f":"CU52","v":0},{"$f":"+CV52","v":0},"Y-31",null,null,{"$f":"IF(AND(AF77=0,AG77=0),\"\",IF(AF77>AG77,AD75,AD79))","v":""},null,null,null,null,null,null,"13."]
[null,null,null,null,null,null,null,null,null,null,null,null,null,null,null,null,null,null,null,null,null,15,{"$f":"IF(AND(R66=0,S66=0),\"\",IF(R66<S66,P65,P67))","v":""}]
[null,null,null,null,null,null,null,null,null,null,null,null,null,null,null,null,null,null,null,null,null,null,null,null,{"$f":"CU45","v":0},{"$f":"+CV45","v":0},"Y-24",null,40,{"$f":"IF(AND(Y79=0,Z79=0),\"\",IF(Y79>Z79,W78,W80))","v":""}]
[null,null,null,null,null,null,null,null,null,null,null,null,null,null,null,null,null,null,null,null,null,16,{"$f":"IF(AND(R69=0,S69=0),\"\",IF(R69<S69,P68,P70))","v":""},null,null,null,null,null,null,null,null,null,null,null,null,31,{"$f":"IF(AND(AF77=0,AG77=0),\"\",IF(AF77<AG77,AD75,AD79))","v":""},null,null,null,null,null,null,"14."]
[null,null,null,null,null,null,null,null,null,null,null,null,null,null,null,null,null,null,null,null,null,null,null,null,null,null,null,null,23,{"$f":"IF(AND(Y75=0,Z75=0),\"\",IF(Y75<Z75,W74,W76))","v":""}]
[null,null,null,null,null,null,null,null,null,null,null,null,null,null,null,null,null,null,null,null,null,null,null,null,null,null,null,null,null,null,null,{"$f":"CU53","v":0},{"$f":"+CV53","v":0},"Y-32",null,48,{"$f":"IF(AND(AF82=0,AG82=0),\"\",IF(AF82>AG82,AD81,AD83))","v":""},null,null,null,null,null,null,"15."]
[null,null,null,null,null,null,null,null,null,null,null,null,null,null,null,null,null,null,null,null,null,null,null,null,null,null,null,null,24,{"$f":"IF(AND(Y79=0,Z79=0),\"\",IF(Y79<Z79,W78,W80))","v":""}]
[null,null,null,null,null,null,null,null,null,null,null,null,null,null,null,null,null,null,null,null,null,null,null,null,null,null,null,null,null,null,null,null,null,null,null,32,{"$f":"IF(AND(AF82=0,AG82=0),\"\",IF(AF82<AG82,AD81,AD83))","v":""},null,null,null,null,null,null,"16"]

{"sheet":"16","index":7,"n_rows":63,"n_cols":1217,"rows_kept":63,"cut":false,"hidden":true,"merged":[[61,22,61,28],[62,29,62,35],[56,15,56,21],[57,22,57,28],[58,15,58,21],[58,29,58,35],[59,22,59,28],[60,29,60,35],[55,29,55,35],[46,8,46,14],[46,29,46,35],[47,15,47,21],[48,8,48,14],[49,22,49,28],[50,29,50,35],[51,22,51,28],[52,15,52,21],[52,29,52,35],[53,22,53,28],[54,15,54,21],[45,8,45,14],[45,22,45,28],[36,29,36,35],[37,8,37,14],[38,15,38,21],[39,8,39,14],[40,8,40,14],[40,22,40,28],[41,15,41,21],[42,8,42,14],[43,8,43,14],[43,29,43,35],[44,15,44,21],[35,22,35,28],[26,15,26,21],[26,29,26,35],[27,22,27,28],[28,15,28,21],[29,29,29,35],[30,15,30,21],[31,22,31,28],[32,15,32,21],[32,29,32,35],[33,22,33,28],[34,29,34,35],[25,22,25,28],[18,1,18,7],[18,22,18,28],[18,29,18,35],[19,8,19,14],[20,1,20,7],[20,15,20,21],[21,1,21,7],[22,8,22,14],[23,1,23,7],[23,22,23,28],[24,29,24,35],[17,22,17,28],[9,1,9,7],[10,8,10,14],[11,1,11,7],[12,1,12,7],[14,1,14,7],[15,1,15,7],[15,15,15,21],[16,8,16,14],[17,1,17,7],[12,29,12,35],[13,8,13,14],[5,1,5,7],[6,1,6,7],[6,22,6,28],[7,8,7,14],[8,1,8,7],[8,15,8,21],[1,81,1,82],[1,83,1,84],[1,85,1,86],[2,1,2,7],[3,1,3,7],[3,15,3,21],[3,23,4,36],[4,8,4,14],[1,79,1,80],[0,1,0,7],[0,23,2,36],[1,8,1,14],[1,75,1,76],[1,77,1,78]]}
[1,{"$f":"IF(#REF!=2,Eleme!#REF!,IF(#REF!=3,Eleme!#REF!,IF(#REF!=4,Eleme!#REF!,IF(#REF!=5,Eleme!#REF!,IF(#REF!=6,Eleme!#REF!)))))","v":{"$error":"#REF!"}},null,null,null,null,null,null,null,null,null,null,null,null,null,null,null,null,null,null,null,null,null,{"$f":"Katılım!AC1","v":"TÜRKİYE MASA TENİSİ FEDERASYONU\nKÜÇÜKLER KUZEYBATI BÖLGESİ YARIŞMALARI"},null,null,null,null,null,null,null,null,null,null,null,null,null,null,null,null,null,null,null,null,null,null,null,null,null,null,null,null,null,null,null,null,null,null,null,null,null,null,null,null,null,null,null,null,null,null,null,null,null,null,null,null,null,null,null,null,null,null,null,null,null,null,null,null,null,null,null,null,null,null,null,null,null,null,null,null,null,null,null,"1st Round",1]
[null,null,null,{"$f":"CH3","v":0},{"$f":"CI3","v":0},"Y1",null,1,{"$f":"IF(AND(D2=0,E2=0),\"\",IF(D2>E2,B1,B3))","v":""},null,null,null,null,null,null,null,null,null,null,null,null,null,null,null,null,null,null,null,null,null,null,null,null,null,null,null,null,null,null,null,null,null,null,null,null,null,null,null,null,null,null,null,null,null,null,null,null,null,null,null,null,null,null,null,null,null,null,null,"#","Date","Time","Table","Competition","Player A","Player B","Set1",null,"Set2",null,"Set3",null,"Set4",null,"Set5",null,"Result",null,null,null,null,null,null,null,null,null,null,null,null,null,null,null,null,null,"2sn Round"]
[2,{"$f":"IF(#REF!=2,Eleme!#REF!,IF(#REF!=3,Eleme!#REF!,IF(#REF!=4,Eleme!#REF!,IF(#REF!=5,Eleme!#REF!,IF(#REF!=6,Eleme!#REF!)))))","v":{"$error":"#REF!"}},null,null,null,null,null,null,null,null,null,null,null,null,9,null,null,null,null,null,null,null,null,null,null,null,null,null,null,null,null,null,null,null,null,null,null,null,null,null,null,null,null,null,null,null,null,null,null,null,null,null,null,null,null,null,null,null,null,null,null,null,null,null,null,null,null,null,1,null,null,null,null,{"$f":"B1","v":{"$error":"#REF!"}},{"$f":"B3","v":{"$error":"#REF!"}},null,null,null,null,null,null,null,null,null,null,null,null,null,null,null,null,null,null,null,null,null,null,null,null,null,null,null,null,"3th Round"]
[3,{"$f":"IF(#REF!=2,Eleme!#REF!,IF(#REF!=3,Eleme!#REF!,IF(#REF!=4,Eleme!#REF!,IF(#REF!=5,Eleme!#REF!,IF(#REF!=6,Eleme!#REF!)))))","v":{"$error":"#REF!"}},null,null,null,null,null,null,null,null,{"$f":"CH11","v":0},{"$f":"CI11","v":0},"Y-A",null,null,{"$f":"IF(AND(K4=0,L4=0),\"\",IF(K4>L4,I2,I5))","v":""},null,null,null,null,null,null,null,{"$f":"Katılım!AC2&\" \"&Katılım!AE3","v":"ERKEK TAKIM  [12-13 Mart 2025 KOCAELİ] [ Ana Tablo ]"},null,null,null,null,null,null,null,null,null,null,null,null,null,null,null,null,null,null,null,null,null,null,null,null,null,null,null,null,null,null,null,null,null,null,null,null,null,null,null,null,null,null,null,null,2,null,null,null,null,{"$f":"B4","v":{"$error":"#REF!"}},{"$f":"B6","v":{"$error":"#REF!"}},null,null,null,null,null,null,null,null,null,null,null,null,null,null,null,null,null,null,null,null,null,null,null,null,null,null,null,null,"4th Round"]
[null,null,null,{"$f":"CH4","v":0},{"$f":"CI4","v":0},"Y2",null,2,{"$f":"IF(AND(D5=0,E5=0),\"\",IF(D5>E5,B4,B6))","v":""},null,null,null,null,null,null,null,null,null,null,null,null,17,null,null,null,null,null,null,null,null,null,null,null,null,null,null,null,null,null,null,null,null,null,null,null,null,null,null,null,null,null,null,null,null,null,null,null,null,null,null,null,null,null,null,null,null,null,null,3,null,null,null,null,{"$f":"B7","v":{"$error":"#REF!"}},{"$f":"B9","v":{"$error":"#REF!"}}]
[4,{"$f":"IF(#REF!=2,Eleme!#REF!,IF(#REF!=3,Eleme!#REF!,IF(#REF!=4,Eleme!#REF!,IF(#REF!=5,Eleme!#REF!,IF(#REF!=6,Eleme!#REF!)))))","v":{"$error":"#REF!"}},null,null,null,null,null,null,null,null,null,null,null,null,null,null,null,null,null,null,null,null,null,null,null,null,null,null,null,null,null,null,null,null,null,null,null,null,null,null,null,null,null,null,null,null,null,null,null,null,null,null,null,null,null,null,null,null,null,null,null,null,null,null,null,null,null,null,4,null,null,null,null,{"$f":"B10","v":{"$error":"#REF!"}},{"$f":"B12","v":{"$error":"#REF!"}}]
[5,{"$f":"IF(#REF!=2,Eleme!#REF!,IF(#REF!=3,Eleme!#REF!,IF(#REF!=4,Eleme!#REF!,IF(#REF!=5,Eleme!#REF!,IF(#REF!=6,Eleme!#REF!)))))","v":{"$error":"#REF!"}},null,null,null,null,null,null,null,null,null,null,null,null,null,null,null,{"$f":"CH19","v":0},{"$f":"CI19","v":0},"Y-E",null,null,{"$f":"IF(AND(R7=0,S7=0),\"\",IF(R7>S7,P4,P9))","v":""},null,null,null,null,null,null,null,null,null,null,null,null,null,null,null,null,null,null,null,null,null,null,null,null,null,null,null,null,null,null,null,null,null,null,null,null,null,null,null,null,null,null,null,null,null,5,null,null,null,null,{"$f":"B13","v":{"$error":"#REF!"}},{"$f":"B15","v":{"$error":"#REF!"}}]
[null,null,null,{"$f":"CH5","v":0},{"$f":"CI5","v":0},"Y3",null,3,{"$f":"IF(AND(D8=0,E8=0),\"\",IF(D8>E8,B7,B9))","v":""},null,null,null,null,null,null,null,null,null,null,null,null,null,null,null,null,null,null,null,25,null,null,null,null,null,null,null,null,null,null,null,null,null,null,null,null,null,null,null,null,null,null,null,null,null,null,null,null,null,null,null,null,null,null,null,null,null,null,null,6,null,null,null,null,{"$f":"B16","v":{"$error":"#REF!"}},{"$f":"B18","v":{"$error":"#REF!"}}]
[6,{"$f":"IF(#REF!=2,Eleme!#REF!,IF(#REF!=3,Eleme!#REF!,IF(#REF!=4,Eleme!#REF!,IF(#REF!=5,Eleme!#REF!,IF(#REF!=6,Eleme!#REF!)))))","v":{"$error":"#REF!"}},null,null,null,null,null,null,null,null,null,null,null,null,10,{"$f":"IF(AND(K10=0,L10=0),\"\",IF(K10>L10,I8,I11))","v":""},null,null,null,null,null,null,null,null,null,null,null,null,null,null,null,null,null,null,null,null,null,null,null,null,null,null,null,null,null,null,null,null,null,null,null,null,null,null,null,null,null,null,null,null,null,null,null,null,null,null,null,null,7,null,null,null,null,{"$f":"B19","v":{"$error":"#REF!"}},{"$f":"B21","v":{"$error":"#REF!"}}]
[7,{"$f":"IF(#REF!=2,Eleme!#REF!,IF(#REF!=3,Eleme!#REF!,IF(#REF!=4,Eleme!#REF!,IF(#REF!=5,Eleme!#REF!,IF(#REF!=6,Eleme!#REF!)))))","v":{"$error":"#REF!"}},null,null,null,null,null,null,null,null,{"$f":"CH12","v":0},{"$f":"CI12","v":0},"Y-B",null,null,null,null,null,null,null,null,null,null,null,null,null,null,null,null,null,null,null,null,null,null,null,null,null,null,null,null,null,null,null,null,null,null,null,null,null,null,null,null,null,null,null,null,null,null,null,null,null,null,null,null,null,null,null,8,null,null,null,null,{"$f":"B22","v":{"$error":"#REF!"}},{"$f":"B24","v":{"$error":"#REF!"}}]
[null,null,null,{"$f":"CH6","v":0},{"$f":"CI6","v":0},"Y4",null,4,{"$f":"IF(AND(D11=0,E11=0),\"\",IF(D11>E11,B10,B12))","v":""},null,null,null,null,null,null,null,null,null,null,null,null,null,null,null,null,null,null,null,null,null,null,null,null,null,null,null,null,null,null,null,null,null,null,null,null,null,null,null,null,null,null,null,null,null,null,null,null,null,null,null,null,null,null,null,null,null,null,null,9,null,null,null,null,{"$f":"I2","v":""},{"$f":"I5","v":""}]
[8,{"$f":"IF(#REF!=2,Eleme!#REF!,IF(#REF!=3,Eleme!#REF!,IF(#REF!=4,Eleme!#REF!,IF(#REF!=5,Eleme!#REF!,IF(#REF!=6,Eleme!#REF!)))))","v":{"$error":"#REF!"}},null,null,null,null,null,null,null,null,null,null,null,null,null,null,null,null,null,null,null,null,null,null,null,null,null,null,null,null,null,null,null,null,null,null,null,null,null,null,null,null,null,null,null,null,null,null,null,null,null,null,null,null,null,null,null,null,null,null,null,null,null,null,null,null,null,null,10,null,null,null,null,{"$f":"I8","v":""},{"$f":"I11","v":""}]
[9,{"$f":"IF(#REF!=2,Eleme!#REF!,IF(#REF!=3,Eleme!#REF!,IF(#REF!=4,Eleme!#REF!,IF(#REF!=5,Eleme!#REF!,IF(#REF!=6,Eleme!#REF!)))))","v":{"$error":"#REF!"}},null,null,null,null,null,null,null,null,null,null,null,null,null,null,null,null,null,null,null,null,null,null,{"$f":"CH27","v":0},{"$f":"+CI27","v":0},"Y-I",null,null,{"$f":"IF(AND(Y13=0,Z13=0),\"\",IF(Y13>Z13,W7,W18))","v":""},null,null,null,null,null,null,"1.",null,null,null,null,null,null,null,null,null,null,null,null,null,null,null,null,null,null,null,null,null,null,null,null,null,null,null,null,null,null,null,11,null,null,null,null,{"$f":"I14","v":""},{"$f":"I17","v":""}]
[null,null,null,{"$f":"CH7","v":0},{"$f":"CI7","v":0},"Y5",null,5,{"$f":"IF(AND(D14=0,E14=0),\"\",IF(D14>E14,B13,B15))","v":""},null,null,null,null,null,null,null,null,null,null,null,null,null,null,null,null,null,null,null,null,null,null,null,null,null,null,null,null,null,null,null,null,null,null,null,null,null,null,null,null,null,null,null,null,null,null,null,null,null,null,null,null,null,null,null,null,null,null,null,12,null,null,null,null,{"$f":"I20","v":""},{"$f":"I23","v":""}]
[10,{"$f":"IF(#REF!=2,Eleme!#REF!,IF(#REF!=3,Eleme!#REF!,IF(#REF!=4,Eleme!#REF!,IF(#REF!=5,Eleme!#REF!,IF(#REF!=6,Eleme!#REF!)))))","v":{"$error":"#REF!"}},null,null,null,null,null,null,null,null,null,null,null,null,11,null,null,null,null,null,null,null,null,null,null,null,null,null,null,null,null,null,null,null,null,null,null,null,null,null,null,null,null,null,null,null,null,null,null,null,null,null,null,null,null,null,null,null,null,null,null,null,null,null,null,null,null,null,13,null,null,null,null,{"$f":"+I38","v":""},{"$f":"+I40","v":""}]
[11,{"$f":"IF(#REF!=2,Eleme!#REF!,IF(#REF!=3,Eleme!#REF!,IF(#REF!=4,Eleme!#REF!,IF(#REF!=5,Eleme!#REF!,IF(#REF!=6,Eleme!#REF!)))))","v":{"$error":"#REF!"}},null,null,null,null,null,null,null,null,{"$f":"CH13","v":0},{"$f":"CI13","v":0},"Y-C",null,null,{"$f":"IF(AND(K16=0,L16=0),\"\",IF(K16>L16,I14,I17))","v":""},null,null,null,null,null,null,null,null,null,null,null,null,null,null,null,null,null,null,null,null,null,null,null,null,null,null,null,null,null,null,null,null,null,null,null,null,null,null,null,null,null,null,null,null,null,null,null,null,null,null,null,null,14,null,null,null,null,{"$f":"+I41","v":""},{"$f":"+I43","v":""}]
[null,null,null,{"$f":"CH8","v":0},{"$f":"CI8","v":0},"Y6",null,6,{"$f":"IF(AND(D17=0,E17=0),\"\",IF(D17>E17,B16,B18))","v":""},null,null,null,null,null,null,null,null,null,null,null,null,18,null,null,null,null,null,null,null,null,null,null,null,null,null,null,null,null,null,null,null,null,null,null,null,null,null,null,null,null,null,null,null,null,null,null,null,null,null,null,null,null,null,null,null,null,null,null,15,null,null,null,null,{"$f":"+I44","v":""},{"$f":"+I46","v":""}]
[12,{"$f":"IF(#REF!=2,Eleme!#REF!,IF(#REF!=3,Eleme!#REF!,IF(#REF!=4,Eleme!#REF!,IF(#REF!=5,Eleme!#REF!,IF(#REF!=6,Eleme!#REF!)))))","v":{"$error":"#REF!"}},null,null,null,null,null,null,null,null,null,null,null,null,null,null,null,null,null,null,null,null,{"$f":"IF(AND(R19=0,S19=0),\"\",IF(R19>S19,P16,P21))","v":""},null,null,null,null,null,null,null,null,null,null,null,null,null,null,null,null,null,null,null,null,null,null,null,null,null,null,null,null,null,null,null,null,null,null,null,null,null,null,null,null,null,null,null,null,null,16,null,null,null,null,{"$f":"+I49","v":""},{"$f":"+I49","v":""}]
[13,{"$f":"IF(#REF!=2,Eleme!#REF!,IF(#REF!=3,Eleme!#REF!,IF(#REF!=4,Eleme!#REF!,IF(#REF!=5,Eleme!#REF!,IF(#REF!=6,Eleme!#REF!)))))","v":{"$error":"#REF!"}},null,null,null,null,null,null,null,null,null,null,null,null,null,null,null,{"$f":"CH20","v":0},{"$f":"CI20","v":0},"Y-F",null,null,null,null,null,null,null,null,null,{"$f":"IF(AND(Y13=0,Z13=0),\"\",IF(Y13<Z13,W7,W18))","v":""},null,null,null,null,null,null,"2.",null,null,null,null,null,null,null,null,null,null,null,null,null,null,null,null,null,null,null,null,null,null,null,null,null,null,null,null,null,null,null,17,null,null,null,null,{"$f":"P4","v":""},{"$f":"P9","v":""}]
[null,null,null,{"$f":"CH9","v":0},{"$f":"CI9","v":0},"Y7",null,7,{"$f":"IF(AND(D20=0,E20=0),\"\",IF(D20>E20,B19,B21))","v":""},null,null,null,null,null,null,null,null,null,null,null,null,null,null,null,null,null,null,null,null,null,null,null,null,null,null,null,null,null,null,null,null,null,null,null,null,null,null,null,null,null,null,null,null,null,null,null,null,null,null,null,null,null,null,null,null,null,null,null,18,null,null,null,null,{"$f":"P16","v":""},{"$f":"P21","v":""}]
[14,{"$f":"IF(#REF!=2,Eleme!#REF!,IF(#REF!=3,Eleme!#REF!,IF(#REF!=4,Eleme!#REF!,IF(#REF!=5,Eleme!#REF!,IF(#REF!=6,Eleme!#REF!)))))","v":{"$error":"#REF!"}},null,null,null,null,null,null,null,null,null,null,null,null,12,{"$f":"IF(AND(K22=0,L22=0),\"\",IF(K22>L22,I20,I23))","v":""},null,null,null,null,null,null,null,null,null,null,null,null,null,null,null,null,null,null,null,null,null,null,null,null,null,null,null,null,null,null,null,null,null,null,null,null,null,null,null,null,null,null,null,null,null,null,null,null,null,null,null,null,19,null,null,null,null,{"$f":"P27","v":""},{"$f":"P29","v":""}]
[15,{"$f":"IF(#REF!=2,Eleme!#REF!,IF(#REF!=3,Eleme!#REF!,IF(#REF!=4,Eleme!#REF!,IF(#REF!=5,Eleme!#REF!,IF(#REF!=6,Eleme!#REF!)))))","v":{"$error":"#REF!"}},null,null,null,null,null,null,null,null,{"$f":"CH14","v":0},{"$f":"CI14","v":0},"Y-D",null,null,null,null,null,null,null,null,null,null,null,null,null,null,null,null,null,null,null,null,null,null,null,null,null,null,null,null,null,null,null,null,null,null,null,null,null,null,null,null,null,null,null,null,null,null,null,null,null,null,null,null,null,null,null,20,null,null,null,null,{"$f":"P31","v":""},{"$f":"P33","v":""}]
[null,null,null,{"$f":"CH10","v":0},{"$f":"CI10","v":0},"Y8",null,8,{"$f":"IF(AND(D23=0,E23=0),\"\",IF(D23>E23,B22,B24))","v":""},null,null,null,null,null,null,null,null,null,null,null,null,null,null,null,null,null,null,null,null,null,null,null,null,null,null,null,null,null,null,null,null,null,null,null,null,null,null,null,null,null,null,null,null,null,null,null,null,null,null,null,null,null,null,null,null,null,null,null,21,null,null,null,null,{"$f":"P39","v":""},{"$f":"P42","v":""}]
[16,{"$f":"IF(#REF!=2,Eleme!#REF!,IF(#REF!=3,Eleme!#REF!,IF(#REF!=4,Eleme!#REF!,IF(#REF!=5,Eleme!#REF!,IF(#REF!=6,Eleme!#REF!)))))","v":{"$error":"#REF!"}},null,null,null,null,null,null,null,null,null,null,null,null,null,null,null,null,null,null,null,"E",{"$f":"IF(AND(R7=0,S7=0),\"\",IF(R7<S7,P4,P9))","v":""},null,null,null,null,null,null,null,null,null,null,null,null,null,null,null,null,null,null,null,null,null,null,null,null,null,null,null,null,null,null,null,null,null,null,null,null,null,null,null,null,null,null,null,null,null,22,null,null,null,null,{"$f":"P45","v":""},{"$f":"P48","v":""}]
[null,null,null,null,null,null,null,null,null,null,null,null,null,null,null,null,null,null,null,null,null,null,null,null,{"$f":"CH28","v":0},{"$f":"+CI28","v":0},"Y-J",null,26,{"$f":"IF(AND(Y25=0,Z25=0),\"\",IF(Y25>Z25,W24,W26))","v":""},null,null,null,null,null,null,"3.",null,null,null,null,null,null,null,null,null,null,null,null,null,null,null,null,null,null,null,null,null,null,null,null,null,null,null,null,null,null,null,23,null,null,null,null,{"$f":"P53","v":""},{"$f":"P55","v":""},null,null,null,null,null,null,null,null,null,null,null,null,null,null,null,null,null,null,null,null,null,null,null,null,null,null,null,null,null,null,null,null,null,null,null,null,null,null,null,null,null,null,null,null,null,null,null,null,null,null,null,null,null,null,null,null,null,null,null,null,null,null,null,null,null,null,null,null,null,null,null,null,null,null,null,null,null,null,null,null,null,null,null,null,null,null,null,null,null,null,null,null,null,null,null,null,null,null,null,null,null,null,null,null,null,null,null,null,null,null,null,null,null,null,null,null,null,null,null,null,null,null,null,null,null,null,null,null,null,null,null,null,null,null,null,null,null,null,null,null,null,null,null,null,null,null,null,null,null,null,null,null,null,null,null,null,null,null,null,null,null,null,null,null,null,null,null,null,null,null,null,null,null,null,null,null,null,null,null,null,null,null,null,null,null,null,null,null,null,null,null,null,null,null,null,null,null,null,null,null,null,null,null,null,null,null,null,null,null,null,null,null,null,null,null,null,null,null,null,null,null,null,null,null,null,null,null,null,null,null,null,null,null,null,null,null,null,null,null,null,null,null,null,null,null,null,null,null,null,null,null,null,null,null,null,null,null,null,null,null,null,null,null,null,null,null,null,null,null,null,null,null,null,null,null,null,null,null,null,null,null,null,null,null,null,null,null,null,null,null,null,null,null,null,null,null,null,null,null,null,null,null,null,null,null,null,null,null,null,null,null,null,null,null,null,null,null,null,null,null,null,null,null,null,null,null,null,null,null,null,null,null,null,null,null,null,null,null,null,null,null,null,null,null,null,null,null,null,null,null,null,null,null,null,null,null,null,null,null,null,null,null,null,null,null,null,null,null,null,null,null,null,null,null,null,null,null,null,null,null,null,null,null,null,null,null,null,null,null,null,null,null,null,null,null,null,null,null,null,null,null,null,null,null,null,null,null,null,null,null,null,null,null,null,null,null,null,null,null,null,null,null,null,null,null,null,null,null,null,null,null,null,null,null,null,null,null,null,null,null,null,null,null,null,null,null,null,null,null,null,null,null,null,null,null,null,null,null,null,null,null,null,null,null,null,null,null,null,null,null,null,null,null,null,null,null,null,null,null,null,null,null,null,null,null,null,null,null,null,null,null,null,null,null,null,null,null,null,null,null,null,null,null,null,null,null,null,null,null,null,null,null,null,null,null,null,null,null,null,null,null,null,null,null,null,null,null,null,null,null,null,null,null,null,null,null,null,null,null,null,null,null,null,null,null,null,null,null,null,null,null,null,null,null,null,null,null,null,null,null,null,null,null,null,null,null,null,null,null,null,null,null,null,null,null,null,null,null,null,null,null,null,null,null,null,null,null,null,null,null,null,null,null,null,null,null,null,null,null,null,null,null,null,null,null,null,null,null,null,null,null,null,null,null,null,null,null,null,null,null,null,null,null,null,null,null,null,null,null,null,null,null,null,null,null,null,null,null,null,null,null,null,null,null,null,null,null,null,null,null,null,null,null,null,null,null,null,null,null,null,null,null,null,null,null,null,null,null,null,null,null,null,null,null,null,null,null,null,null,null,null,null,null,null,null,null,null,null,null,null,null,null,null,null,null,null,null,null,null,null,null,null,null,null,null,null,null,null,null,null,null,null,null,null,null,null,null,null,null,null,null,null,null,null,null,null,null,null,null,null,null,null,null,null,null,null,null,null,null,null,null,null,null,null,null,null,null,null,null,null,null,null,null,null,null,null,null,null,null,null,null,null,null,null,null,null,null,null,null,null,null,null,null,null,null,null,null,null,null,null,null,null,null,null,null,null,null,null,null,null,null,null,null,null,null,null,null,null,null,null,null,null,null,null,null,null,null,null,null,null,null,null,null,null,null,null,null,null,null,null,null,null,null,null,null,null,null,null,null,null,null,null,null,null,null,null,null,null,null,null,null,null,null,null,null,null,null,null,null,null,null,null,null,null,null,null,null,null,null,null,null,null,null,null,null,null,null,null,null,null,null,null,null,null,null,null,null,null,null,null,null,null,null,null,null,null,null,null,null,null,null,null,null,null,null,null,null,null,null,null,null,null,null,null,null,null,null,null,null,null,null,null,null,null,null,null,null,null,null,null,null,null,null,null,null,null,null,null,null,null,null,null,null,null,null,null,null,null,null,null,null,null,null,null,null,null,null,null,null,null,null,null,null,null,null,null,null,null,null,null,null,null,null,null,null,null,null,null,null,null,null,null,null,null,null,null,null,null,null,null,null,null,null,null,null,null,null,null,null,null,null,null,null,null,null,null,null,null,null,null,null,null,null,null,null,null,null,null,null,null,null,null,null,null,null,null,null,null,null,null,null,null,null,null,null,null,null,null,null,null,null,null,null,null,null,null,null,null,null,null,null,null,null,null,null,null,null,null,null,null,null,null,null,null,null,null,null,null,null,null,null,null,null,null,null,null,null,null,null,null,null,null,null,null,null,null,null,null,null,null,null,null,null,null,null,null,null,null,null,null,null,null,null,null,null,null,null,null,null,null,null,null,null,null,null,null,null,null,null,null,null,null,null,null,null,null,null,null,null,null,null,null,null,null,null,null,null,null,null,null,null,null,null,null,null,null,null,null,null,null,null,0]
[null,null,null,null,null,null,null,null,null,null,null,null,null,null,null,null,null,null,null,null,null,"F",{"$f":"IF(AND(R19=0,S19=0),\"\",IF(R19<S19,P16,P21))","v":""},null,null,null,null,null,null,null,null,null,null,null,null,null,null,null,null,null,null,null,null,null,null,null,null,null,null,null,null,null,null,null,null,null,null,null,null,null,null,null,null,null,null,null,null,null,24,null,null,null,null,{"$f":"P57","v":""},{"$f":"P59","v":""}]
[null,null,null,null,null,null,null,null,null,null,null,null,null,null,"A",{"$f":"IF(AND(K4=0,L4=0),\"\",IF(K4<L4,I2,I5))","v":""},null,null,null,null,null,null,null,null,null,null,null,null,"J",{"$f":"IF(AND(Y25=0,Z25=0),\"\",IF(Y25<Z25,W24,W26))","v":""},null,null,null,null,null,null,"4.",null,null,null,null,null,null,null,null,null,null,null,null,null,null,null,null,null,null,null,null,null,null,null,null,null,null,null,null,null,null,null,25,null,null,null,null,{"$f":"W7","v":""},{"$f":"W18","v":""}]
[null,null,null,null,null,null,null,null,null,null,null,null,null,null,null,null,null,{"$f":"CH21","v":0},{"$f":"+CI21","v":0},"Y-G",null,19,{"$f":"IF(AND(R28=0,S28=0),\"\",IF(R28>S28,P27,P29))","v":""},null,null,null,null,null,null,null,null,null,null,null,null,null,null,null,null,null,null,null,null,null,null,null,null,null,null,null,null,null,null,null,null,null,null,null,null,null,null,null,null,null,null,null,null,null,26,null,null,null,null,{"$f":"W24","v":""},{"$f":"W26","v":""}]
[null,null,null,null,null,null,null,null,null,null,null,null,null,null,"B",{"$f":"IF(AND(K10=0,L10=0),\"\",IF(K10<L10,I8,I11))","v":""},null,null,null,null,null,null,null,null,null,null,null,null,27,null,null,null,null,null,null,null,null,null,null,null,null,null,null,null,null,null,null,null,null,null,null,null,null,null,null,null,null,null,null,null,null,null,null,null,null,null,null,null,27,null,null,null,null,{"$f":"W28","v":""},{"$f":"W32","v":""}]
[null,null,null,null,null,null,null,null,null,null,null,null,null,null,null,null,null,null,null,null,null,null,null,null,{"$f":"CH29","v":0},{"$f":"+CI29","v":0},"Y-K",null,null,{"$f":"IF(AND(Y30=0,Z30=0),\"\",IF(Y30>Z30,W28,W32))","v":""},null,null,null,null,null,null,"5.",null,null,null,null,null,null,null,null,null,null,null,null,null,null,null,null,null,null,null,null,null,null,null,null,null,null,null,null,null,null,null,28,null,null,null,null,{"$f":"W34","v":""},{"$f":"W36","v":""}]
[null,null,null,null,null,null,null,null,null,null,null,null,null,null,"C",{"$f":"IF(AND(K16=0,L16=0),\"\",IF(K16<L16,I14,I17))","v":""},null,null,null,null,null,null,null,null,null,null,null,null,null,null,null,null,null,null,null,null,null,null,null,null,null,null,null,null,null,null,null,null,null,null,null,null,null,null,null,null,null,null,null,null,null,null,null,null,null,null,null,null,29,null,null,null,null,{"$f":"W41","v":""},{"$f":"W46","v":""}]
[null,null,null,null,null,null,null,null,null,null,null,null,null,null,null,null,null,{"$f":"CH22","v":0},{"$f":"+CI22","v":0},"Y-H",null,20,{"$f":"IF(AND(R32=0,S32=0),\"\",IF(R32>S32,P31,P33))","v":""},null,null,null,null,null,null,null,null,null,null,null,null,null,null,null,null,null,null,null,null,null,null,null,null,null,null,null,null,null,null,null,null,null,null,null,null,null,null,null,null,null,null,null,null,null,30,null,null,null,null,{"$f":"W50","v":""},{"$f":"W52","v":""}]
[null,null,null,null,null,null,null,null,null,null,null,null,null,null,"D",{"$f":"IF(AND(K22=0,L22=0),\"\",IF(K22<L22,I20,I23))","v":""},null,null,null,null,null,null,null,null,null,null,null,null,"K",{"$f":"IF(AND(Y30=0,Z30=0),\"\",IF(Y30<Z30,W28,W32))","v":""},null,null,null,null,null,null,"6.",null,null,null,null,null,null,null,null,null,null,null,null,null,null,null,null,null,null,null,null,null,null,null,null,null,null,null,null,null,null,null,31,null,null,null,null,{"$f":"W54","v":""},{"$f":"W58","v":""}]
[null,null,null,null,null,null,null,null,null,null,null,null,null,null,null,null,null,null,null,null,null,"G",{"$f":"IF(AND(R28=0,S28=0),\"\",IF(R28<S28,P27,P29))","v":""},null,null,null,null,null,null,null,null,null,null,null,null,null,null,null,null,null,null,null,null,null,null,null,null,null,null,null,null,null,null,null,null,null,null,null,null,null,null,null,null,null,null,null,null,null,32,null,null,null,null,{"$f":"W60","v":""},{"$f":"W62","v":""}]
[null,null,null,null,null,null,null,null,null,null,null,null,null,null,null,null,null,null,null,null,null,null,null,null,{"$f":"CH30","v":0},{"$f":"+CI30","v":0},"Y-L",null,28,{"$f":"IF(AND(Y35=0,Z35=0),\"\",IF(Y35>Z35,W34,W36))","v":""},null,null,null,null,null,null,"7."]
[null,null,null,null,null,null,null,null,null,null,null,null,null,null,null,null,null,null,null,null,null,"H",{"$f":"IF(AND(R32=0,S32=0),\"\",IF(R32<S32,P31,P33))","v":""}]
[null,null,null,null,null,null,null,null,null,null,null,null,null,null,null,null,null,null,null,null,null,null,null,null,null,null,null,null,"L",{"$f":"IF(AND(Y35=0,Z35=0),\"\",IF(Y35<Z35,W34,W36))","v":""},null,null,null,null,null,null,"8."]
[null,null,null,null,null,null,null,"Y1",{"$f":"IF(AND(D2=0,E2=0),\"\",IF(D2<E2,B1,B3))","v":""}]
[null,null,null,null,null,null,null,null,null,null,{"$f":"CH15","v":0},{"$f":"CI15","v":0},"Y9",null,13,{"$f":"IF(AND(K39=0,L39=0),\"\",IF(K39>L39,I38,I40))","v":""}]
[null,null,null,null,null,null,null,"Y2",{"$f":"IF(AND(D5=0,E5=0),\"\",IF(D5<E5,B4,B6))","v":""},null,null,null,null,null,null,null,null,null,null,null,null,21]
[null,null,null,null,null,null,null,"Y3",{"$f":"IF(AND(D8=0,E8=0),\"\",IF(D8<E8,B7,B9))","v":""},null,null,null,null,null,null,null,null,{"$f":"CH23","v":0},{"$f":"CI23","v":0},"Y13",null,null,{"$f":"IF(AND(R41=0,S41=0),\"\",IF(R41>S41,P39,P42))","v":""}]
[null,null,null,null,null,null,null,null,null,null,{"$f":"CH16","v":0},{"$f":"CI16","v":0},"Y10",null,14,{"$f":"IF(AND(K42=0,L42=0),\"\",IF(K42>L42,I41,I43))","v":""},null,null,null,null,null,null,null,null,null,null,null,null,29]
[null,null,null,null,null,null,null,"Y4",{"$f":"IF(AND(D11=0,E11=0),\"\",IF(D11<E11,B10,B12))","v":""}]
[null,null,null,null,null,null,null,"Y5",{"$f":"IF(AND(D14=0,E14=0),\"\",IF(D14<E14,B13,B15))","v":""},null,null,null,null,null,null,null,null,null,null,null,null,null,null,null,{"$f":"CH31","v":0},{"$f":"CI31","v":0},"Y17",null,null,{"$f":"IF(AND(Y44=0,Z44=0),\"\",IF(Y44>Z44,W41,W46))","v":""},null,null,null,null,null,null,"9."]
[null,null,null,null,null,null,null,null,null,null,{"$f":"CH17","v":0},{"$f":"CI17","v":0},"Y11",null,15,{"$f":"IF(AND(K45=0,L45=0),\"\",IF(K45>L45,I44,I46))","v":""}]
[null,null,null,null,null,null,null,"Y6",{"$f":"IF(AND(D17=0,E17=0),\"\",IF(D17<E17,B16,B18))","v":""},null,null,null,null,null,null,null,null,null,null,null,null,22,{"$f":"IF(AND(R47=0,S47=0),\"\",IF(R47>S47,P45,P48))","v":""}]
[null,null,null,null,null,null,null,"Y7",{"$f":"IF(AND(D20=0,E20=0),\"\",IF(D20<E20,B19,B21))","v":""},null,null,null,null,null,null,null,null,{"$f":"CH24","v":0},{"$f":"CI24","v":0},"Y14",null,null,null,null,null,null,null,null,"Y17",{"$f":"IF(AND(Y44=0,Z44=0),\"\",IF(Y44<Z44,W41,W46))","v":""},null,null,null,null,null,null,"10."]
[null,null,null,null,null,null,null,null,null,null,{"$f":"CH18","v":0},{"$f":"CI18","v":0},"Y12",null,16,{"$f":"IF(AND(K48=0,L48=0),\"\",IF(K48>L48,I47,I49))","v":""}]
[null,null,null,null,null,null,null,"Y8",{"$f":"IF(AND(D23=0,E23=0),\"\",IF(D23<E23,B22,B24))","v":""}]
[null,null,null,null,null,null,null,null,null,null,null,null,null,null,null,null,null,null,null,null,null,"E",{"$f":"IF(AND(R41=0,S41=0),\"\",IF(R41<S41,P39,P42))","v":""}]
[null,null,null,null,null,null,null,null,null,null,null,null,null,null,null,null,null,null,null,null,null,null,null,null,{"$f":"CH32","v":0},{"$f":"+CI32","v":0},"Y18",null,30,{"$f":"IF(AND(Y51=0,Z51=0),\"\",IF(Y51>Z51,W50,W52))","v":""},null,null,null,null,null,null,"11."]
[null,null,null,null,null,null,null,null,null,null,null,null,null,null,null,null,null,null,null,null,null,"F",{"$f":"IF(AND(R47=0,S47=0),\"\",IF(R47<S47,P45,P48))","v":""}]
[null,null,null,null,null,null,null,null,null,null,null,null,null,null,"Y1",{"$f":"IF(AND(K39=0,L39=0),\"\",IF(K39<L39,I38,I40))","v":""},null,null,null,null,null,null,null,null,null,null,null,null,"Y18",{"$f":"IF(AND(Y51=0,Z51=0),\"\",IF(Y51<Z51,W50,W52))","v":""},null,null,null,null,null,null,"12."]
[null,null,null,null,null,null,null,null,null,null,null,null,null,null,null,null,null,{"$f":"CH25","v":0},{"$f":"+CI25","v":0},"Y15",null,23,{"$f":"IF(AND(R54=0,S54=0),\"\",IF(R54>S54,P53,P55))","v":""}]
[null,null,null,null,null,null,null,null,null,null,null,null,null,null,"Y2",{"$f":"IF(AND(K42=0,L42=0),\"\",IF(K42<L42,I41,I43))","v":""},null,null,null,null,null,null,null,null,null,null,null,null,31]
[null,null,null,null,null,null,null,null,null,null,null,null,null,null,null,null,null,null,null,null,null,null,null,null,{"$f":"CH33","v":0},{"$f":"+CI33","v":0},"Y19",null,null,{"$f":"IF(AND(Y56=0,Z56=0),\"\",IF(Y56>Z56,W54,W58))","v":""},null,null,null,null,null,null,"13."]
[null,null,null,null,null,null,null,null,null,null,null,null,null,null,"Y3",{"$f":"IF(AND(K45=0,L45=0),\"\",IF(K45<L45,I44,I46))","v":""}]
[null,null,null,null,null,null,null,null,null,null,null,null,null,null,null,null,null,{"$f":"CH26","v":0},{"$f":"+CI26","v":0},"Y16",null,24,{"$f":"IF(AND(R58=0,S58=0),\"\",IF(R58>S58,P57,P59))","v":""}]
[null,null,null,null,null,null,null,null,null,null,null,null,null,null,"Y4",{"$f":"IF(AND(K48=0,L48=0),\"\",IF(K48<L48,I47,I49))","v":""},null,null,null,null,null,null,null,null,null,null,null,null,"Y19",{"$f":"IF(AND(Y56=0,Z56=0),\"\",IF(Y56<Z56,W54,W58))","v":""},null,null,null,null,null,null,"14."]
[null,null,null,null,null,null,null,null,null,null,null,null,null,null,null,null,null,null,null,null,null,"Y15",{"$f":"IF(AND(R54=0,S54=0),\"\",IF(R54<S54,P53,P55))","v":""}]
[null,null,null,null,null,null,null,null,null,null,null,null,null,null,null,null,null,null,null,null,null,null,null,null,{"$f":"CH34","v":0},{"$f":"+CI34","v":0},"Y20",null,32,{"$f":"IF(AND(Y61=0,Z61=0),\"\",IF(Y61>Z61,W60,W62))","v":""},null,null,null,null,null,null,"15."]
[null,null,null,null,null,null,null,null,null,null,null,null,null,null,null,null,null,null,null,null,null,"Y16",{"$f":"IF(AND(R58=0,S58=0),\"\",IF(R58<S58,P57,P59))","v":""}]
[null,null,null,null,null,null,null,null,null,null,null,null,null,null,null,null,null,null,null,null,null,null,null,null,null,null,null,null,"Y20",{"$f":"IF(AND(Y61=0,Z61=0),\"\",IF(Y61<Z61,W60,W62))","v":""},null,null,null,null,null,null,"16"]

{"sheet":"16DE","index":8,"n_rows":63,"n_cols":1217,"rows_kept":63,"cut":false,"hidden":true,"merged":[[8,1,8,7],[8,15,8,21],[9,1,9,7],[10,8,10,14],[11,1,11,7],[7,8,7,14],[0,1,0,7],[0,24,2,46],[1,8,1,14],[2,1,2,7],[3,1,3,7],[3,15,3,21],[4,8,4,14],[5,1,5,7],[6,1,6,7],[6,22,6,28],[3,24,4,46],[19,8,19,14],[19,43,19,49],[12,50,12,56],[13,8,13,14],[14,1,14,7],[15,1,15,7],[15,15,15,21],[16,8,16,14],[12,1,12,7],[17,1,17,7],[17,22,17,28],[18,1,18,7],[18,22,18,28],[20,1,20,7],[20,15,20,21],[21,1,21,7],[22,8,22,14],[23,1,23,7],[23,29,23,35],[24,15,24,21],[24,50,24,56],[25,8,25,14],[25,22,25,28],[25,36,25,42],[30,15,30,21],[30,50,30,55],[31,8,31,14],[31,29,31,35],[32,15,32,21],[26,15,26,21],[27,8,27,14],[27,29,27,35],[28,15,28,21],[29,8,29,14],[29,22,29,28],[38,15,38,21],[38,36,38,42],[33,8,33,14],[33,22,33,28],[33,36,33,42],[34,15,34,21],[36,15,36,21],[36,36,36,42],[37,8,37,14],[37,22,37,28],[35,8,35,14],[35,29,35,35],[39,8,39,14],[39,43,39,49],[40,29,40,35],[41,36,41,42],[42,29,42,35],[43,22,43,28],[43,36,43,42],[44,29,44,35],[45,22,45,28],[62,29,62,35],[54,15,54,21],[55,29,55,35],[56,15,56,21],[57,22,57,28],[58,15,58,21],[58,29,58,35],[50,29,50,35],[51,36,51,42],[52,15,52,21],[52,29,52,35],[53,22,53,28],[53,36,53,42],[1,85,1,86],[1,75,1,76],[1,77,1,78],[1,79,1,80],[1,81,1,82],[1,83,1,84],[59,22,59,28],[60,29,60,35],[61,22,61,28],[37,43,37,49],[49,22,49,28],[49,36,49,42],[46,36,46,42],[47,22,47,28],[48,29,48,35],[34,43,34,49],[29,43,29,49],[18,57,18,63],[25,57,25,63]]}
[1,{"$f":"IF(#REF!=2,Eleme!#REF!,IF(#REF!=3,Eleme!#REF!,IF(#REF!=4,Eleme!#REF!,IF(#REF!=5,Eleme!#REF!,IF(#REF!=6,Eleme!#REF!)))))","v":{"$error":"#REF!"}},null,null,null,null,null,null,null,null,null,null,null,null,null,null,null,null,null,null,null,null,null,null,{"$f":"Katılım!AC1","v":"TÜRKİYE MASA TENİSİ FEDERASYONU\nKÜÇÜKLER KUZEYBATI BÖLGESİ YARIŞMALARI"},null,null,null,null,null,null,null,null,null,null,null,null,null,null,null,null,null,null,null,null,null,null,null,null,null,null,null,null,null,null,null,null,null,null,null,null,null,null,null,null,null,null,null,null,null,null,null,null,null,null,null,null,null,null,null,null,null,null,null,null,null,null,null,null,null,null,null,null,null,null,null,null,null,null,null,null,null,null,"1st Round",1]
[null,null,null,{"$f":"CH3","v":0},{"$f":"CI3","v":0},"Y1",null,1,{"$f":"IF(AND(D2=0,E2=0),\"\",IF(D2>E2,B1,B3))","v":""},null,null,null,null,null,null,null,null,null,null,null,null,null,null,null,null,null,null,null,null,null,null,null,null,null,null,null,null,null,null,null,null,null,null,null,null,null,null,null,null,null,null,null,null,null,null,null,null,null,null,null,null,null,null,null,null,null,null,null,"#","Date","Time","Table","Competition","Player A","Player B","Set1",null,"Set2",null,"Set3",null,"Set4",null,"Set5",null,"Result",null,null,null,null,null,null,null,null,null,null,null,null,null,null,null,null,null,"2sn Round"]
[2,{"$f":"IF(#REF!=2,Eleme!#REF!,IF(#REF!=3,Eleme!#REF!,IF(#REF!=4,Eleme!#REF!,IF(#REF!=5,Eleme!#REF!,IF(#REF!=6,Eleme!#REF!)))))","v":{"$error":"#REF!"}},null,null,null,null,null,null,null,null,null,null,null,null,9,null,null,null,null,null,null,null,null,null,null,null,null,null,null,null,null,null,null,null,null,null,null,null,null,null,null,null,null,null,null,null,null,null,null,null,null,null,null,null,null,null,null,null,null,null,null,null,null,null,null,null,null,null,1,null,null,null,null,{"$f":"B1","v":{"$error":"#REF!"}},{"$f":"B3","v":{"$error":"#REF!"}},null,null,null,null,null,null,null,null,null,null,null,null,null,null,null,null,null,null,null,null,null,null,null,null,null,null,null,null,"3th Round"]
[3,{"$f":"IF(#REF!=2,Eleme!#REF!,IF(#REF!=3,Eleme!#REF!,IF(#REF!=4,Eleme!#REF!,IF(#REF!=5,Eleme!#REF!,IF(#REF!=6,Eleme!#REF!)))))","v":{"$error":"#REF!"}},null,null,null,null,null,null,null,null,{"$f":"CH11","v":0},{"$f":"CI11","v":0},"Y9",null,null,{"$f":"IF(AND(K4=0,L4=0),\"\",IF(K4>L4,I2,I5))","v":""},null,null,null,null,null,null,null,null,{"$f":"Katılım!AC2&\" \"&Katılım!AE3","v":"ERKEK TAKIM  [12-13 Mart 2025 KOCAELİ] [ Ana Tablo ]"},null,null,null,null,null,null,null,null,null,null,null,null,null,null,null,null,null,null,null,null,null,null,null,null,null,null,null,null,null,null,null,null,null,null,null,null,null,null,null,null,null,null,null,2,null,null,null,null,{"$f":"B4","v":{"$error":"#REF!"}},{"$f":"B6","v":{"$error":"#REF!"}},null,null,null,null,null,null,null,null,null,null,null,null,null,null,null,null,null,null,null,null,null,null,null,null,null,null,null,null,"4th Round"]
[null,null,null,{"$f":"CH4","v":0},{"$f":"CI4","v":0},"Y2",null,2,{"$f":"IF(AND(D5=0,E5=0),\"\",IF(D5>E5,B4,B6))","v":""},null,null,null,null,null,null,null,null,null,null,null,null,17,null,null,null,null,null,null,null,null,null,null,null,null,null,null,null,null,null,null,null,null,null,null,null,null,null,null,null,null,null,null,null,null,null,null,null,null,null,null,null,null,null,null,null,null,null,null,3,null,null,null,null,{"$f":"B7","v":{"$error":"#REF!"}},{"$f":"B9","v":{"$error":"#REF!"}},null,null,null,null,null,null,null,null,null,null,null,null,null,null,null,null,null,null,null,null,null,null,null,null,null,null,null,null,"5th Round"]
[4,{"$f":"IF(#REF!=2,Eleme!#REF!,IF(#REF!=3,Eleme!#REF!,IF(#REF!=4,Eleme!#REF!,IF(#REF!=5,Eleme!#REF!,IF(#REF!=6,Eleme!#REF!)))))","v":{"$error":"#REF!"}},null,null,null,null,null,null,null,null,null,null,null,null,null,null,null,null,null,null,null,null,null,null,null,null,null,null,null,null,null,null,null,null,null,null,null,null,null,null,null,null,null,null,null,null,null,null,null,null,null,null,null,null,null,null,null,null,null,null,null,null,null,null,null,null,null,null,4,null,null,null,null,{"$f":"B10","v":{"$error":"#REF!"}},{"$f":"B12","v":{"$error":"#REF!"}},null,null,null,null,null,null,null,null,null,null,null,null,null,null,null,null,null,null,null,null,null,null,null,null,null,null,null,null,"6th Round"]
[5,{"$f":"IF(#REF!=2,Eleme!#REF!,IF(#REF!=3,Eleme!#REF!,IF(#REF!=4,Eleme!#REF!,IF(#REF!=5,Eleme!#REF!,IF(#REF!=6,Eleme!#REF!)))))","v":{"$error":"#REF!"}},null,null,null,null,null,null,null,null,null,null,null,null,null,null,null,{"$f":"CH19","v":0},{"$f":"CI19","v":0},"Y17",null,null,{"$f":"IF(AND(R7=0,S7=0),\"\",IF(R7>S7,P4,P9))","v":""},null,null,null,null,null,null,null,null,null,null,null,null,null,null,null,null,null,null,null,null,null,null,null,null,null,null,null,null,null,null,null,null,null,null,null,null,null,null,null,null,null,null,null,null,null,5,null,null,null,null,{"$f":"B13","v":{"$error":"#REF!"}},{"$f":"B15","v":{"$error":"#REF!"}},null,null,null,null,null,null,null,null,null,null,null,null,null,null,null,null,null,null,null,null,null,null,null,null,null,null,null,null,"7th Round"]
[null,null,null,{"$f":"CH5","v":0},{"$f":"CI5","v":0},"Y3",null,3,{"$f":"IF(AND(D8=0,E8=0),\"\",IF(D8>E8,B7,B9))","v":""},null,null,null,null,null,null,null,null,null,null,null,null,null,null,null,null,null,null,null,25,null,null,null,null,null,null,null,null,null,null,null,null,null,null,null,null,null,null,null,null,null,null,null,null,null,null,null,null,null,null,null,null,null,null,null,null,null,null,null,6,null,null,null,null,{"$f":"B16","v":{"$error":"#REF!"}},{"$f":"B18","v":{"$error":"#REF!"}},null,null,null,null,null,null,null,null,null,null,null,null,null,null,null,null,null,null,null,null,null,null,null,null,null,null,null,null,"8th Round"]
[6,{"$f":"IF(#REF!=2,Eleme!#REF!,IF(#REF!=3,Eleme!#REF!,IF(#REF!=4,Eleme!#REF!,IF(#REF!=5,Eleme!#REF!,IF(#REF!=6,Eleme!#REF!)))))","v":{"$error":"#REF!"}},null,null,null,null,null,null,null,null,null,null,null,null,10,{"$f":"IF(AND(K10=0,L10=0),\"\",IF(K10>L10,I8,I11))","v":""},null,null,null,null,null,null,null,null,null,null,null,null,null,null,null,null,null,null,null,null,null,null,null,null,null,null,null,null,null,null,null,null,null,null,null,null,null,null,null,null,null,null,null,null,null,null,null,null,null,null,null,null,7,null,null,null,null,{"$f":"B19","v":{"$error":"#REF!"}},{"$f":"B21","v":{"$error":"#REF!"}}]
[7,{"$f":"IF(#REF!=2,Eleme!#REF!,IF(#REF!=3,Eleme!#REF!,IF(#REF!=4,Eleme!#REF!,IF(#REF!=5,Eleme!#REF!,IF(#REF!=6,Eleme!#REF!)))))","v":{"$error":"#REF!"}},null,null,null,null,null,null,null,null,{"$f":"CH12","v":0},{"$f":"CI12","v":0},"Y10",null,null,null,null,null,null,null,null,null,null,null,null,null,null,null,null,null,null,null,null,null,null,null,null,null,null,null,null,null,null,null,null,null,null,null,null,null,null,null,null,null,null,null,null,null,null,null,null,null,null,null,null,null,null,null,8,null,null,null,null,{"$f":"B22","v":{"$error":"#REF!"}},{"$f":"B24","v":{"$error":"#REF!"}}]
[null,null,null,{"$f":"CH6","v":0},{"$f":"CI6","v":0},"Y4",null,4,{"$f":"IF(AND(D11=0,E11=0),\"\",IF(D11>E11,B10,B12))","v":""},null,null,null,null,null,null,null,null,null,null,null,null,null,null,null,null,null,null,null,null,null,null,null,null,null,null,null,null,null,null,null,null,null,null,null,null,null,null,null,null,null,null,null,null,null,null,null,null,null,null,null,null,null,null,null,null,null,null,null,9,null,null,null,null,{"$f":"I2","v":""},{"$f":"I5","v":""}]
[8,{"$f":"IF(#REF!=2,Eleme!#REF!,IF(#REF!=3,Eleme!#REF!,IF(#REF!=4,Eleme!#REF!,IF(#REF!=5,Eleme!#REF!,IF(#REF!=6,Eleme!#REF!)))))","v":{"$error":"#REF!"}},null,null,null,null,null,null,null,null,null,null,null,null,null,null,null,null,null,null,null,null,null,null,null,null,null,null,null,null,null,null,null,null,null,null,null,null,null,null,null,null,null,null,null,null,null,null,null,null,null,null,null,null,null,null,null,null,null,null,null,null,null,null,null,null,null,null,10,null,null,null,null,{"$f":"I8","v":""},{"$f":"I11","v":""}]
[9,{"$f":"IF(#REF!=2,Eleme!#REF!,IF(#REF!=3,Eleme!#REF!,IF(#REF!=4,Eleme!#REF!,IF(#REF!=5,Eleme!#REF!,IF(#REF!=6,Eleme!#REF!)))))","v":{"$error":"#REF!"}},null,null,null,null,null,null,null,null,null,null,null,null,null,null,null,null,null,null,null,null,null,null,{"$f":"CH27","v":0},{"$f":"+CI27","v":0},"Y25",null,null,null,null,null,null,null,null,null,null,null,null,null,null,null,null,null,null,null,null,null,null,null,{"$f":"IF(AND(Y13=0,Z13=0),\"\",IF(Y13>Z13,W7,W18))","v":""},null,null,null,null,null,null,null,null,null,null,null,null,null,null,null,null,null,11,null,null,null,null,{"$f":"I14","v":""},{"$f":"I17","v":""}]
[null,null,null,{"$f":"CH7","v":0},{"$f":"CI7","v":0},"Y5",null,5,{"$f":"IF(AND(D14=0,E14=0),\"\",IF(D14>E14,B13,B15))","v":""},null,null,null,null,null,null,null,null,null,null,null,null,null,null,null,null,null,null,null,null,null,null,null,null,null,null,null,null,null,null,null,null,null,null,null,null,null,null,null,null,null,null,null,null,null,null,null,40,null,null,null,null,null,null,null,null,null,null,null,12,null,null,null,null,{"$f":"I20","v":""},{"$f":"I23","v":""}]
[10,{"$f":"IF(#REF!=2,Eleme!#REF!,IF(#REF!=3,Eleme!#REF!,IF(#REF!=4,Eleme!#REF!,IF(#REF!=5,Eleme!#REF!,IF(#REF!=6,Eleme!#REF!)))))","v":{"$error":"#REF!"}},null,null,null,null,null,null,null,null,null,null,null,null,11,null,null,null,null,null,null,null,null,null,null,null,null,null,null,null,null,null,null,null,null,null,null,null,null,null,null,null,null,null,null,null,null,null,null,null,null,null,null,null,null,null,null,null,null,null,null,null,null,null,null,null,null,null,13,null,null,null,null,{"$f":"I26","v":""},{"$f":"I28","v":""}]
[11,{"$f":"IF(#REF!=2,Eleme!#REF!,IF(#REF!=3,Eleme!#REF!,IF(#REF!=4,Eleme!#REF!,IF(#REF!=5,Eleme!#REF!,IF(#REF!=6,Eleme!#REF!)))))","v":{"$error":"#REF!"}},null,null,null,null,null,null,null,null,{"$f":"CH13","v":0},{"$f":"CI13","v":0},"Y11",null,null,{"$f":"IF(AND(K16=0,L16=0),\"\",IF(K16>L16,I14,I17))","v":""},null,null,null,null,null,null,null,null,null,null,null,null,null,null,null,null,null,null,null,null,null,null,null,null,null,null,null,null,null,null,null,null,null,null,null,null,null,null,null,null,null,null,null,null,null,null,null,null,null,null,null,null,14,null,null,null,null,{"$f":"I30","v":""},{"$f":"I32","v":""}]
[null,null,null,{"$f":"CH8","v":0},{"$f":"CI8","v":0},"Y6",null,6,{"$f":"IF(AND(D17=0,E17=0),\"\",IF(D17>E17,B16,B18))","v":""},null,null,null,null,null,null,null,null,null,null,null,null,18,null,null,null,null,null,null,null,null,null,null,null,null,null,null,null,null,null,null,null,null,null,null,null,null,null,null,null,null,null,null,null,null,null,null,null,null,null,null,null,null,null,null,null,null,null,null,15,null,null,null,null,{"$f":"I34","v":""},{"$f":"I36","v":""}]
[12,{"$f":"IF(#REF!=2,Eleme!#REF!,IF(#REF!=3,Eleme!#REF!,IF(#REF!=4,Eleme!#REF!,IF(#REF!=5,Eleme!#REF!,IF(#REF!=6,Eleme!#REF!)))))","v":{"$error":"#REF!"}},null,null,null,null,null,null,null,null,null,null,null,null,null,null,null,null,null,null,null,null,{"$f":"IF(AND(R19=0,S19=0),\"\",IF(R19>S19,P16,P21))","v":""},null,null,null,null,null,null,null,null,null,null,null,null,null,null,null,null,null,null,null,null,null,null,null,null,null,null,null,null,null,null,null,null,null,null,null,null,null,null,null,null,null,null,null,null,null,16,null,null,null,null,{"$f":"I38","v":""},{"$f":"I40","v":""}]
[13,{"$f":"IF(#REF!=2,Eleme!#REF!,IF(#REF!=3,Eleme!#REF!,IF(#REF!=4,Eleme!#REF!,IF(#REF!=5,Eleme!#REF!,IF(#REF!=6,Eleme!#REF!)))))","v":{"$error":"#REF!"}},null,null,null,null,null,null,null,null,null,null,null,null,null,null,null,{"$f":"CH20","v":0},{"$f":"CI20","v":0},"Y18",null,null,null,null,null,null,null,null,null,null,null,null,null,null,null,null,null,null,null,null,null,null,null,null,null,null,null,null,null,null,null,null,{"$f":"CH42","v":0},{"$f":"CI42","v":0},"Y40",null,null,{"$f":"IF(AND(BA19=0,BB19=0),\"\",IF(BA19>BB19,AY13,AY25))","v":""},null,null,null,null,null,null,"1.",null,null,null,17,null,null,null,null,{"$f":"P4","v":""},{"$f":"P9","v":""}]
[null,null,null,{"$f":"CH9","v":0},{"$f":"CI9","v":0},"Y7",null,7,{"$f":"IF(AND(D20=0,E20=0),\"\",IF(D20>E20,B19,B21))","v":""},null,null,null,null,null,null,null,null,null,null,null,null,null,null,null,null,null,null,null,null,null,null,null,null,null,null,null,null,null,null,null,null,null,"Y25",{"$f":"IF(AND(Y13=0,Z13=0),\"\",IF(Y13<Z13,W7,W18))","v":""},null,null,null,null,null,null,null,null,null,null,null,null,null,null,null,null,null,null,null,null,null,null,null,null,18,null,null,null,null,{"$f":"P16","v":""},{"$f":"P21","v":""}]
[14,{"$f":"IF(#REF!=2,Eleme!#REF!,IF(#REF!=3,Eleme!#REF!,IF(#REF!=4,Eleme!#REF!,IF(#REF!=5,Eleme!#REF!,IF(#REF!=6,Eleme!#REF!)))))","v":{"$error":"#REF!"}},null,null,null,null,null,null,null,null,null,null,null,null,12,{"$f":"IF(AND(K22=0,L22=0),\"\",IF(K22>L22,I20,I23))","v":""},null,null,null,null,null,null,null,null,null,null,null,null,null,null,null,null,null,null,null,null,null,null,null,null,null,null,null,null,null,null,null,null,null,39,null,null,null,null,null,null,null,null,null,null,null,null,null,null,null,null,null,null,19,null,null,null,null,{"$f":"P25","v":""},{"$f":"P27","v":""}]
[15,{"$f":"IF(#REF!=2,Eleme!#REF!,IF(#REF!=3,Eleme!#REF!,IF(#REF!=4,Eleme!#REF!,IF(#REF!=5,Eleme!#REF!,IF(#REF!=6,Eleme!#REF!)))))","v":{"$error":"#REF!"}},null,null,null,null,null,null,null,null,{"$f":"CH14","v":0},{"$f":"CI14","v":0},"Y12",null,null,null,null,null,null,null,null,null,null,null,null,null,null,null,null,null,null,null,null,null,null,null,null,null,null,null,null,null,null,null,null,null,null,null,null,null,null,null,null,null,null,null,null,null,null,null,null,null,null,null,null,null,null,null,20,null,null,null,null,{"$f":"P29","v":""},{"$f":"P31","v":""}]
[null,null,null,{"$f":"CH10","v":0},{"$f":"CI10","v":0},"Y8",null,8,{"$f":"IF(AND(D23=0,E23=0),\"\",IF(D23>E23,B22,B24))","v":""},null,null,null,null,null,null,null,null,null,null,null,null,null,null,null,null,null,null,null,null,null,null,null,null,null,null,null,null,null,null,null,null,null,null,null,null,null,null,null,null,null,null,null,null,null,null,null,null,null,null,null,null,null,null,null,null,null,null,null,21,null,null,null,null,{"$f":"P33","v":""},{"$f":"P35","v":""}]
[16,{"$f":"IF(#REF!=2,Eleme!#REF!,IF(#REF!=3,Eleme!#REF!,IF(#REF!=4,Eleme!#REF!,IF(#REF!=5,Eleme!#REF!,IF(#REF!=6,Eleme!#REF!)))))","v":{"$error":"#REF!"}},null,null,null,null,null,null,null,null,null,null,null,null,null,null,null,null,null,null,null,null,null,null,null,null,null,null,"Y17",{"$f":"IF(AND(R7=0,S7=0),\"\",IF(R7<S7,P4,P9))","v":""},null,null,null,null,null,null,null,null,null,null,null,null,null,null,null,null,null,null,null,null,null,null,null,null,null,null,null,null,null,null,null,null,null,null,null,null,null,null,22,null,null,null,null,{"$f":"P37","v":""},{"$f":"P39","v":""}]
[null,null,null,null,null,null,null,null,null,null,null,null,null,null,"Y12",{"$f":"IF(AND(K22=0,L22=0),\"\",IF(K22<L22,I20,I23))","v":""},null,null,null,null,null,null,null,null,null,null,null,null,null,null,null,null,null,null,null,32,null,null,null,null,null,null,null,null,null,{"$f":"CH41","v":0},{"$f":"+CI41","v":0},"Y39",null,null,{"$f":"IF(AND(AT25=0,AU25=0),\"\",IF(AT25>AU25,AR20,AR30))","v":""},null,null,null,null,null,null,null,null,null,null,null,null,null,null,null,null,null,23,null,null,null,null,{"$f":"P53","v":""},{"$f":"P55","v":""},null,null,null,null,null,null,null,null,null,null,null,null,null,null,null,null,null,null,null,null,null,null,null,null,null,null,null,null,null,null,null,null,null,null,null,null,null,null,null,null,null,null,null,null,null,null,null,null,null,null,null,null,null,null,null,null,null,null,null,null,null,null,null,null,null,null,null,null,null,null,null,null,null,null,null,null,null,null,null,null,null,null,null,null,null,null,null,null,null,null,null,null,null,null,null,null,null,null,null,null,null,null,null,null,null,null,null,null,null,null,null,null,null,null,null,null,null,null,null,null,null,null,null,null,null,null,null,null,null,null,null,null,null,null,null,null,null,null,null,null,null,null,null,null,null,null,null,null,null,null,null,null,null,null,null,null,null,null,null,null,null,null,null,null,null,null,null,null,null,null,null,null,null,null,null,null,null,null,null,null,null,null,null,null,null,null,null,null,null,null,null,null,null,null,null,null,null,null,null,null,null,null,null,null,null,null,null,null,null,null,null,null,null,null,null,null,null,null,null,null,null,null,null,null,null,null,null,null,null,null,null,null,null,null,null,null,null,null,null,null,null,null,null,null,null,null,null,null,null,null,null,null,null,null,null,null,null,null,null,null,null,null,null,null,null,null,null,null,null,null,null,null,null,null,null,null,null,null,null,null,null,null,null,null,null,null,null,null,null,null,null,null,null,null,null,null,null,null,null,null,null,null,null,null,null,null,null,null,null,null,null,null,null,null,null,null,null,null,null,null,null,null,null,null,null,null,null,null,null,null,null,null,null,null,null,null,null,null,null,null,null,null,null,null,null,null,null,null,null,null,null,null,null,null,null,null,null,null,null,null,null,null,null,null,null,null,null,null,null,null,null,null,null,null,null,null,null,null,null,null,null,null,null,null,null,null,null,null,null,null,null,null,null,null,null,null,null,null,null,null,null,null,null,null,null,null,null,null,null,null,null,null,null,null,null,null,null,null,null,null,null,null,null,null,null,null,null,null,null,null,null,null,null,null,null,null,null,null,null,null,null,null,null,null,null,null,null,null,null,null,null,null,null,null,null,null,null,null,null,null,null,null,null,null,null,null,null,null,null,null,null,null,null,null,null,null,null,null,null,null,null,null,null,null,null,null,null,null,null,null,null,null,null,null,null,null,null,null,null,null,null,null,null,null,null,null,null,null,null,null,null,null,null,null,null,null,null,null,null,null,null,null,null,null,null,null,null,null,null,null,null,null,null,null,null,null,null,null,null,null,null,null,null,null,null,null,null,null,null,null,null,null,null,null,null,null,null,null,null,null,null,null,null,null,null,null,null,null,null,null,null,null,null,null,null,null,null,null,null,null,null,null,null,null,null,null,null,null,null,null,null,null,null,null,null,null,null,null,null,null,null,null,null,null,null,null,null,null,null,null,null,null,null,null,null,null,null,null,null,null,null,null,null,null,null,null,null,null,null,null,null,null,null,null,null,null,null,null,null,null,null,null,null,null,null,null,null,null,null,null,null,null,null,null,null,null,null,null,null,null,null,null,null,null,null,null,null,null,null,null,null,null,null,null,null,null,null,null,null,null,null,null,null,null,null,null,null,null,null,null,null,null,null,null,null,null,null,null,null,null,null,null,null,null,null,null,null,null,null,null,null,null,null,null,null,null,null,null,null,null,null,null,null,null,null,null,null,null,null,null,null,null,null,null,null,null,null,null,null,null,null,null,null,null,null,null,null,null,null,null,null,null,null,null,null,null,null,null,null,null,null,null,null,null,null,null,null,null,null,null,null,null,null,null,null,null,null,null,null,null,null,null,null,null,null,null,null,null,null,null,null,null,null,null,null,null,null,null,null,null,null,null,null,null,null,null,null,null,null,null,null,null,null,null,null,null,null,null,null,null,null,null,null,null,null,null,null,null,null,null,null,null,null,null,null,null,null,null,null,null,null,null,null,null,null,null,null,null,null,null,null,null,null,null,null,null,null,null,null,null,null,null,null,null,null,null,null,null,null,null,null,null,null,null,null,null,null,null,null,null,null,null,null,null,null,null,null,null,null,null,null,null,null,null,null,null,null,null,null,null,null,null,null,null,null,null,null,null,null,null,null,null,null,null,null,null,null,null,null,null,null,null,null,null,null,null,null,null,null,null,null,null,null,null,null,null,null,null,null,null,null,null,null,null,null,null,null,null,null,null,null,null,null,null,null,null,null,null,null,null,null,null,null,null,null,null,null,null,null,null,null,null,null,null,null,null,null,null,null,null,null,null,null,null,null,null,null,null,null,null,null,null,null,null,null,null,null,null,null,null,null,null,null,null,null,null,null,null,null,null,null,null,null,null,null,null,null,null,null,null,null,null,null,null,null,null,null,null,null,null,null,null,null,null,null,null,null,null,null,null,null,null,null,null,null,null,null,null,null,null,null,null,null,null,null,null,null,null,null,null,null,null,null,null,null,null,null,null,null,null,null,null,null,null,null,null,null,null,null,null,null,null,null,null,null,null,null,null,null,null,null,null,null,null,null,null,null,null,null,null,null,null,null,null,null,null,null,null,null,null,null,null,null,null,null,null,null,null,null,null,null,null,null,null,null,null,null,null,null,null,null,null,null,null,null,null,null,null,null,null,null,0]
[null,null,null,null,null,null,null,"Y1",{"$f":"IF(AND(D2=0,E2=0),\"\",IF(D2<E2,B1,B3))","v":""},null,null,null,null,null,null,null,null,{"$f":"CH21","v":0},{"$f":"CI21","v":0},"Y19",null,19,{"$f":"IF(AND(R26=0,S26=0),\"\",IF(R26>S26,P25,P27))","v":""},null,null,null,null,null,null,null,null,{"$f":"CH34","v":0},{"$f":"+CI34","v":0},"Y32",null,null,{"$f":"IF(AND(AF26=0,AG26=0),\"\",IF(AF26>AG26,AD24,AD28))","v":""},null,null,null,null,null,null,null,null,null,null,null,null,null,null,null,null,null,null,null,"Y40",{"$f":"IF(AND(BA19=0,BB19=0),\"\",IF(BA19<BB19,AY13,AY25))","v":""},null,null,null,null,null,null,"2.",null,null,null,24,null,null,null,null,{"$f":"P57","v":""},{"$f":"P59","v":""}]
[null,null,null,null,null,null,null,null,null,null,{"$f":"CH15","v":0},{"$f":"CI15","v":0},"Y13",null,13,{"$f":"IF(AND(K27=0,L27=0),\"\",IF(K27>L27,I26,I28))","v":""},null,null,null,null,null,null,null,null,null,null,null,null,26,null,null,null,null,null,null,null,null,null,null,null,null,null,37,null,null,null,null,null,null,null,null,null,null,null,null,null,null,null,null,null,null,null,null,null,null,null,null,null,25,null,null,null,null,{"$f":"W7","v":""},{"$f":"W18","v":""}]
[null,null,null,null,null,null,null,"Y2",{"$f":"IF(AND(D5=0,E5=0),\"\",IF(D5<E5,B4,B6))","v":""},null,null,null,null,null,null,null,null,null,null,null,null,null,null,null,{"$f":"CH28","v":0},{"$f":"+CI28","v":0},"Y26",null,null,{"$f":"IF(AND(Y28=0,Z28=0),\"\",IF(Y28>Z28,W26,W30))","v":""},null,null,null,null,null,null,null,null,null,null,null,null,null,null,null,null,null,null,null,null,null,null,null,null,null,null,null,null,null,null,null,null,null,null,null,null,null,null,26,null,null,null,null,{"$f":"W26","v":""},{"$f":"W30","v":""}]
[null,null,null,null,null,null,null,null,null,null,null,null,null,null,"Y11",{"$f":"IF(AND(K16=0,L16=0),\"\",IF(K16<L16,I14,I17))","v":""},null,null,null,null,null,null,null,null,null,null,null,null,null,null,null,null,null,null,null,null,null,null,null,null,null,null,null,null,null,null,null,null,null,null,null,null,null,null,null,null,null,null,null,null,null,null,null,null,null,null,null,null,27,null,null,null,null,{"$f":"W34","v":""},{"$f":"W38","v":""}]
[null,null,null,null,null,null,null,"Y3",{"$f":"IF(AND(D8=0,E8=0),\"\",IF(D8<E8,B7,B9))","v":""},null,null,null,null,null,null,null,null,{"$f":"CH22","v":0},{"$f":"CI22","v":0},"Y20",null,20,{"$f":"IF(AND(R30=0,S30=0),\"\",IF(R30>S30,P29,P31))","v":""},null,null,null,null,null,null,null,null,null,null,null,null,null,null,null,{"$f":"CH39","v":0},{"$f":"+CI39","v":0},"Y37",null,null,{"$f":"IF(AND(AM30=0,AN30=0),\"\",IF(AM30>AN30,AK26,AK34))","v":""},null,null,null,null,null,null,null,null,null,null,null,null,null,null,null,null,null,null,null,null,null,null,null,null,28,null,null,null,null,{"$f":"W44","v":""},{"$f":"W46","v":""}]
[null,null,null,null,null,null,null,null,null,null,{"$f":"CH16","v":0},{"$f":"CI16","v":0},"Y14",null,14,{"$f":"IF(AND(K31=0,L31=0),\"\",IF(K31>L31,I30,I32))","v":""},null,null,null,null,null,null,null,null,null,null,null,null,null,null,null,null,null,null,null,null,null,null,null,null,null,null,null,null,null,null,null,null,null,"Y39",{"$f":"IF(AND(AT25=0,AU25=0),\"\",IF(AT25<AU25,AR20,AR30))","v":""},null,null,null,null,null,"3.",null,null,null,null,null,null,null,null,null,null,null,29,null,null,null,null,{"$f":"W48","v":""},{"$f":"W50","v":""}]
[null,null,null,null,null,null,null,"Y4",{"$f":"IF(AND(D11=0,E11=0),\"\",IF(D11<E11,B10,B12))","v":""},null,null,null,null,null,null,null,null,null,null,null,null,null,null,null,null,null,null,null,"Y18",{"$f":"IF(AND(R19=0,S19=0),\"\",IF(R19<S19,P16,P21))","v":""},null,null,null,null,null,null,null,null,null,null,null,null,null,null,null,null,null,null,null,null,null,null,null,null,null,null,null,null,null,null,null,null,null,null,null,null,null,null,30,null,null,null,null,{"$f":"W54","v":""},{"$f":"W58","v":""}]
[null,null,null,null,null,null,null,null,null,null,null,null,null,null,"Y10",{"$f":"IF(AND(K10=0,L10=0),\"\",IF(K10<L10,I8,I11))","v":""},null,null,null,null,null,null,null,null,null,null,null,null,null,null,null,null,null,null,null,33,null,null,null,null,null,null,null,null,null,null,null,null,null,null,null,null,null,null,null,null,null,null,null,null,null,null,null,null,null,null,null,null,31,null,null,null,null,{"$f":"W60","v":""},{"$f":"W62","v":""}]
[null,null,null,null,null,null,null,"Y5",{"$f":"IF(AND(D14=0,E14=0),\"\",IF(D14<E14,B13,B15))","v":""},null,null,null,null,null,null,null,null,{"$f":"CH23","v":0},{"$f":"CI23","v":0},"Y21",null,21,{"$f":"IF(AND(R34=0,S34=0),\"\",IF(R34>S34,P33,P35))","v":""},null,null,null,null,null,null,null,null,{"$f":"CH35","v":0},{"$f":"+CI35","v":0},"Y33",null,null,{"$f":"IF(AND(AF34=0,AG34=0),\"\",IF(AF34>AG34,AD32,AD36))","v":""},null,null,null,null,null,null,null,null,null,null,null,null,null,null,null,null,null,null,null,null,null,null,null,null,null,null,null,null,null,null,null,32,null,null,null,null,{"$f":"AD24","v":""},{"$f":"AD28","v":""}]
[null,null,null,null,null,null,null,null,null,null,{"$f":"CH17","v":0},{"$f":"CI17","v":0},"Y15",null,15,{"$f":"IF(AND(K35=0,L35=0),\"\",IF(K35>L35,I34,I36))","v":""},null,null,null,null,null,null,null,null,null,null,null,null,27,null,null,null,null,null,null,null,null,null,null,null,null,null,"Y37",{"$f":"IF(AND(AM30=0,AN30=0),\"\",IF(AM30<AN30,AK26,AK34))","v":""},null,null,null,null,null,null,"4.",null,null,null,null,null,null,null,null,null,null,null,null,null,null,null,null,null,33,null,null,null,null,{"$f":"AD32","v":""},{"$f":"AD36","v":""}]
[null,null,null,null,null,null,null,"Y6",{"$f":"IF(AND(D17=0,E17=0),\"\",IF(D17<E17,B16,B18))","v":""},null,null,null,null,null,null,null,null,null,null,null,null,null,null,null,{"$f":"CH29","v":0},{"$f":"+CI29","v":0},"Y27",null,null,{"$f":"IF(AND(Y36=0,Z36=0),\"\",IF(Y36>Z36,W34,W38))","v":""},null,null,null,null,null,null,null,null,null,null,null,null,null,null,null,null,null,null,null,null,null,null,null,null,null,null,null,null,null,null,null,null,null,null,null,null,null,null,34,null,null,null,null,{"$f":"AD41","v":""},{"$f":"AD43","v":""}]
[null,null,null,null,null,null,null,null,null,null,null,null,null,null,"Y9",{"$f":"IF(AND(K4=0,L4=0),\"\",IF(K4<L4,I2,I5))","v":""},null,null,null,null,null,null,null,null,null,null,null,null,null,null,null,null,null,null,null,"Y32",{"$f":"IF(AND(AF26=0,AG26=0),\"\",IF(AF26<AG26,AD24,AD28))","v":""},null,null,null,null,null,null,null,null,null,null,null,null,null,null,null,null,null,null,null,null,null,null,null,null,null,null,null,null,null,null,null,35,null,null,null,null,{"$f":"AD45","v":""},{"$f":"AD49","v":""}]
[null,null,null,null,null,null,null,"Y7",{"$f":"IF(AND(D20=0,E20=0),\"\",IF(D20<E20,B19,B21))","v":""},null,null,null,null,null,null,null,null,{"$f":"CH24","v":0},{"$f":"CI24","v":0},"Y22",null,22,{"$f":"IF(AND(R38=0,S38=0),\"\",IF(R38>S38,P37,P39))","v":""},null,null,null,null,null,null,null,null,null,null,null,null,null,null,null,{"$f":"CH40","v":0},{"$f":"+CI40","v":0},"Y38",null,38,{"$f":"IF(AND(AM38=0,AN38=0),\"\",IF(AM38>AN38,AK37,AK39))","v":""},null,null,null,null,null,null,"5.",null,null,null,null,null,null,null,null,null,null,null,null,null,null,null,null,null,36,null,null,null,null,{"$f":"AD51","v":""},{"$f":"AD53","v":""}]
[null,null,null,null,null,null,null,null,null,null,{"$f":"CH18","v":0},{"$f":"CI18","v":0},"Y16",null,16,{"$f":"IF(AND(K39=0,L39=0),\"\",IF(K39>L39,I38,I40))","v":""},null,null,null,null,null,null,null,null,null,null,null,null,null,null,null,null,null,null,null,"Y33",{"$f":"IF(AND(AF34=0,AG34=0),\"\",IF(AF34<AG34,AD32,AD36))","v":""},null,null,null,null,null,null,null,null,null,null,null,null,null,null,null,null,null,null,null,null,null,null,null,null,null,null,null,null,null,null,null,37,null,null,null,null,{"$f":"AK26","v":""},{"$f":"AK34","v":""}]
[null,null,null,null,null,null,null,"Y8",{"$f":"IF(AND(D23=0,E23=0),\"\",IF(D23<E23,B22,B24))","v":""},null,null,null,null,null,null,null,null,null,null,null,null,null,null,null,null,null,null,null,null,null,null,null,null,null,null,null,null,null,null,null,null,null,"Y38",{"$f":"IF(AND(AM38=0,AN38=0),\"\",IF(AM38<AN38,AK37,AK39))","v":""},null,null,null,null,null,null,"6.",null,null,null,null,null,null,null,null,null,null,null,null,null,null,null,null,null,38,null,null,null,null,{"$f":"AK37","v":""},{"$f":"AK39","v":""}]
[null,null,null,null,null,null,null,null,null,null,null,null,null,null,null,null,null,null,null,null,null,null,null,null,null,null,null,null,"Y26",{"$f":"IF(AND(Y28=0,Z28=0),\"\",IF(Y28<Z28,W26,W30))","v":""},null,null,null,null,null,null,null,null,null,null,null,null,null,null,null,null,null,null,null,null,null,null,null,null,null,null,null,null,null,null,null,null,null,null,null,null,null,null,39,null,null,null,null,{"$f":"AR20","v":""},{"$f":"AR30","v":""}]
[null,null,null,null,null,null,null,null,null,null,null,null,null,null,null,null,null,null,null,null,null,null,null,null,null,null,null,null,null,null,null,{"$f":"CH36","v":0},{"$f":"+CI36","v":0},"Y34",null,34,{"$f":"IF(AND(AF42=0,AG42=0),\"\",IF(AF42>AG42,AD41,AD43))","v":""},null,null,null,null,null,null,"7.",null,null,null,null,null,null,null,null,null,null,null,null,null,null,null,null,null,null,null,null,null,null,null,null,40,null,null,null,null,{"$f":"AY13","v":""},{"$f":"AY25","v":""}]
[null,null,null,null,null,null,null,null,null,null,null,null,null,null,null,null,null,null,null,null,null,null,null,null,null,null,null,null,"Y27",{"$f":"IF(AND(Y36=0,Z36=0),\"\",IF(Y36<Z36,W34,W38))","v":""}]
[null,null,null,null,null,null,null,null,null,null,null,null,null,null,null,null,null,null,null,null,null,"Y19",{"$f":"IF(AND(R26=0,S26=0),\"\",IF(R26<S26,P25,P27))","v":""},null,null,null,null,null,null,null,null,null,null,null,null,"Y34",{"$f":"IF(AND(AF42=0,AG42=0),\"\",IF(AF42<AG42,AD41,AD43))","v":""},null,null,null,null,null,null,"8."]
[null,null,null,null,null,null,null,null,null,null,null,null,null,null,null,null,null,null,null,null,null,null,null,null,{"$f":"CH30","v":0},{"$f":"+CI30","v":0},"Y28",null,28,{"$f":"IF(AND(Y45=0,Z45=0),\"\",IF(Y45>Z45,W44,W46))","v":""}]
[null,null,null,null,null,null,null,null,null,null,null,null,null,null,null,null,null,null,null,null,null,"Y20",{"$f":"IF(AND(R30=0,S30=0),\"\",IF(R30<S30,P29,P31))","v":""},null,null,null,null,null,null,null,null,null,null,null,null,35]
[null,null,null,null,null,null,null,null,null,null,null,null,null,null,null,null,null,null,null,null,null,null,null,null,null,null,null,null,null,null,null,{"$f":"CH37","v":0},{"$f":"+CI37","v":0},"Y35",null,null,{"$f":"IF(AND(AF47=0,AG47=0),\"\",IF(AF47>AG47,AD45,AD49))","v":""},null,null,null,null,null,null,"9."]
[null,null,null,null,null,null,null,null,null,null,null,null,null,null,null,null,null,null,null,null,null,"Y21",{"$f":"IF(AND(R34=0,S34=0),\"\",IF(R34<S34,P33,P35))","v":""}]
[null,null,null,null,null,null,null,null,null,null,null,null,null,null,null,null,null,null,null,null,null,null,null,null,{"$f":"CH31","v":0},{"$f":"+CI31","v":0},"Y29",null,29,{"$f":"IF(AND(Y49=0,Z49=0),\"\",IF(Y49>Z49,W48,W50))","v":""}]
[null,null,null,null,null,null,null,null,null,null,null,null,null,null,null,null,null,null,null,null,null,"Y22",{"$f":"IF(AND(R38=0,S38=0),\"\",IF(R38<S38,P37,P39))","v":""},null,null,null,null,null,null,null,null,null,null,null,null,"Y35",{"$f":"IF(AND(AF47=0,AG47=0),\"\",IF(AF47<AG47,AD45,AD49))","v":""},null,null,null,null,null,null,"10."]
[null,null,null,null,null,null,null,null,null,null,null,null,null,null,null,null,null,null,null,null,null,null,null,null,null,null,null,null,"Y28",{"$f":"IF(AND(Y45=0,Z45=0),\"\",IF(Y45<Z45,W44,W46))","v":""}]
[null,null,null,null,null,null,null,null,null,null,null,null,null,null,null,null,null,null,null,null,null,null,null,null,null,null,null,null,null,null,null,{"$f":"CH38","v":0},{"$f":"+CI38","v":0},"Y36",null,36,{"$f":"IF(AND(AF52=0,AG52=0),\"\",IF(AF52>AG52,AD51,AD53))","v":""},null,null,null,null,null,null,"11."]
[null,null,null,null,null,null,null,null,null,null,null,null,null,null,"Y13",{"$f":"IF(AND(K27=0,L27=0),\"\",IF(K27<L27,I26,I28))","v":""},null,null,null,null,null,null,null,null,null,null,null,null,"Y29",{"$f":"IF(AND(Y49=0,Z49=0),\"\",IF(Y49<Z49,W48,W50))","v":""}]
[null,null,null,null,null,null,null,null,null,null,null,null,null,null,null,null,null,{"$f":"CH25","v":0},{"$f":"CI25","v":0},"Y23",null,23,{"$f":"IF(AND(R54=0,S54=0),\"\",IF(R54>S54,P53,P55))","v":""},null,null,null,null,null,null,null,null,null,null,null,null,"Y36",{"$f":"IF(AND(AF52=0,AG52=0),\"\",IF(AF52<AG52,AD51,AD53))","v":""},null,null,null,null,null,null,"12."]
[null,null,null,null,null,null,null,null,null,null,null,null,null,null,"Y14",{"$f":"IF(AND(K31=0,L31=0),\"\",IF(K31<L31,I30,I32))","v":""},null,null,null,null,null,null,null,null,null,null,null,null,30]
[null,null,null,null,null,null,null,null,null,null,null,null,null,null,null,null,null,null,null,null,null,null,null,null,{"$f":"CH32","v":0},{"$f":"+CI32","v":0},"Y30",null,null,{"$f":"IF(AND(Y56=0,Z56=0),\"\",IF(Y56>Z56,W54,W58))","v":""},null,null,null,null,null,null,"13."]
[null,null,null,null,null,null,null,null,null,null,null,null,null,null,"Y15",{"$f":"IF(AND(K35=0,L35=0),\"\",IF(K35<L35,I34,I36))","v":""}]
[null,null,null,null,null,null,null,null,null,null,null,null,null,null,null,null,null,{"$f":"CH26","v":0},{"$f":"CI26","v":0},"Y24",null,24,{"$f":"IF(AND(R58=0,S58=0),\"\",IF(R58>S58,P57,P59))","v":""}]
[null,null,null,null,null,null,null,null,null,null,null,null,null,null,"Y16",{"$f":"IF(AND(K39=0,L39=0),\"\",IF(K39<L39,I38,I40))","v":""},null,null,null,null,null,null,null,null,null,null,null,null,"Y30",{"$f":"IF(AND(Y56=0,Z56=0),\"\",IF(Y56<Z56,W54,W58))","v":""},null,null,null,null,null,null,"14."]
[null,null,null,null,null,null,null,null,null,null,null,null,null,null,null,null,null,null,null,null,null,"Y23",{"$f":"IF(AND(R54=0,S54=0),\"\",IF(R54<S54,P53,P55))","v":""}]
[null,null,null,null,null,null,null,null,null,null,null,null,null,null,null,null,null,null,null,null,null,null,null,null,{"$f":"CH33","v":0},{"$f":"+CI33","v":0},"Y31",null,31,{"$f":"IF(AND(Y61=0,Z61=0),\"\",IF(Y61>Z61,W60,W62))","v":""},null,null,null,null,null,null,"15."]
[null,null,null,null,null,null,null,null,null,null,null,null,null,null,null,null,null,null,null,null,null,"Y24",{"$f":"IF(AND(R58=0,S58=0),\"\",IF(R58<S58,P57,P59))","v":""}]
[null,null,null,null,null,null,null,null,null,null,null,null,null,null,null,null,null,null,null,null,null,null,null,null,null,null,null,null,"Y31",{"$f":"IF(AND(Y61=0,Z61=0),\"\",IF(Y61<Z61,W60,W62))","v":""},null,null,null,null,null,null,"16."]

{"sheet":"16(8DE)","index":9,"n_rows":41,"n_cols":105,"rows_kept":41,"cut":false,"hidden":true,"merged":[[32,15,32,21],[37,22,37,28],[39,22,39,28],[28,22,28,28],[40,29,40,35],[35,36,35,42],[38,29,38,35],[31,22,31,28],[20,1,20,7],[20,15,20,21],[21,1,21,7],[22,8,22,14],[27,36,27,42],[24,29,24,35],[26,15,26,21],[30,15,30,21],[29,29,29,35],[22,36,22,42],[23,1,23,7],[22,22,22,28],[24,15,24,21],[19,8,19,14],[12,1,12,7],[17,1,17,7],[17,22,17,28],[18,1,18,7],[18,22,18,28],[13,8,13,14],[14,1,14,7],[15,1,15,7],[15,15,15,21],[16,8,16,14],[8,1,8,7],[8,15,8,21],[9,1,9,7],[10,8,10,14],[11,1,11,7],[4,8,4,14],[5,1,5,7],[6,1,6,7],[6,22,6,28],[7,8,7,14],[3,26,4,48],[0,1,0,7],[1,8,1,14],[2,1,2,7],[3,1,3,7],[3,15,3,21],[0,26,2,48],[26,50,26,56],[32,29,32,35],[33,36,33,42],[34,29,34,35],[30,36,30,42],[28,43,28,49],[18,50,18,56],[12,43,12,49],[25,43,25,49],[25,22,25,28],[1,77,1,78],[1,67,1,68],[1,69,1,70],[1,71,1,72],[1,73,1,74],[1,75,1,76]]}
[1,{"$f":"IF(#REF!=2,Eleme!#REF!,IF(#REF!=3,Eleme!#REF!,IF(#REF!=4,Eleme!#REF!,IF(#REF!=5,Eleme!#REF!,IF(#REF!=6,Eleme!#REF!)))))","v":{"$error":"#REF!"}},null,null,null,null,null,null,null,null,null,null,null,null,null,null,null,null,null,null,null,null,null,null,null,null,{"$f":"Katılım!AC1","v":"TÜRKİYE MASA TENİSİ FEDERASYONU\nKÜÇÜKLER KUZEYBATI BÖLGESİ YARIŞMALARI"},null,null,null,null,null,null,null,null,null,null,null,null,null,null,null,null,null,null,null,null,null,null,null,null,null,null,null,null,null,null,null,null,null,null,null,null,null,null,null,null,null,null,null,null,null,null,null,null,null,null,null,null,null,null,null,null,null,null,null,null,null,null,null,null,null,null,null,null,null,null,null,null,null,null,null,null,"1st Round",1]
[null,null,null,{"$f":"BZ3","v":0},{"$f":"CA3","v":0},null,null,1,{"$f":"IF(AND(D2=0,E2=0),\"\",IF(D2>E2,B1,B3))","v":""},null,null,null,null,null,null,null,null,null,null,null,null,null,null,null,null,null,null,null,null,null,null,null,null,null,null,null,null,null,null,null,null,null,null,null,null,null,null,null,null,null,null,null,null,null,null,null,null,null,null,null,"#","Date","Time","Table","Competition","Player A","Player B","Set1",null,"Set2",null,"Set3",null,"Set4",null,"Set5",null,"Result",null,null,null,null,null,null,null,null,null,null,null,null,null,null,null,null,null,null,null,null,null,null,null,null,null,"2sn Round"]
[2,{"$f":"IF(#REF!=2,Eleme!#REF!,IF(#REF!=3,Eleme!#REF!,IF(#REF!=4,Eleme!#REF!,IF(#REF!=5,Eleme!#REF!,IF(#REF!=6,Eleme!#REF!)))))","v":{"$error":"#REF!"}},null,null,null,null,null,null,null,null,null,null,null,null,9,null,null,null,null,null,null,null,null,null,null,null,null,null,null,null,null,null,null,null,null,null,null,null,null,null,null,null,null,null,null,null,null,null,null,null,null,null,null,null,null,null,null,null,null,null,1,null,null,null,null,{"$f":"B1","v":{"$error":"#REF!"}},{"$f":"B3","v":{"$error":"#REF!"}},null,null,null,null,null,null,null,null,null,null,null,null,null,null,null,null,null,null,null,null,null,null,null,null,null,null,null,null,null,null,null,null,null,null,null,null,"3th Round"]
[3,{"$f":"IF(#REF!=2,Eleme!#REF!,IF(#REF!=3,Eleme!#REF!,IF(#REF!=4,Eleme!#REF!,IF(#REF!=5,Eleme!#REF!,IF(#REF!=6,Eleme!#REF!)))))","v":{"$error":"#REF!"}},null,null,null,null,null,null,null,null,{"$f":"+BZ11","v":0},{"$f":"+CA11","v":0},"Y1",null,null,{"$f":"IF(AND(K4=0,L4=0),\"\",IF(K4>L4,I2,I5))","v":""},null,null,null,null,null,null,null,null,null,null,{"$f":"Katılım!AC2&\" \"&Katılım!AE3","v":"ERKEK TAKIM  [12-13 Mart 2025 KOCAELİ] [ Ana Tablo ]"},null,null,null,null,null,null,null,null,null,null,null,null,null,null,null,null,null,null,null,null,null,null,null,null,null,null,null,null,null,null,null,null,null,2,null,null,null,null,{"$f":"B4","v":{"$error":"#REF!"}},{"$f":"B6","v":{"$error":"#REF!"}},null,null,null,null,null,null,null,null,null,null,null,null,null,null,null,null,null,null,null,null,null,null,null,null,null,null,null,null,null,null,null,null,null,null,null,null,"4th Round"]
[null,null,null,{"$f":"BZ4","v":0},{"$f":"CA4","v":0},null,null,2,{"$f":"IF(AND(D5=0,E5=0),\"\",IF(D5>E5,B4,B6))","v":""},null,null,null,null,null,null,null,null,null,null,null,null,13,null,null,null,null,null,null,null,null,null,null,null,null,null,null,null,null,null,null,null,null,null,null,null,null,null,null,null,null,null,null,null,null,null,null,null,null,null,null,3,null,null,null,null,{"$f":"B7","v":{"$error":"#REF!"}},{"$f":"B9","v":{"$error":"#REF!"}},null,null,null,null,null,null,null,null,null,null,null,null,null,null,null,null,null,null,null,null,null,null,null,null,null,null,null,null,null,null,null,null,null,null,null,null,"5th Round"]
[4,{"$f":"IF(#REF!=2,Eleme!#REF!,IF(#REF!=3,Eleme!#REF!,IF(#REF!=4,Eleme!#REF!,IF(#REF!=5,Eleme!#REF!,IF(#REF!=6,Eleme!#REF!)))))","v":{"$error":"#REF!"}},null,null,null,null,null,null,null,null,null,null,null,null,null,null,null,null,null,null,null,null,null,null,null,null,null,null,null,null,null,null,null,null,null,null,null,null,null,null,null,null,null,null,null,null,null,null,null,null,null,null,null,null,null,null,null,null,null,null,4,null,null,null,null,{"$f":"B10","v":{"$error":"#REF!"}},{"$f":"B12","v":{"$error":"#REF!"}},null,null,null,null,null,null,null,null,null,null,null,null,null,null,null,null,null,null,null,null,null,null,null,null,null,null,null,null,null,null,null,null,null,null,null,null,"6th Round"]
[5,{"$f":"IF(#REF!=2,Eleme!#REF!,IF(#REF!=3,Eleme!#REF!,IF(#REF!=4,Eleme!#REF!,IF(#REF!=5,Eleme!#REF!,IF(#REF!=6,Eleme!#REF!)))))","v":{"$error":"#REF!"}},null,null,null,null,null,null,null,null,null,null,null,null,null,null,null,{"$f":"+BZ15","v":0},{"$f":"+CA15","v":0},"Y5",null,null,{"$f":"IF(AND(R7=0,S7=0),\"\",IF(R7>S7,P4,P9))","v":""},null,null,null,null,null,null,null,null,null,null,null,null,null,null,null,null,null,null,null,null,null,null,null,null,null,null,null,null,null,null,null,null,null,null,null,null,null,5,null,null,null,null,{"$f":"B13","v":{"$error":"#REF!"}},{"$f":"B15","v":{"$error":"#REF!"}},null,null,null,null,null,null,null,null,null,null,null,null,null,null,null,null,null,null,null,null,null,null,null,null,null,null,null,null,null,null,null,null,null,null,null,null,"7th Round"]
[null,null,null,{"$f":"BZ5","v":0},{"$f":"CA5","v":0},null,null,3,{"$f":"IF(AND(D8=0,E8=0),\"\",IF(D8>E8,B7,B9))","v":""},null,null,null,null,null,null,null,null,null,null,null,null,null,null,null,null,null,null,null,17,null,null,null,null,null,null,null,null,null,null,null,null,null,null,null,null,null,null,null,null,null,null,null,null,null,null,null,null,null,null,null,6,null,null,null,null,{"$f":"B16","v":{"$error":"#REF!"}},{"$f":"B18","v":{"$error":"#REF!"}}]
[6,{"$f":"IF(#REF!=2,Eleme!#REF!,IF(#REF!=3,Eleme!#REF!,IF(#REF!=4,Eleme!#REF!,IF(#REF!=5,Eleme!#REF!,IF(#REF!=6,Eleme!#REF!)))))","v":{"$error":"#REF!"}},null,null,null,null,null,null,null,null,null,null,null,null,10,{"$f":"IF(AND(K10=0,L10=0),\"\",IF(K10>L10,I8,I11))","v":""},null,null,null,null,null,null,null,null,null,null,null,null,null,null,null,null,null,null,null,null,null,null,null,null,null,null,null,null,null,null,null,null,null,null,null,null,null,null,null,null,null,null,null,null,7,null,null,null,null,{"$f":"B19","v":{"$error":"#REF!"}},{"$f":"B21","v":{"$error":"#REF!"}}]
[7,{"$f":"IF(#REF!=2,Eleme!#REF!,IF(#REF!=3,Eleme!#REF!,IF(#REF!=4,Eleme!#REF!,IF(#REF!=5,Eleme!#REF!,IF(#REF!=6,Eleme!#REF!)))))","v":{"$error":"#REF!"}},null,null,null,null,null,null,null,null,{"$f":"+BZ12","v":0},{"$f":"+CA12","v":0},"Y2",null,null,null,null,null,null,null,null,null,null,null,null,null,null,null,null,null,null,null,null,null,null,null,null,null,null,null,null,null,null,null,null,null,null,null,null,null,null,null,null,null,null,null,null,null,null,null,8,null,null,null,null,{"$f":"B22","v":{"$error":"#REF!"}},{"$f":"B24","v":{"$error":"#REF!"}}]
[null,null,null,{"$f":"BZ6","v":0},{"$f":"CA6","v":0},null,null,4,{"$f":"IF(AND(D11=0,E11=0),\"\",IF(D11>E11,B10,B12))","v":""},null,null,null,null,null,null,null,null,null,null,null,null,null,null,null,null,null,null,null,null,null,null,null,null,null,null,null,null,null,null,null,null,null,null,null,null,null,null,null,null,null,null,null,null,null,null,null,null,null,null,null,9,null,null,null,null,{"$f":"I2","v":""},{"$f":"I5","v":""}]
[8,{"$f":"IF(#REF!=2,Eleme!#REF!,IF(#REF!=3,Eleme!#REF!,IF(#REF!=4,Eleme!#REF!,IF(#REF!=5,Eleme!#REF!,IF(#REF!=6,Eleme!#REF!)))))","v":{"$error":"#REF!"}},null,null,null,null,null,null,null,null,null,null,null,null,null,null,null,null,null,null,null,null,null,null,null,null,null,null,null,null,null,null,null,null,null,null,null,null,null,null,null,null,null,null,null,null,null,null,null,null,null,null,null,null,null,null,null,null,null,null,10,null,null,null,null,{"$f":"I8","v":""},{"$f":"I11","v":""}]
[9,{"$f":"IF(#REF!=2,Eleme!#REF!,IF(#REF!=3,Eleme!#REF!,IF(#REF!=4,Eleme!#REF!,IF(#REF!=5,Eleme!#REF!,IF(#REF!=6,Eleme!#REF!)))))","v":{"$error":"#REF!"}},null,null,null,null,null,null,null,null,null,null,null,null,null,null,null,null,null,null,null,null,null,null,{"$f":"+BZ19","v":0},{"$f":"+CA19","v":0},"Y9",null,null,null,null,null,null,null,null,null,null,null,null,null,null,null,null,{"$f":"IF(AND(Y13=0,Z13=0),\"\",IF(Y13>Z13,W7,W18))","v":""},null,null,null,null,null,null,null,null,null,null,null,null,null,null,null,null,11,null,null,null,null,{"$f":"I14","v":""},{"$f":"I17","v":""}]
[null,null,null,{"$f":"BZ7","v":0},{"$f":"CA7","v":0},null,null,5,{"$f":"IF(AND(D14=0,E14=0),\"\",IF(D14>E14,B13,B15))","v":""},null,null,null,null,null,null,null,null,null,null,null,null,null,null,null,null,null,null,null,null,null,null,null,null,null,null,null,null,null,null,null,null,null,null,null,null,null,null,null,null,24,null,null,null,null,null,null,null,null,null,null,12,null,null,null,null,{"$f":"I20","v":""},{"$f":"I23","v":""}]
[10,{"$f":"IF(#REF!=2,Eleme!#REF!,IF(#REF!=3,Eleme!#REF!,IF(#REF!=4,Eleme!#REF!,IF(#REF!=5,Eleme!#REF!,IF(#REF!=6,Eleme!#REF!)))))","v":{"$error":"#REF!"}},null,null,null,null,null,null,null,null,null,null,null,null,11,null,null,null,null,null,null,null,null,null,null,null,null,null,null,null,null,null,null,null,null,null,null,null,null,null,null,null,null,null,null,null,null,null,null,null,null,null,null,null,null,null,null,null,null,null,13,null,null,null,null,{"$f":"P4","v":""},{"$f":"P9","v":""}]
[11,{"$f":"IF(#REF!=2,Eleme!#REF!,IF(#REF!=3,Eleme!#REF!,IF(#REF!=4,Eleme!#REF!,IF(#REF!=5,Eleme!#REF!,IF(#REF!=6,Eleme!#REF!)))))","v":{"$error":"#REF!"}},null,null,null,null,null,null,null,null,{"$f":"+BZ13","v":0},{"$f":"+CA13","v":0},"Y3",null,null,{"$f":"IF(AND(K16=0,L16=0),\"\",IF(K16>L16,I14,I17))","v":""},null,null,null,null,null,null,null,null,null,null,null,null,null,null,null,null,null,null,null,null,null,null,null,null,null,null,null,null,null,null,null,null,null,null,null,null,null,null,null,null,null,null,null,null,14,null,null,null,null,{"$f":"P16","v":""},{"$f":"P21","v":""}]
[null,null,null,{"$f":"BZ8","v":0},{"$f":"CA8","v":0},null,null,6,{"$f":"IF(AND(D17=0,E17=0),\"\",IF(D17>E17,B16,B18))","v":""},null,null,null,null,null,null,null,null,null,null,null,null,14,null,null,null,null,null,null,null,null,null,null,null,null,null,null,null,null,null,null,null,null,null,null,null,null,null,null,null,null,null,null,null,null,null,null,null,null,null,null,15,null,null,null,null,{"$f":"P25","v":""},{"$f":"P27","v":""}]
[12,{"$f":"IF(#REF!=2,Eleme!#REF!,IF(#REF!=3,Eleme!#REF!,IF(#REF!=4,Eleme!#REF!,IF(#REF!=5,Eleme!#REF!,IF(#REF!=6,Eleme!#REF!)))))","v":{"$error":"#REF!"}},null,null,null,null,null,null,null,null,null,null,null,null,null,null,null,null,null,null,null,null,{"$f":"IF(AND(R19=0,S19=0),\"\",IF(R19>S19,P16,P21))","v":""},null,null,null,null,null,null,null,null,null,null,null,null,null,null,null,null,null,null,null,null,null,null,null,null,null,null,null,null,null,null,null,null,null,null,null,null,null,16,null,null,null,null,{"$f":"P31","v":""},{"$f":"P33","v":""}]
[13,{"$f":"IF(#REF!=2,Eleme!#REF!,IF(#REF!=3,Eleme!#REF!,IF(#REF!=4,Eleme!#REF!,IF(#REF!=5,Eleme!#REF!,IF(#REF!=6,Eleme!#REF!)))))","v":{"$error":"#REF!"}},null,null,null,null,null,null,null,null,null,null,null,null,null,null,null,{"$f":"+BZ16","v":0},{"$f":"+CA16","v":0},"Y6",null,null,null,null,null,null,null,null,null,null,null,null,null,null,null,null,null,null,null,null,null,null,null,null,null,{"$f":"+BZ26","v":0},{"$f":"+CA26","v":0},"Y16",null,null,{"$f":"IF(AND(AT19=0,AU19=0),\"\",IF(AT19>AU19,AR13,AR26))","v":""},null,null,null,null,null,null,"1.",null,null,17,null,null,null,null,{"$f":"W7","v":""},{"$f":"W18","v":""}]
[null,null,null,{"$f":"BZ9","v":0},{"$f":"CA9","v":0},null,null,7,{"$f":"IF(AND(D20=0,E20=0),\"\",IF(D20>E20,B19,B21))","v":""},null,null,null,null,null,null,null,null,null,null,null,null,null,null,null,null,null,null,null,null,null,null,null,null,null,null,null,null,null,null,null,null,null,null,null,null,null,null,null,null,null,null,null,null,null,null,null,null,null,null,null,18,null,null,null,null,{"$f":"W23","v":""},{"$f":"W26","v":""}]
[14,{"$f":"IF(#REF!=2,Eleme!#REF!,IF(#REF!=3,Eleme!#REF!,IF(#REF!=4,Eleme!#REF!,IF(#REF!=5,Eleme!#REF!,IF(#REF!=6,Eleme!#REF!)))))","v":{"$error":"#REF!"}},null,null,null,null,null,null,null,null,null,null,null,null,12,{"$f":"IF(AND(K22=0,L22=0),\"\",IF(K22>L22,I20,I23))","v":""},null,null,null,null,null,null,null,null,null,null,null,null,null,null,null,null,null,null,null,null,null,null,null,null,null,null,null,null,null,null,null,null,null,null,null,null,null,null,null,null,null,null,null,null,19,null,null,null,null,{"$f":"W29","v":""},{"$f":"W32","v":""}]
[15,{"$f":"IF(#REF!=2,Eleme!#REF!,IF(#REF!=3,Eleme!#REF!,IF(#REF!=4,Eleme!#REF!,IF(#REF!=5,Eleme!#REF!,IF(#REF!=6,Eleme!#REF!)))))","v":{"$error":"#REF!"}},null,null,null,null,null,null,null,null,{"$f":"+BZ14","v":0},{"$f":"+CA14","v":0},"Y4",null,null,null,null,null,null,null,null,null,null,null,null,null,null,null,null,null,null,null,null,null,null,null,null,null,null,null,null,null,null,null,null,null,null,null,null,null,null,null,null,null,null,null,null,null,null,null,20,null,null,null,null,{"$f":"W38","v":""},{"$f":"W40","v":""}]
[null,null,null,{"$f":"BZ10","v":0},{"$f":"CA10","v":0},null,null,8,{"$f":"IF(AND(D23=0,E23=0),\"\",IF(D23>E23,B22,B24))","v":""},null,null,null,null,null,null,null,null,null,null,null,null,"Y6",{"$f":"IF(AND(R19=0,S19=0),\"\",IF(R19<S19,P16,P21))","v":""},null,null,null,null,null,null,null,null,null,null,null,null,"Y9",{"$f":"IF(AND(Y13=0,Z13=0),\"\",IF(Y13<Z13,W7,W18))","v":""},null,null,null,null,null,null,null,null,null,null,null,null,null,null,null,null,null,null,null,null,null,null,null,21,null,null,null,null,{"$f":"AD25","v":""},{"$f":"AD30","v":""}]
[16,{"$f":"IF(#REF!=2,Eleme!#REF!,IF(#REF!=3,Eleme!#REF!,IF(#REF!=4,Eleme!#REF!,IF(#REF!=5,Eleme!#REF!,IF(#REF!=6,Eleme!#REF!)))))","v":{"$error":"#REF!"}},null,null,null,null,null,null,null,null,null,null,null,null,null,null,null,null,null,null,null,null,null,null,null,null,null,null,18,null,null,null,null,null,null,null,null,null,null,null,null,null,23,null,null,null,null,null,null,null,null,null,null,null,null,null,null,null,null,null,22,null,null,null,null,{"$f":"AD33","v":""},{"$f":"AD35","v":""}]
[null,null,null,null,null,null,null,null,null,null,null,null,null,null,"Y1",{"$f":"IF(AND(K4=0,L4=0),\"\",IF(K4<L4,I2,I5))","v":""},null,null,null,null,null,null,null,null,{"$f":"+BZ20","v":0},{"$f":"+CA20","v":0},"Y10",null,null,{"$f":"IF(AND(Y25=0,Z25=0),\"\",IF(Y25>Z25,W23,W26))","v":""},null,null,null,null,null,null,null,null,null,null,null,null,null,null,null,null,null,null,null,null,null,null,null,null,null,null,null,null,null,null,23,null,null,null,null,{"$f":"AK23","v":""},{"$f":"AK28","v":""}]
[null,null,null,null,null,null,null,null,null,null,null,null,null,null,null,null,null,{"$f":"+BZ17","v":0},{"$f":"+CA17","v":0},"Y7",null,15,{"$f":"IF(AND(R26=0,S26=0),\"\",IF(R26>S26,P25,P27))","v":""},null,null,null,null,null,null,null,null,null,null,null,null,21,null,null,{"$f":"+BZ25","v":0},{"$f":"+CA25","v":0},"Y15",null,null,{"$f":"IF(AND(AM26=0,AN26=0),\"\",IF(AM26>AN26,AK23,AK28))","v":""},null,null,null,null,null,null,null,null,null,null,null,null,null,null,null,null,24,null,null,null,null,{"$f":"AR13","v":""},{"$f":"AR26","v":""}]
[null,null,null,null,null,null,null,null,null,null,null,null,null,null,"Y2",{"$f":"IF(AND(K10=0,L10=0),\"\",IF(K10<L10,I8,I11))","v":""},null,null,null,null,null,null,null,null,null,null,null,null,null,null,null,null,null,null,null,null,null,null,null,null,null,null,null,null,null,null,null,null,null,"Y16",{"$f":"IF(AND(AT19=0,AU19=0),\"\",IF(AT19<AU19,AR13,AR26))","v":""},null,null,null,null,null,null,"2."]
[null,null,null,null,null,null,null,null,null,null,null,null,null,null,null,null,null,null,null,null,null,null,null,null,null,null,null,null,null,null,null,{"$f":"+BZ23","v":0},{"$f":"+CA23","v":0},"Y13",null,null,{"$f":"IF(AND(AF28=0,AG28=0),\"\",IF(AF28>AG28,AD25,AD30))","v":""}]
[null,null,null,null,null,null,null,null,null,null,null,null,null,null,null,null,null,null,null,null,null,"Y5",{"$f":"IF(AND(R7=0,S7=0),\"\",IF(R7<S7,P4,P9))","v":""},null,null,null,null,null,null,null,null,null,null,null,null,null,null,null,null,null,null,null,"Y15",{"$f":"IF(AND(AM26=0,AN26=0),\"\",IF(AM26<AN26,AK23,AK28))","v":""},null,null,null,null,null,null,"3."]
[null,null,null,null,null,null,null,null,null,null,null,null,null,null,null,null,null,null,null,null,null,null,null,null,null,null,null,null,19,{"$f":"IF(AND(Y31=0,Z31=0),\"\",IF(Y31>Z31,W29,W32))","v":""}]
[null,null,null,null,null,null,null,null,null,null,null,null,null,null,"Y3",{"$f":"IF(AND(K16=0,L16=0),\"\",IF(K16<L16,I14,I17))","v":""},null,null,null,null,null,null,null,null,{"$f":"+BZ21","v":0},{"$f":"+CA21","v":0},"Y11",null,null,null,null,null,null,null,null,"Y13",{"$f":"IF(AND(AF28=0,AG28=0),\"\",IF(AF28<AG28,AD25,AD30))","v":""},null,null,null,null,null,null,"4."]
[null,null,null,null,null,null,null,null,null,null,null,null,null,null,null,null,null,{"$f":"+BZ18","v":0},{"$f":"+CA18","v":0},"Y8",null,16,{"$f":"IF(AND(R32=0,S32=0),\"\",IF(R32>S32,P31,P33))","v":""}]
[null,null,null,null,null,null,null,null,null,null,null,null,null,null,"Y4",{"$f":"IF(AND(K22=0,L22=0),\"\",IF(K22<L22,I20,I23))","v":""},null,null,null,null,null,null,null,null,null,null,null,null,"Y10",{"$f":"IF(AND(Y25=0,Z25=0),\"\",IF(Y25<Z25,W23,W26))","v":""}]
[null,null,null,null,null,null,null,null,null,null,null,null,null,null,null,null,null,null,null,null,null,null,null,null,null,null,null,null,null,null,null,{"$f":"+BZ24","v":0},{"$f":"+CA24","v":0},"Y14",null,22,{"$f":"IF(AND(AF34=0,AG34=0),\"\",IF(AF34>AG34,AD33,AD35))","v":""},null,null,null,null,null,null,"5."]
[null,null,null,null,null,null,null,null,null,null,null,null,null,null,null,null,null,null,null,null,null,null,null,null,null,null,null,null,"Y11",{"$f":"IF(AND(Y31=0,Z31=0),\"\",IF(Y31<Z31,W29,W32))","v":""}]
[null,null,null,null,null,null,null,null,null,null,null,null,null,null,null,null,null,null,null,null,null,null,null,null,null,null,null,null,null,null,null,null,null,null,null,"Y14",{"$f":"IF(AND(AF34=0,AG34=0),\"\",IF(AF34<AG34,AD33,AD35))","v":""},null,null,null,null,null,null,"6."]
[]
[null,null,null,null,null,null,null,null,null,null,null,null,null,null,null,null,null,null,null,null,null,"Y7",{"$f":"IF(AND(R26=0,S26=0),\"\",IF(R26<S26,P25,P27))","v":""}]
[null,null,null,null,null,null,null,null,null,null,null,null,null,null,null,null,null,null,null,null,null,null,null,null,{"$f":"+BZ22","v":0},{"$f":"+CA22","v":0},"Y12",null,20,{"$f":"IF(AND(Y39=0,Z39=0),\"\",IF(Y39>Z39,W38,W40))","v":""},null,null,null,null,null,null,"7."]
[null,null,null,null,null,null,null,null,null,null,null,null,null,null,null,null,null,null,null,null,null,"Y8",{"$f":"IF(AND(R32=0,S32=0),\"\",IF(R32<S32,P31,P33))","v":""}]
[null,null,null,null,null,null,null,null,null,null,null,null,null,null,null,null,null,null,null,null,null,null,null,null,null,null,null,null,"Y12",{"$f":"IF(AND(Y39=0,Z39=0),\"\",IF(Y39<Z39,W38,W40))","v":""},null,null,null,null,null,null,"8."]

{"sheet":"Ana Tablo","index":10,"n_rows":41,"n_cols":37,"rows_kept":41,"cut":false,"hidden":false,"merged":[[5,1,5,7],[6,8,6,14],[7,1,7,7],[8,1,8,7],[21,8,21,14],[8,15,8,21],[10,1,10,7],[11,1,11,7],[11,22,11,28],[12,8,12,14],[9,8,9,14],[19,1,19,7],[13,1,13,7],[13,15,13,21],[20,1,20,7],[20,15,20,21],[17,29,17,35],[18,8,18,14],[14,1,14,7],[15,8,15,14],[16,1,16,7],[17,1,17,7],[23,1,23,7],[24,8,24,14],[25,1,25,7],[25,15,25,21],[22,22,22,28],[22,1,22,7],[37,22,37,28],[32,15,32,21],[26,1,26,7],[27,8,27,14],[28,1,28,7],[30,15,30,21],[23,29,23,35],[30,29,30,35],[36,29,36,35],[40,29,40,35],[0,0,2,36],[3,0,4,36],[31,22,31,28],[35,22,35,28],[27,22,27,28],[29,22,29,28],[28,29,28,35],[33,29,33,35],[38,29,38,35],[39,22,39,28],[34,15,34,21],[36,15,36,21]]}
["TÜRKİYE MASA TENİSİ FEDERASYONU\nKÜÇÜKLER KUZEYBATI BÖLGESİ YARIŞMALARI"]
[]
[]
["ERKEK TAKIM  [12-13 Mart 2025 KOCAELİ] [ Ana Tablo ]"]
[]
[1,"FENERBAHÇE (A) (İST)"]
[null,null,null,3,0,null,null,1,"FENERBAHÇE (A) (İST)"]
[2,"TRAKER SPOR (B) (KRL)",null,null,null,null,null,null,null,null,null,null,null,null,9]
[3,"YALOVA BLD. GENÇLİK SPOR (B) (YLV)",null,null,null,null,null,null,null,null,3,0,"Y-A",null,null,"FENERBAHÇE (A) (İST)"]
[null,null,null,3,2,null,null,2,"YALOVA BLD. GENÇLİK SPOR (B) (YLV)",null,null,null,null,null,null,null,null,null,null,null,null,13]
[4,"BURSA B. ŞEH. BLD. SPOR (A) (BRS)"]
[5,"PENDİK BLD. SPOR (A) (İST)",null,null,null,null,null,null,null,null,null,null,null,null,null,null,null,3,1,"Y-E",null,null,"FENERBAHÇE (A) (İST)"]
[null,null,null,3,0,null,null,3,"PENDİK BLD. SPOR (A) (İST)",null,null,null,null,null,null,null,null,null,null,null,null,null,null,null,null,null,null,null,17]
[6,"D.S.İ. BENT SPOR (A) (ESK)",null,null,null,null,null,null,null,null,null,null,null,null,10,"YILDIZ RAKETLER (A) (İST)"]
[7,"PENDİK BLD. SPOR (C) (İST)",null,null,null,null,null,null,null,null,0,3,"Y-B"]
[null,null,null,0,3,null,null,4,"YILDIZ RAKETLER (A) (İST)"]
[8,"YILDIZ RAKETLER (A) (İST)"]
[9,"İSTANBUL DSİ (A) (İST)",null,null,null,null,null,null,null,null,null,null,null,null,null,null,null,null,null,null,null,null,null,null,3,2,"Y-I",null,null,"FENERBAHÇE (A) (İST)",null,null,null,null,null,null,"1."]
[null,null,null,3,2,null,null,5,"İSTANBUL DSİ (A) (İST)"]
[10,"İBB SPOR (A) (İST)",null,null,null,null,null,null,null,null,null,null,null,null,11]
[11,"LÜLEBURGAZ GENÇLİK SPOR  (A) (KRL)",null,null,null,null,null,null,null,null,3,1,"Y-C",null,null,"İSTANBUL DSİ (A) (İST)"]
[null,null,null,0,3,null,null,6,"ÇERKEZKÖY BLD. GSK (A) (TKD)",null,null,null,null,null,null,null,null,null,null,null,null,14]
[12,"ÇERKEZKÖY BLD. GSK (A) (TKD)",null,null,null,null,null,null,null,null,null,null,null,null,null,null,null,null,null,null,null,null,"İSTANBUL DSİ (A) (İST)"]
[13,"EDİRNE YURDUM SPOR (A) (EDR)",null,null,null,null,null,null,null,null,null,null,null,null,null,null,null,3,1,"Y-F",null,null,null,null,null,null,null,null,"I","İSTANBUL DSİ (A) (İST)",null,null,null,null,null,null,"2."]
[null,null,null,0,3,null,null,7,"TRAKER SPOR (A) (KRL)"]
[14,"TRAKER SPOR (A) (KRL)",null,null,null,null,null,null,null,null,null,null,null,null,12,"YALOVA BLD. GENÇLİK SPOR (A) (YLV)"]
[15,"YILDIZ RAKETLER (B) (İST)",null,null,null,null,null,null,null,null,2,3,"Y-D"]
[null,null,null,0,3,null,null,8,"YALOVA BLD. GENÇLİK SPOR (A) (YLV)",null,null,null,null,null,null,null,null,null,null,null,null,"E","YILDIZ RAKETLER (A) (İST)"]
[16,"YALOVA BLD. GENÇLİK SPOR (A) (YLV)",null,null,null,null,null,null,null,null,null,null,null,null,null,null,null,null,null,null,null,null,null,null,2,3,"Y-J",null,18,"YALOVA BLD. GENÇLİK SPOR (A) (YLV)",null,null,null,null,null,null,"3."]
[null,null,null,null,null,null,null,null,null,null,null,null,null,null,null,null,null,null,null,null,null,"F","YALOVA BLD. GENÇLİK SPOR (A) (YLV)"]
[null,null,null,null,null,null,null,null,null,null,null,null,null,null,"A","YALOVA BLD. GENÇLİK SPOR (B) (YLV)",null,null,null,null,null,null,null,null,null,null,null,null,"J","YILDIZ RAKETLER (A) (İST)",null,null,null,null,null,null,"4."]
[null,null,null,null,null,null,null,null,null,null,null,null,null,null,null,null,null,2,3,"Y-G",null,15,"PENDİK BLD. SPOR (A) (İST)"]
[null,null,null,null,null,null,null,null,null,null,null,null,null,null,"B","PENDİK BLD. SPOR (A) (İST)",null,null,null,null,null,null,null,null,null,null,null,null,19]
[null,null,null,null,null,null,null,null,null,null,null,null,null,null,null,null,null,null,null,null,null,null,null,null,2,3,"Y-K",null,null,"TRAKER SPOR (A) (KRL)",null,null,null,null,null,null,"5."]
[null,null,null,null,null,null,null,null,null,null,null,null,null,null,"C","ÇERKEZKÖY BLD. GSK (A) (TKD)"]
[null,null,null,null,null,null,null,null,null,null,null,null,null,null,null,null,null,0,3,"Y-H",null,16,"TRAKER SPOR (A) (KRL)"]
[null,null,null,null,null,null,null,null,null,null,null,null,null,null,"D","TRAKER SPOR (A) (KRL)",null,null,null,null,null,null,null,null,null,null,null,null,"K","PENDİK BLD. SPOR (A) (İST)",null,null,null,null,null,null,"6."]
[null,null,null,null,null,null,null,null,null,null,null,null,null,null,null,null,null,null,null,null,null,"G","YALOVA BLD. GENÇLİK SPOR (B) (YLV)"]
[null,null,null,null,null,null,null,null,null,null,null,null,null,null,null,null,null,null,null,null,null,null,null,null,1,3,"Y-L",null,20,"ÇERKEZKÖY BLD. GSK (A) (TKD)",null,null,null,null,null,null,"7."]
[null,null,null,null,null,null,null,null,null,null,null,null,null,null,null,null,null,null,null,null,null,"H","ÇERKEZKÖY BLD. GSK (A) (TKD)"]
[null,null,null,null,null,null,null,null,null,null,null,null,null,null,null,null,null,null,null,null,null,null,null,null,null,null,null,null,"L","YALOVA BLD. GENÇLİK SPOR (B) (YLV)",null,null,null,null,null,null,"8."]

{"sheet":"8DE","index":11,"n_rows":33,"n_cols":105,"rows_kept":33,"cut":false,"hidden":true,"merged":[[32,22,32,28],[25,29,25,35],[26,22,26,28],[27,29,27,35],[29,15,29,21],[30,22,30,28],[31,15,31,21],[24,22,24,28],[17,36,17,42],[18,15,18,21],[18,43,18,49],[19,8,19,14],[19,29,19,35],[20,15,20,21],[20,36,20,41],[21,8,21,14],[21,22,21,28],[22,15,22,21],[22,29,22,35],[23,8,23,14],[15,1,15,7],[15,29,15,35],[16,1,16,7],[16,15,16,21],[17,8,17,14],[17,22,17,28],[14,43,14,49],[7,1,7,7],[7,15,7,21],[8,8,8,14],[9,1,9,7],[10,1,10,7],[10,36,10,42],[11,8,11,14],[12,1,12,7],[12,15,12,21],[13,1,13,7],[14,8,14,14],[6,1,6,7],[0,0,1,50],[4,1,4,7],[5,8,5,14],[2,0,3,50],[1,71,1,72],[1,61,1,62],[1,63,1,64],[1,65,1,66],[1,67,1,68],[1,69,1,70]]}
[{"$f":"Katılım!AC1","v":"TÜRKİYE MASA TENİSİ FEDERASYONU\nKÜÇÜKLER KUZEYBATI BÖLGESİ YARIŞMALARI"},null,null,null,null,null,null,null,null,null,null,null,null,null,null,null,null,null,null,null,null,null,null,null,null,null,null,null,null,null,null,null,null,null,null,null,null,null,null,null,null,null,null,null,null,null,null,null,null,null,null,null,null,null,null,null,null,null,null,null,null,null,null,null,null,null,null,null,null,null,null,null,null,null,null,null,null,null,null,null,null,null,null,null,null,null,null,null,null,null,null,null,null,null,null,null,null,null,null,null,null,null,null,"1st Round",1]
[null,null,null,null,null,null,null,null,null,null,null,null,null,null,null,null,null,null,null,null,null,null,null,null,null,null,null,null,null,null,null,null,null,null,null,null,null,null,null,null,null,null,null,null,null,null,null,null,null,null,null,null,null,null,"#","Date","Time","Table","Competition","Player A","Player B","Set1",null,"Set2",null,"Set3",null,"Set4",null,"Set5",null,"Result",null,null,null,null,null,null,null,null,null,null,null,null,null,null,null,null,null,null,null,null,null,null,null,null,null,null,null,null,null,null,null,"2sn Round"]
[{"$f":"Katılım!AC2&\" \"&Katılım!AE3","v":"ERKEK TAKIM  [12-13 Mart 2025 KOCAELİ] [ Ana Tablo ]"},null,null,null,null,null,null,null,null,null,null,null,null,null,null,null,null,null,null,null,null,null,null,null,null,null,null,null,null,null,null,null,null,null,null,null,null,null,null,null,null,null,null,null,null,null,null,null,null,null,null,null,null,null,1,null,null,null,null,{"$f":"+B5","v":{"$error":"#REF!"}},{"$f":"+B7","v":{"$error":"#REF!"}},null,null,null,null,null,null,null,null,null,null,3,null,null,null,null,null,null,null,null,null,null,null,null,null,null,null,null,null,null,null,null,null,null,null,null,null,null,null,null,null,null,null,"3th Round"]
[null,null,null,null,null,null,null,null,null,null,null,null,null,null,null,null,null,null,null,null,null,null,null,null,null,null,null,null,null,null,null,null,null,null,null,null,null,null,null,null,null,null,null,null,null,null,null,null,null,null,null,null,null,null,2,null,null,null,null,{"$f":"+B8","v":{"$error":"#REF!"}},{"$f":"+B10","v":{"$error":"#REF!"}},null,null,null,null,null,null,null,null,null,null,3,null,null,null,null,null,null,null,null,null,null,null,null,null,null,null,null,null,null,null,null,null,null,null,null,null,null,null,null,null,null,null,"4th Round"]
[1,{"$f":"IF(#REF!=2,Eleme!#REF!,IF(#REF!=3,Eleme!#REF!,IF(#REF!=4,Eleme!#REF!,IF(#REF!=5,Eleme!#REF!,IF(#REF!=6,Eleme!#REF!,IF(#REF!=7,Eleme!C758))))))","v":{"$error":"#REF!"}},null,null,null,null,null,null,null,null,null,null,null,null,null,null,null,null,null,null,null,null,null,null,null,null,null,null,null,null,null,null,null,null,null,null,null,null,null,null,null,null,null,null,null,null,null,null,null,null,null,null,null,null,3,null,null,null,null,{"$f":"+B11","v":{"$error":"#REF!"}},{"$f":"+B13","v":{"$error":"#REF!"}},null,null,null,null,null,null,null,null,null,null,3,null,null,null,null,null,null,null,null,null,null,null,null,null,null,null,null,null,null,null,null,null,null,null,null,null,null,null,null,null,null,null,"5th Round"]
[null,null,null,{"$f":"+BT3","v":3},{"$f":"+BU3","v":0},"Y1",null,1,{"$f":"IF(AND(D6=0,E6=0),\"\",IF(D6>E6,B5,B7))","v":{"$error":"#REF!"}},null,null,null,null,null,null,null,null,null,null,null,null,null,null,null,null,null,null,null,null,null,null,null,null,null,null,null,null,null,null,null,null,null,null,null,null,null,null,null,null,null,null,null,null,null,4,null,null,null,null,{"$f":"+B14","v":{"$error":"#REF!"}},{"$f":"+B16","v":{"$error":"#REF!"}},null,null,null,null,null,null,null,null,null,null,3,null,null,null,null,null,null,null,null,null,null,null,null,null,null,null,null,null,null,null,null,null,null,null,null,null,null,null,null,null,null,null,"6th Round"]
[2,{"$f":"IF(#REF!=2,Eleme!#REF!,IF(#REF!=3,Eleme!#REF!,IF(#REF!=4,Eleme!#REF!,IF(#REF!=5,Eleme!#REF!,IF(#REF!=6,Eleme!#REF!,IF(#REF!=7,Eleme!C760))))))","v":{"$error":"#REF!"}},null,null,null,null,null,null,null,null,null,null,null,null,5,null,null,null,null,null,null,null,null,null,null,null,null,null,null,null,null,null,null,null,null,null,null,null,null,null,null,null,null,null,null,null,null,null,null,null,null,null,null,null,5,null,null,null,null,{"$f":"+I6","v":{"$error":"#REF!"}},{"$f":"+I9","v":{"$error":"#REF!"}},null,null,null,null,null,null,null,null,null,null,3]
[3,{"$f":"IF(#REF!=2,Eleme!#REF!,IF(#REF!=3,Eleme!#REF!,IF(#REF!=4,Eleme!#REF!,IF(#REF!=5,Eleme!#REF!,IF(#REF!=6,Eleme!#REF!,IF(#REF!=7,Eleme!C761))))))","v":{"$error":"#REF!"}},null,null,null,null,null,null,null,null,{"$f":"+BT7","v":3},{"$f":"+BU7","v":0},"Y5",null,null,{"$f":"IF(AND(K8=0,L8=0),\"\",IF(K8>L8,I6,I9))","v":{"$error":"#REF!"}},null,null,null,null,null,null,null,null,null,null,null,null,null,null,null,null,null,null,null,null,null,null,null,null,null,null,null,null,null,null,null,null,null,null,null,null,null,null,6,null,null,null,null,{"$f":"+I12","v":{"$error":"#REF!"}},{"$f":"+I15","v":{"$error":"#REF!"}},null,null,null,null,null,null,null,null,null,null,3]
[null,null,null,{"$f":"+BT4","v":3},{"$f":"+BU4","v":0},"Y2",null,2,{"$f":"IF(AND(D9=0,E9=0),\"\",IF(D9>E9,B8,B10))","v":{"$error":"#REF!"}},null,null,null,null,null,null,null,null,null,null,null,null,9,null,null,null,null,null,null,null,null,null,null,null,null,null,null,null,null,null,null,null,null,null,null,null,null,null,null,null,null,null,null,null,null,7,null,null,null,null,{"$f":"+I18","v":{"$error":"#REF!"}},{"$f":"+I20","v":{"$error":"#REF!"}},null,null,null,null,null,null,null,null,null,null,3]
[4,{"$f":"IF(#REF!=2,Eleme!#REF!,IF(#REF!=3,Eleme!#REF!,IF(#REF!=4,Eleme!#REF!,IF(#REF!=5,Eleme!#REF!,IF(#REF!=6,Eleme!#REF!,IF(#REF!=7,Eleme!C763))))))","v":{"$error":"#REF!"}},null,null,null,null,null,null,null,null,null,null,null,null,null,null,null,null,null,null,null,null,null,null,null,null,null,null,null,null,null,null,null,null,null,null,null,null,null,null,null,null,null,null,null,null,null,null,null,null,null,null,null,null,8,null,null,null,null,{"$f":"+I22","v":{"$error":"#REF!"}},{"$f":"+I24","v":{"$error":"#REF!"}},null,null,null,null,null,null,null,null,null,null,3]
[5,{"$f":"IF(#REF!=2,Eleme!#REF!,IF(#REF!=3,Eleme!#REF!,IF(#REF!=4,Eleme!#REF!,IF(#REF!=5,Eleme!#REF!,IF(#REF!=6,Eleme!#REF!,IF(#REF!=7,Eleme!C764))))))","v":{"$error":"#REF!"}},null,null,null,null,null,null,null,null,null,null,null,null,null,null,null,{"$f":"+BT11","v":3},{"$f":"+BU11","v":0},"Y9",null,null,null,null,null,null,null,null,null,null,null,null,null,null,null,null,{"$f":"IF(AND(R11=0,S11=0),\"\",IF(R11>S11,P8,P13))","v":{"$error":"#REF!"}},null,null,null,null,null,null,null,null,null,null,null,null,null,null,null,null,null,9,null,null,null,null,{"$f":"+P8","v":{"$error":"#REF!"}},{"$f":"+P13","v":{"$error":"#REF!"}},null,null,null,null,null,null,null,null,null,null,3]
[null,null,null,{"$f":"+BT5","v":3},{"$f":"+BU5","v":0},"Y3",null,3,{"$f":"IF(AND(D12=0,E12=0),\"\",IF(D12>E12,B11,B13))","v":{"$error":"#REF!"}},null,null,null,null,null,null,null,null,null,null,null,null,null,null,null,null,null,null,null,null,null,null,null,null,null,null,null,null,null,null,null,null,null,16,null,null,null,null,null,null,null,null,null,null,null,10,null,null,null,null,{"$f":"+P17","v":{"$error":"#REF!"}},{"$f":"+P19","v":{"$error":"#REF!"}},null,null,null,null,null,null,null,null,null,null,3]
[6,{"$f":"IF(#REF!=2,Eleme!#REF!,IF(#REF!=3,Eleme!#REF!,IF(#REF!=4,Eleme!#REF!,IF(#REF!=5,Eleme!#REF!,IF(#REF!=6,Eleme!#REF!,IF(#REF!=7,Eleme!C766))))))","v":{"$error":"#REF!"}},null,null,null,null,null,null,null,null,null,null,null,null,6,{"$f":"IF(AND(K14=0,L14=0),\"\",IF(K14>L14,I12,I15))","v":{"$error":"#REF!"}},null,null,null,null,null,null,null,null,null,null,null,null,null,null,null,null,null,null,null,null,null,null,null,null,null,null,null,null,null,null,null,null,null,null,null,null,null,null,11,null,null,null,null,{"$f":"+P21","v":{"$error":"#REF!"}},{"$f":"+P23","v":{"$error":"#REF!"}},null,null,null,null,null,null,null,null,null,null,3]
[7,{"$f":"IF(#REF!=2,Eleme!#REF!,IF(#REF!=3,Eleme!#REF!,IF(#REF!=4,Eleme!#REF!,IF(#REF!=5,Eleme!#REF!,IF(#REF!=6,Eleme!#REF!,IF(#REF!=7,Eleme!C767))))))","v":{"$error":"#REF!"}},null,null,null,null,null,null,null,null,{"$f":"+BT8","v":3},{"$f":"+BU8","v":0},"Y6",null,null,null,null,null,null,null,null,null,null,null,null,null,null,null,null,null,null,null,null,null,null,null,null,null,null,null,null,null,null,null,null,null,null,null,null,null,null,null,null,null,12,null,null,null,null,{"$f":"+P30","v":{"$error":"#REF!"}},{"$f":"+P32","v":{"$error":"#REF!"}},null,null,null,null,null,null,null,null,null,null,3]
[null,null,null,{"$f":"+BT6","v":3},{"$f":"+BU6","v":0},"Y4",null,4,{"$f":"IF(AND(D15=0,E15=0),\"\",IF(D15>E15,B14,B16))","v":{"$error":"#REF!"}},null,null,null,null,null,null,null,null,null,null,null,null,null,null,null,null,null,null,null,null,null,null,null,null,null,null,null,null,null,{"$f":"+BT18","v":3},{"$f":"+BU18","v":0},"Y16",null,null,{"$f":"IF(AND(AM15=0,AN15=0),\"\",IF(AM15>AN15,AK11,AK18))","v":{"$error":"#REF!"}},null,null,null,null,null,null,"1.",null,null,null,13,null,null,null,null,{"$f":"+W18","v":{"$error":"#REF!"}},{"$f":"+W22","v":{"$error":"#REF!"}},null,null,null,null,null,null,null,null,null,null,3]
[8,{"$f":"IF(#REF!=2,Eleme!#REF!,IF(#REF!=3,Eleme!#REF!,IF(#REF!=4,Eleme!#REF!,IF(#REF!=5,Eleme!#REF!,IF(#REF!=6,Eleme!#REF!,IF(#REF!=7,Eleme!C769))))))","v":{"$error":"#REF!"}},null,null,null,null,null,null,null,null,null,null,null,null,null,null,null,null,null,null,null,null,null,null,null,null,null,null,"Y9",{"$f":"IF(AND(R11=0,S11=0),\"\",IF(R11<S11,P8,P13))","v":{"$error":"#REF!"}},null,null,null,null,null,null,null,null,null,null,null,null,null,null,null,null,null,null,null,null,null,null,null,null,14,null,null,null,null,{"$f":"+W25","v":{"$error":"#REF!"}},{"$f":"+W27","v":{"$error":"#REF!"}},null,null,null,null,null,null,null,null,null,null,3]
[null,null,null,null,null,null,null,null,null,null,null,null,null,null,"Y6",{"$f":"IF(AND(K14=0,L14=0),\"\",IF(K14<L14,I12,I15))","v":{"$error":"#REF!"}},null,null,null,null,null,null,null,null,null,null,null,null,null,null,null,null,null,null,null,15,null,null,null,null,null,null,null,null,null,null,null,null,null,null,null,null,null,null,15,null,null,null,null,{"$f":"+AD16","v":{"$error":"#REF!"}},{"$f":"+AD20","v":{"$error":"#REF!"}},null,null,null,null,null,null,null,null,null,null,3]
[null,null,null,null,null,null,null,"Y1",{"$f":"IF(AND(D6=0,E6=0),\"\",IF(D6<E6,B5,B7))","v":{"$error":"#REF!"}},null,null,null,null,null,null,null,null,{"$f":"+BT12","v":3},{"$f":"+BU12","v":0},"Y10",null,10,{"$f":"IF(AND(R18=0,S18=0),\"\",IF(R18>S18,P17,P19))","v":{"$error":"#REF!"}},null,null,null,null,null,null,null,null,{"$f":"+BT17","v":3},{"$f":"+BU17","v":0},"Y15",null,null,{"$f":"IF(AND(AF18=0,AG18=0),\"\",IF(AF18>AG18,AD16,AD20))","v":{"$error":"#REF!"}},null,null,null,null,null,null,null,null,null,null,null,null,null,null,null,null,null,16,null,null,null,null,{"$f":"+AK11","v":{"$error":"#REF!"}},{"$f":"+AK18","v":{"$error":"#REF!"}},null,null,null,null,null,null,null,null,null,null,3]
[null,null,null,null,null,null,null,null,null,null,{"$f":"+BT9","v":3},{"$f":"+BU9","v":0},"Y7",null,7,{"$f":"IF(AND(K19=0,L19=0),\"\",IF(K19>L19,I18,I20))","v":{"$error":"#REF!"}},null,null,null,null,null,null,null,null,null,null,null,null,13,null,null,null,null,null,null,null,null,null,null,null,null,null,"Y16",{"$f":"IF(AND(AM15=0,AN15=0),\"\",IF(AM15<AN15,AK11,AK18))","v":{"$error":"#REF!"}},null,null,null,null,null,null,"2."]
[null,null,null,null,null,null,null,"Y2",{"$f":"IF(AND(D9=0,E9=0),\"\",IF(D9<E9,B8,B10))","v":{"$error":"#REF!"}},null,null,null,null,null,null,null,null,null,null,null,null,null,null,null,{"$f":"+BT15","v":3},{"$f":"+BU15","v":0},"Y13",null,null,{"$f":"IF(AND(Y20=0,Z20=0),\"\",IF(Y20>Z20,W18,W22))","v":{"$error":"#REF!"}}]
[null,null,null,null,null,null,null,null,null,null,null,null,null,null,"Y5",{"$f":"IF(AND(K8=0,L8=0),\"\",IF(K8<L8,I6,I9))","v":{"$error":"#REF!"}},null,null,null,null,null,null,null,null,null,null,null,null,null,null,null,null,null,null,null,"Y15",{"$f":"IF(AND(AF18=0,AG18=0),\"\",IF(AF18<AG18,AD16,AD20))","v":{"$error":"#REF!"}},null,null,null,null,null,"3."]
[null,null,null,null,null,null,null,"Y3",{"$f":"IF(AND(D12=0,E12=0),\"\",IF(D12<E12,B11,B13))","v":{"$error":"#REF!"}},null,null,null,null,null,null,null,null,{"$f":"+BT13","v":3},{"$f":"+BU13","v":0},"Y11",null,11,{"$f":"IF(AND(R22=0,S22=0),\"\",IF(R22>S22,P21,P23))","v":{"$error":"#REF!"}}]
[null,null,null,null,null,null,null,null,null,null,{"$f":"+BT10","v":3},{"$f":"+BU10","v":0},"Y8",null,8,{"$f":"IF(AND(K23=0,L23=0),\"\",IF(K23>L23,I22,I24))","v":{"$error":"#REF!"}},null,null,null,null,null,null,null,null,null,null,null,null,"Y13",{"$f":"IF(AND(Y20=0,Z20=0),\"\",IF(Y20<Z20,W18,W22))","v":{"$error":"#REF!"}},null,null,null,null,null,null,"4."]
[null,null,null,null,null,null,null,"Y4",{"$f":"IF(AND(D15=0,E15=0),\"\",IF(D15<E15,B14,B16))","v":{"$error":"#REF!"}}]
[null,null,null,null,null,null,null,null,null,null,null,null,null,null,null,null,null,null,null,null,null,"Y10",{"$f":"IF(AND(R18=0,S18=0),\"\",IF(R18<S18,P17,P19))","v":{"$error":"#REF!"}}]
[null,null,null,null,null,null,null,null,null,null,null,null,null,null,null,null,null,null,null,null,null,null,null,null,{"$f":"+BT16","v":3},{"$f":"+BU16","v":0},"Y14",null,14,{"$f":"IF(AND(Y26=0,Z26=0),\"\",IF(Y26>Z26,W25,W27))","v":{"$error":"#REF!"}},null,null,null,null,null,null,"5."]
[null,null,null,null,null,null,null,null,null,null,null,null,null,null,null,null,null,null,null,null,null,"Y11",{"$f":"IF(AND(R22=0,S22=0),\"\",IF(R22<S22,P21,P23))","v":{"$error":"#REF!"}}]
[null,null,null,null,null,null,null,null,null,null,null,null,null,null,null,null,null,null,null,null,null,null,null,null,null,null,null,null,"Y14",{"$f":"IF(AND(Y26=0,Z26=0),\"\",IF(Y26<Z26,W25,W27))","v":{"$error":"#REF!"}},null,null,null,null,null,null,"6."]
[]
[null,null,null,null,null,null,null,null,null,null,null,null,null,null,"Y7",{"$f":"IF(AND(K19=0,L19=0),\"\",IF(K19<L19,I18,I20))","v":{"$error":"#REF!"}}]
[null,null,null,null,null,null,null,null,null,null,null,null,null,null,null,null,null,{"$f":"+BT14","v":3},{"$f":"+BU14","v":0},"Y12",null,12,{"$f":"IF(AND(R31=0,S31=0),\"\",IF(R31>S31,P30,P32))","v":{"$error":"#REF!"}},null,null,null,null,null,null,"7."]
[null,null,null,null,null,null,null,null,null,null,null,null,null,null,"Y8",{"$f":"IF(AND(K23=0,L23=0),\"\",IF(K23<L23,I22,I24))","v":{"$error":"#REF!"}}]
[null,null,null,null,null,null,null,null,null,null,null,null,null,null,null,null,null,null,null,null,null,"Y12",{"$f":"IF(AND(R31=0,S31=0),\"\",IF(R31<S31,P30,P32))","v":{"$error":"#REF!"}},null,null,null,null,null,null,"8."]

{"sheet":"8TE","index":12,"n_rows":34,"n_cols":105,"rows_kept":34,"cut":false,"hidden":true,"merged":[[29,15,29,21],[30,22,30,28],[33,22,33,28],[24,22,24,28],[27,22,27,28],[31,15,31,21],[24,8,24,14],[25,15,25,21],[26,8,26,14],[21,8,21,14],[22,15,22,21],[23,8,23,14],[12,1,12,7],[12,15,12,21],[1,71,1,72],[4,1,4,7],[5,8,5,14],[6,1,6,7],[7,1,7,7],[7,15,7,21],[1,61,1,62],[1,63,1,64],[1,65,1,66],[1,67,1,68],[1,69,1,70],[14,22,14,28],[20,22,20,28],[0,0,1,29],[2,0,3,29],[17,22,17,28],[18,15,18,21],[13,1,13,7],[14,8,14,14],[15,1,15,7],[16,1,16,7],[16,15,16,21],[8,8,8,14],[9,1,9,7],[10,1,10,7],[10,22,10,28],[11,8,11,14]]}
[{"$f":"Katılım!AC1","v":"TÜRKİYE MASA TENİSİ FEDERASYONU\nKÜÇÜKLER KUZEYBATI BÖLGESİ YARIŞMALARI"},null,null,null,null,null,null,null,null,null,null,null,null,null,null,null,null,null,null,null,null,null,null,null,null,null,null,null,null,null,null,null,null,null,null,null,null,null,null,null,null,null,null,null,null,null,null,null,null,null,null,null,null,null,null,null,null,null,null,null,null,null,null,null,null,null,null,null,null,null,null,null,null,null,null,null,null,null,null,null,null,null,null,null,null,null,null,null,null,null,null,null,null,null,null,null,null,null,null,null,null,null,null,"1st Round",1]
[null,null,null,null,null,null,null,null,null,null,null,null,null,null,null,null,null,null,null,null,null,null,null,null,null,null,null,null,null,null,null,null,null,null,null,null,null,null,null,null,null,null,null,null,null,null,null,null,null,null,null,null,null,null,"#","Date","Time","Table","Competition","Player A","Player B","Set1",null,"Set2",null,"Set3",null,"Set4",null,"Set5",null,"Result",null,null,null,null,null,null,null,null,null,null,null,null,null,null,null,null,null,null,null,null,null,null,null,null,null,null,null,null,null,null,null,"2sn Round"]
[{"$f":"Katılım!AC2&\" \"&Katılım!AE3","v":"ERKEK TAKIM  [12-13 Mart 2025 KOCAELİ] [ Ana Tablo ]"},null,null,null,null,null,null,null,null,null,null,null,null,null,null,null,null,null,null,null,null,null,null,null,null,null,null,null,null,null,null,null,null,null,null,null,null,null,null,null,null,null,null,null,null,null,null,null,null,null,null,null,null,null,1,"2025-03-13","09:00:00",null,null,{"$f":"+B5","v":{"$error":"#REF!"}},{"$f":"+B7","v":{"$error":"#REF!"}},null,null,null,null,null,null,null,null,null,null,null,null,null,null,null,null,null,null,null,null,null,null,null,null,null,null,null,null,null,null,null,null,null,null,null,null,null,null,null,null,null,null,"3th Round"]
[null,null,null,null,null,null,null,null,null,null,null,null,null,null,null,null,null,null,null,null,null,null,null,null,null,null,null,null,null,null,null,null,null,null,null,null,null,null,null,null,null,null,null,null,null,null,null,null,null,null,null,null,null,null,2,"2025-03-13","09:00:00",null,null,{"$f":"+B8","v":{"$error":"#REF!"}},{"$f":"+B10","v":{"$error":"#REF!"}}]
[1,{"$f":"IF(#REF!=2,Eleme!#REF!,IF(#REF!=3,Eleme!#REF!,IF(#REF!=4,Eleme!#REF!,IF(#REF!=5,Eleme!#REF!,IF(#REF!=6,Eleme!#REF!,IF(#REF!=7,Eleme!C758))))))","v":{"$error":"#REF!"}},null,null,null,null,null,null,null,null,null,null,null,null,null,null,null,null,null,null,null,null,null,null,null,null,null,null,null,null,null,null,null,null,null,null,null,null,null,null,null,null,null,null,null,null,null,null,null,null,null,null,null,null,3,"2025-03-13","09:00:00",null,null,{"$f":"+B11","v":{"$error":"#REF!"}},{"$f":"+B13","v":{"$error":"#REF!"}}]
[null,null,null,{"$f":"+BT3","v":0},{"$f":"+BU3","v":0},"Y-A",null,1,{"$f":"IF(AND(D6=0,E6=0),\"\",IF(D6>E6,B5,B7))","v":""},null,null,null,null,null,null,null,null,null,null,null,null,null,null,null,null,null,null,null,null,null,null,null,null,null,null,null,null,null,null,null,null,null,null,null,null,null,null,null,null,null,null,null,null,null,4,"2025-03-13","09:00:00",null,null,{"$f":"+B14","v":{"$error":"#REF!"}},{"$f":"+B16","v":{"$error":"#REF!"}}]
[2,{"$f":"IF(#REF!=2,Eleme!#REF!,IF(#REF!=3,Eleme!#REF!,IF(#REF!=4,Eleme!#REF!,IF(#REF!=5,Eleme!#REF!,IF(#REF!=6,Eleme!#REF!,IF(#REF!=7,Eleme!C760))))))","v":{"$error":"#REF!"}},null,null,null,null,null,null,null,null,null,null,null,null,5,null,null,null,null,null,null,null,null,null,null,null,null,null,null,null,null,null,null,null,null,null,null,null,null,null,null,null,null,null,null,null,null,null,null,null,null,null,null,null,5,"2025-03-13","10:30:00",null,null,{"$f":"+I6","v":""},{"$f":"+I9","v":""}]
[3,{"$f":"IF(#REF!=2,Eleme!#REF!,IF(#REF!=3,Eleme!#REF!,IF(#REF!=4,Eleme!#REF!,IF(#REF!=5,Eleme!#REF!,IF(#REF!=6,Eleme!#REF!,IF(#REF!=7,Eleme!C761))))))","v":{"$error":"#REF!"}},null,null,null,null,null,null,null,null,{"$f":"+BT7","v":0},{"$f":"+BU7","v":0},"Y-E",null,null,{"$f":"IF(AND(K8=0,L8=0),\"\",IF(K8>L8,I6,I9))","v":""},null,null,null,null,null,null,null,null,null,null,null,null,null,null,null,null,null,null,null,null,null,null,null,null,null,null,null,null,null,null,null,null,null,null,null,null,null,null,6,"2025-03-13","10:30:00",null,null,{"$f":"+I12","v":""},{"$f":"+I15","v":""}]
[null,null,null,{"$f":"+BT4","v":0},{"$f":"+BU4","v":0},"Y-B",null,2,{"$f":"IF(AND(D9=0,E9=0),\"\",IF(D9>E9,B8,B10))","v":""},null,null,null,null,null,null,null,null,null,null,null,null,9,null,null,null,null,null,null,null,null,null,null,null,null,null,null,null,null,null,null,null,null,null,null,null,null,null,null,null,null,null,null,null,null,7,"2025-03-13","10:30:00",null,null,{"$f":"+I22","v":""},{"$f":"+I24","v":""}]
[4,{"$f":"IF(#REF!=2,Eleme!#REF!,IF(#REF!=3,Eleme!#REF!,IF(#REF!=4,Eleme!#REF!,IF(#REF!=5,Eleme!#REF!,IF(#REF!=6,Eleme!#REF!,IF(#REF!=7,Eleme!C763))))))","v":{"$error":"#REF!"}},null,null,null,null,null,null,null,null,null,null,null,null,null,null,null,null,null,null,null,null,null,null,null,null,null,null,null,null,null,null,null,null,null,null,null,null,null,null,null,null,null,null,null,null,null,null,null,null,null,null,null,null,8,"2025-03-13","10:30:00",null,null,{"$f":"+I25","v":""},{"$f":"+I27","v":""}]
[5,{"$f":"IF(#REF!=2,Eleme!#REF!,IF(#REF!=3,Eleme!#REF!,IF(#REF!=4,Eleme!#REF!,IF(#REF!=5,Eleme!#REF!,IF(#REF!=6,Eleme!#REF!,IF(#REF!=7,Eleme!C764))))))","v":{"$error":"#REF!"}},null,null,null,null,null,null,null,null,null,null,null,null,null,null,null,{"$f":"+BT11","v":0},{"$f":"+BU11","v":0},"Y-I",null,null,{"$f":"IF(AND(R11=0,S11=0),\"\",IF(R11>S11,P8,P13))","v":""},null,null,null,null,null,null,"1.",null,null,null,null,null,null,null,null,null,null,null,null,null,null,null,null,null,null,null,null,null,null,null,null,9,"2025-03-13","13:30:00",null,null,{"$f":"+P8","v":""},{"$f":"+P13","v":""}]
[null,null,null,{"$f":"+BT5","v":0},{"$f":"+BU5","v":0},"Y-C",null,3,{"$f":"IF(AND(D12=0,E12=0),\"\",IF(D12>E12,B11,B13))","v":""},null,null,null,null,null,null,null,null,null,null,null,null,null,null,null,null,null,null,null,null,null,null,null,null,null,null,null,null,null,null,null,null,null,null,null,null,null,null,null,null,null,null,null,null,null,10,"2025-03-13","13:30:00",null,null,{"$f":"+P17","v":""},{"$f":"+P19","v":""}]
[6,{"$f":"IF(#REF!=2,Eleme!#REF!,IF(#REF!=3,Eleme!#REF!,IF(#REF!=4,Eleme!#REF!,IF(#REF!=5,Eleme!#REF!,IF(#REF!=6,Eleme!#REF!,IF(#REF!=7,Eleme!C766))))))","v":{"$error":"#REF!"}},null,null,null,null,null,null,null,null,null,null,null,null,6,{"$f":"IF(AND(K14=0,L14=0),\"\",IF(K14>L14,I12,I15))","v":""},null,null,null,null,null,null,null,null,null,null,null,null,null,null,null,null,null,null,null,null,null,null,null,null,null,null,null,null,null,null,null,null,null,null,null,null,null,null,11,"2025-03-13","13:30:00",null,null,{"$f":"+P23","v":""},{"$f":"+P26","v":""}]
[7,{"$f":"IF(#REF!=2,Eleme!#REF!,IF(#REF!=3,Eleme!#REF!,IF(#REF!=4,Eleme!#REF!,IF(#REF!=5,Eleme!#REF!,IF(#REF!=6,Eleme!#REF!,IF(#REF!=7,Eleme!C767))))))","v":{"$error":"#REF!"}},null,null,null,null,null,null,null,null,{"$f":"+BT8","v":0},{"$f":"+BU8","v":0},"Y-F",null,null,null,null,null,null,null,null,null,null,null,null,null,null,null,null,null,null,null,null,null,null,null,null,null,null,null,null,null,null,null,null,null,null,null,null,null,null,null,null,null,12,"2025-03-13","13:30:00",null,null,{"$f":"+P30","v":""},{"$f":"+P32","v":""}]
[null,null,null,{"$f":"+BT6","v":0},{"$f":"+BU6","v":0},"Y-D",null,4,{"$f":"IF(AND(D15=0,E15=0),\"\",IF(D15>E15,B14,B16))","v":""},null,null,null,null,null,null,null,null,null,null,null,null,"I",{"$f":"IF(AND(R11=0,S11=0),\"\",IF(R11<S11,P8,P13))","v":""},null,null,null,null,null,null,"2."]
[8,{"$f":"IF(#REF!=2,Eleme!#REF!,IF(#REF!=3,Eleme!#REF!,IF(#REF!=4,Eleme!#REF!,IF(#REF!=5,Eleme!#REF!,IF(#REF!=6,Eleme!#REF!,IF(#REF!=7,Eleme!C769))))))","v":{"$error":"#REF!"}}]
[null,null,null,null,null,null,null,null,null,null,null,null,null,null,"E",{"$f":"IF(AND(K8=0,L8=0),\"\",IF(K8<L8,I6,I9))","v":""}]
[null,null,null,null,null,null,null,null,null,null,null,null,null,null,null,null,null,{"$f":"+BT12","v":0},{"$f":"+BU12","v":0},"Y-J",null,10,{"$f":"IF(AND(R18=0,S18=0),\"\",IF(R18>S18,P17,P19))","v":""},null,null,null,null,null,null,"3."]
[null,null,null,null,null,null,null,null,null,null,null,null,null,null,"F",{"$f":"IF(AND(K14=0,L14=0),\"\",IF(K14<L14,I12,I15))","v":""}]
[]
[null,null,null,null,null,null,null,null,null,null,null,null,null,null,null,null,null,null,null,null,null,"J",{"$f":"IF(AND(R18=0,S18=0),\"\",IF(R18<S18,P17,P19))","v":""},null,null,null,null,null,null,"4."]
[null,null,null,null,null,null,null,"A",{"$f":"IF(AND(D6=0,E6=0),\"\",IF(D6<E6,B5,B7))","v":""}]
[null,null,null,null,null,null,null,null,null,null,{"$f":"+BT9","v":0},{"$f":"+BU9","v":0},"Y-G",null,7,{"$f":"IF(AND(K23=0,L23=0),\"\",IF(K23>L23,I22,I24))","v":""}]
[null,null,null,null,null,null,null,"B",{"$f":"IF(AND(D9=0,E9=0),\"\",IF(D9<E9,B8,B10))","v":""},null,null,null,null,null,null,null,null,null,null,null,null,11]
[null,null,null,null,null,null,null,"C",{"$f":"IF(AND(D12=0,E12=0),\"\",IF(D12<E12,B11,B13))","v":""},null,null,null,null,null,null,null,null,{"$f":"+BT13","v":0},{"$f":"+BU13","v":0},"Y-K",null,null,{"$f":"IF(AND(R25=0,S25=0),\"\",IF(R25>S25,P23,P26))","v":""},null,null,null,null,null,null,"5."]
[null,null,null,null,null,null,null,null,null,null,{"$f":"+BT10","v":0},{"$f":"+BU10","v":0},"Y-H",null,8,{"$f":"IF(AND(K26=0,L26=0),\"\",IF(K26>L26,I25,I27))","v":""}]
[null,null,null,null,null,null,null,"D",{"$f":"IF(AND(D15=0,E15=0),\"\",IF(D15<E15,B14,B16))","v":""}]
[null,null,null,null,null,null,null,null,null,null,null,null,null,null,null,null,null,null,null,null,null,"K",{"$f":"IF(AND(R25=0,S25=0),\"\",IF(R25<S25,P23,P26))","v":""},null,null,null,null,null,null,"6."]
[]
[null,null,null,null,null,null,null,null,null,null,null,null,null,null,"G",{"$f":"IF(AND(K23=0,L23=0),\"\",IF(K23<L23,I22,I24))","v":""}]
[null,null,null,null,null,null,null,null,null,null,null,null,null,null,null,null,null,{"$f":"+BT14","v":0},{"$f":"+BU14","v":0},"Y-L",null,12,{"$f":"IF(AND(R31=0,S31=0),\"\",IF(R31>S31,P30,P32))","v":""},null,null,null,null,null,null,"7."]
[null,null,null,null,null,null,null,null,null,null,null,null,null,null,"H",{"$f":"IF(AND(K26=0,L26=0),\"\",IF(K26<L26,I25,I27))","v":""}]
[]
[null,null,null,null,null,null,null,null,null,null,null,null,null,null,null,null,null,null,null,null,null,"L",{"$f":"IF(AND(R31=0,S31=0),\"\",IF(R31<S31,P30,P32))","v":""},null,null,null,null,null,null,"8."]

{"sheet":"Cift_Mix","index":13,"n_rows":25,"n_cols":1217,"rows_kept":25,"cut":false,"hidden":true,"merged":[[0,1,0,7],[0,23,2,36],[1,8,1,14],[1,75,1,76],[1,77,1,78],[1,81,1,82],[1,83,1,84],[1,85,1,86],[2,1,2,7],[3,1,3,7],[3,15,3,21],[3,23,4,36],[4,8,4,14],[1,79,1,80],[12,29,12,35],[13,8,13,14],[5,1,5,7],[6,1,6,7],[6,22,6,28],[7,8,7,14],[8,1,8,7],[8,15,8,21],[17,22,17,28],[9,1,9,7],[10,8,10,14],[11,1,11,7],[12,1,12,7],[14,1,14,7],[15,1,15,7],[15,15,15,21],[16,8,16,14],[17,1,17,7],[18,1,18,7],[18,22,18,28],[18,29,18,35],[19,8,19,14],[20,1,20,7],[20,15,20,21],[22,29,22,35],[21,1,21,7],[22,8,22,14],[23,1,23,7],[20,29,20,35]]}
[1,{"$f":"IF(#REF!=2,Eleme!#REF!,IF(#REF!=3,Eleme!#REF!,IF(#REF!=4,Eleme!#REF!,IF(#REF!=5,Eleme!#REF!,IF(#REF!=6,Eleme!#REF!)))))","v":{"$error":"#REF!"}},null,null,null,null,null,null,null,null,null,null,null,null,null,null,null,null,null,null,null,null,null,{"$f":"Katılım!AC1","v":"TÜRKİYE MASA TENİSİ FEDERASYONU\nKÜÇÜKLER KUZEYBATI BÖLGESİ YARIŞMALARI"},null,null,null,null,null,null,null,null,null,null,null,null,null,null,null,null,null,null,null,null,null,null,null,null,null,null,null,null,null,null,null,null,null,null,null,null,null,null,null,null,null,null,null,null,null,null,null,null,null,null,null,null,null,null,null,null,null,null,null,null,null,null,null,null,null,null,null,null,null,null,null,null,null,null,null,null,null,null,null,"1st Round",1]
[null,null,null,{"$f":"CH3","v":0},{"$f":"CI3","v":0},null,null,1,{"$f":"IF(AND(D2=0,E2=0),\"\",IF(D2>E2,B1,B3))","v":""},null,null,null,null,null,null,null,null,null,null,null,null,null,null,null,null,null,null,null,null,null,null,null,null,null,null,null,null,null,null,null,null,null,null,null,null,null,null,null,null,null,null,null,null,null,null,null,null,null,null,null,null,null,null,null,null,null,null,null,"#","Date","Time","Table","Competition","Player A","Player B","Set1",null,"Set2",null,"Set3",null,"Set4",null,"Set5",null,"Result",null,null,null,null,null,null,null,null,null,null,null,null,null,null,null,null,null,"2sn Round"]
[2,{"$f":"IF(#REF!=2,Eleme!#REF!,IF(#REF!=3,Eleme!#REF!,IF(#REF!=4,Eleme!#REF!,IF(#REF!=5,Eleme!#REF!,IF(#REF!=6,Eleme!#REF!)))))","v":{"$error":"#REF!"}},null,null,null,null,null,null,null,null,null,null,null,null,9,null,null,null,null,null,null,null,null,null,null,null,null,null,null,null,null,null,null,null,null,null,null,null,null,null,null,null,null,null,null,null,null,null,null,null,null,null,null,null,null,null,null,null,null,null,null,null,null,null,null,null,null,null,1,null,null,null,null,{"$f":"B1","v":{"$error":"#REF!"}},{"$f":"B3","v":{"$error":"#REF!"}},null,null,null,null,null,null,null,null,null,null,null,null,null,null,null,null,null,null,null,null,null,null,null,null,null,null,null,null,"3th Round"]
[3,{"$f":"IF(#REF!=2,Eleme!#REF!,IF(#REF!=3,Eleme!#REF!,IF(#REF!=4,Eleme!#REF!,IF(#REF!=5,Eleme!#REF!,IF(#REF!=6,Eleme!#REF!)))))","v":{"$error":"#REF!"}},null,null,null,null,null,null,null,null,{"$f":"CH11","v":0},{"$f":"CI11","v":0},null,null,null,{"$f":"IF(AND(K4=0,L4=0),\"\",IF(K4>L4,I2,I5))","v":""},null,null,null,null,null,null,null,{"$f":"Katılım!AC2&\" \"&Katılım!AE3","v":"ERKEK TAKIM  [12-13 Mart 2025 KOCAELİ] [ Ana Tablo ]"},null,null,null,null,null,null,null,null,null,null,null,null,null,null,null,null,null,null,null,null,null,null,null,null,null,null,null,null,null,null,null,null,null,null,null,null,null,null,null,null,null,null,null,null,2,null,null,null,null,{"$f":"B4","v":{"$error":"#REF!"}},{"$f":"B6","v":{"$error":"#REF!"}},null,null,null,null,null,null,null,null,null,null,null,null,null,null,null,null,null,null,null,null,null,null,null,null,null,null,null,null,"4th Round"]
[null,null,null,{"$f":"CH4","v":0},{"$f":"CI4","v":0},null,null,2,{"$f":"IF(AND(D5=0,E5=0),\"\",IF(D5>E5,B4,B6))","v":""},null,null,null,null,null,null,null,null,null,null,null,null,13,null,null,null,null,null,null,null,null,null,null,null,null,null,null,null,null,null,null,null,null,null,null,null,null,null,null,null,null,null,null,null,null,null,null,null,null,null,null,null,null,null,null,null,null,null,null,3,null,null,null,null,{"$f":"B7","v":{"$error":"#REF!"}},{"$f":"B9","v":{"$error":"#REF!"}}]
[4,{"$f":"IF(#REF!=2,Eleme!#REF!,IF(#REF!=3,Eleme!#REF!,IF(#REF!=4,Eleme!#REF!,IF(#REF!=5,Eleme!#REF!,IF(#REF!=6,Eleme!#REF!)))))","v":{"$error":"#REF!"}},null,null,null,null,null,null,null,null,null,null,null,null,null,null,null,null,null,null,null,null,null,null,null,null,null,null,null,null,null,null,null,null,null,null,null,null,null,null,null,null,null,null,null,null,null,null,null,null,null,null,null,null,null,null,null,null,null,null,null,null,null,null,null,null,null,null,4,null,null,null,null,{"$f":"B10","v":{"$error":"#REF!"}},{"$f":"B12","v":{"$error":"#REF!"}}]
[5,{"$f":"IF(#REF!=2,Eleme!#REF!,IF(#REF!=3,Eleme!#REF!,IF(#REF!=4,Eleme!#REF!,IF(#REF!=5,Eleme!#REF!,IF(#REF!=6,Eleme!#REF!)))))","v":{"$error":"#REF!"}},null,null,null,null,null,null,null,null,null,null,null,null,null,null,null,{"$f":"CH15","v":0},{"$f":"CI15","v":0},null,null,null,{"$f":"IF(AND(R7=0,S7=0),\"\",IF(R7>S7,P4,P9))","v":""},null,null,null,null,null,null,null,null,null,null,null,null,null,null,null,null,null,null,null,null,null,null,null,null,null,null,null,null,null,null,null,null,null,null,null,null,null,null,null,null,null,null,null,null,null,5,null,null,null,null,{"$f":"B13","v":{"$error":"#REF!"}},{"$f":"B15","v":{"$error":"#REF!"}}]
[null,null,null,{"$f":"CH5","v":0},{"$f":"CI5","v":0},null,null,3,{"$f":"IF(AND(D8=0,E8=0),\"\",IF(D8>E8,B7,B9))","v":""},null,null,null,null,null,null,null,null,null,null,null,null,null,null,null,null,null,null,null,15,null,null,null,null,null,null,null,null,null,null,null,null,null,null,null,null,null,null,null,null,null,null,null,null,null,null,null,null,null,null,null,null,null,null,null,null,null,null,null,6,null,null,null,null,{"$f":"B16","v":{"$error":"#REF!"}},{"$f":"B18","v":{"$error":"#REF!"}}]
[6,{"$f":"IF(#REF!=2,Eleme!#REF!,IF(#REF!=3,Eleme!#REF!,IF(#REF!=4,Eleme!#REF!,IF(#REF!=5,Eleme!#REF!,IF(#REF!=6,Eleme!#REF!)))))","v":{"$error":"#REF!"}},null,null,null,null,null,null,null,null,null,null,null,null,10,{"$f":"IF(AND(K10=0,L10=0),\"\",IF(K10>L10,I8,I11))","v":""},null,null,null,null,null,null,null,null,null,null,null,null,null,null,null,null,null,null,null,null,null,null,null,null,null,null,null,null,null,null,null,null,null,null,null,null,null,null,null,null,null,null,null,null,null,null,null,null,null,null,null,null,7,null,null,null,null,{"$f":"B19","v":{"$error":"#REF!"}},{"$f":"B21","v":{"$error":"#REF!"}}]
[7,{"$f":"IF(#REF!=2,Eleme!#REF!,IF(#REF!=3,Eleme!#REF!,IF(#REF!=4,Eleme!#REF!,IF(#REF!=5,Eleme!#REF!,IF(#REF!=6,Eleme!#REF!)))))","v":{"$error":"#REF!"}},null,null,null,null,null,null,null,null,{"$f":"CH12","v":0},{"$f":"CI12","v":0},null,null,null,null,null,null,null,null,null,null,null,null,null,null,null,null,null,null,null,null,null,null,null,null,null,null,null,null,null,null,null,null,null,null,null,null,null,null,null,null,null,null,null,null,null,null,null,null,null,null,null,null,null,null,null,null,8,null,null,null,null,{"$f":"B22","v":{"$error":"#REF!"}},{"$f":"B24","v":{"$error":"#REF!"}}]
[null,null,null,{"$f":"CH6","v":0},{"$f":"CI6","v":0},null,null,4,{"$f":"IF(AND(D11=0,E11=0),\"\",IF(D11>E11,B10,B12))","v":""},null,null,null,null,null,null,null,null,null,null,null,null,null,null,null,null,null,null,null,null,null,null,null,null,null,null,null,null,null,null,null,null,null,null,null,null,null,null,null,null,null,null,null,null,null,null,null,null,null,null,null,null,null,null,null,null,null,null,null,9,null,null,null,null,{"$f":"I2","v":""},{"$f":"I5","v":""}]
[8,{"$f":"IF(#REF!=2,Eleme!#REF!,IF(#REF!=3,Eleme!#REF!,IF(#REF!=4,Eleme!#REF!,IF(#REF!=5,Eleme!#REF!,IF(#REF!=6,Eleme!#REF!)))))","v":{"$error":"#REF!"}},null,null,null,null,null,null,null,null,null,null,null,null,null,null,null,null,null,null,null,null,null,null,null,null,null,null,null,null,null,null,null,null,null,null,null,null,null,null,null,null,null,null,null,null,null,null,null,null,null,null,null,null,null,null,null,null,null,null,null,null,null,null,null,null,null,null,10,null,null,null,null,{"$f":"I8","v":""},{"$f":"I11","v":""}]
[9,{"$f":"IF(#REF!=2,Eleme!#REF!,IF(#REF!=3,Eleme!#REF!,IF(#REF!=4,Eleme!#REF!,IF(#REF!=5,Eleme!#REF!,IF(#REF!=6,Eleme!#REF!)))))","v":{"$error":"#REF!"}},null,null,null,null,null,null,null,null,null,null,null,null,null,null,null,null,null,null,null,null,null,null,{"$f":"CH17","v":0},{"$f":"+CI17","v":0},null,null,null,{"$f":"IF(AND(Y13=0,Z13=0),\"\",IF(Y13>Z13,W7,W18))","v":""},null,null,null,null,null,null,"1.",null,null,null,null,null,null,null,null,null,null,null,null,null,null,null,null,null,null,null,null,null,null,null,null,null,null,null,null,null,null,null,11,null,null,null,null,{"$f":"I14","v":""},{"$f":"I17","v":""}]
[null,null,null,{"$f":"CH7","v":0},{"$f":"CI7","v":0},null,null,5,{"$f":"IF(AND(D14=0,E14=0),\"\",IF(D14>E14,B13,B15))","v":""},null,null,null,null,null,null,null,null,null,null,null,null,null,null,null,null,null,null,null,null,null,null,null,null,null,null,null,null,null,null,null,null,null,null,null,null,null,null,null,null,null,null,null,null,null,null,null,null,null,null,null,null,null,null,null,null,null,null,null,12,null,null,null,null,{"$f":"I20","v":""},{"$f":"I23","v":""}]
[10,{"$f":"IF(#REF!=2,Eleme!#REF!,IF(#REF!=3,Eleme!#REF!,IF(#REF!=4,Eleme!#REF!,IF(#REF!=5,Eleme!#REF!,IF(#REF!=6,Eleme!#REF!)))))","v":{"$error":"#REF!"}},null,null,null,null,null,null,null,null,null,null,null,null,11,null,null,null,null,null,null,null,null,null,null,null,null,null,null,null,null,null,null,null,null,null,null,null,null,null,null,null,null,null,null,null,null,null,null,null,null,null,null,null,null,null,null,null,null,null,null,null,null,null,null,null,null,null,13,null,null,null,null,{"$f":"+P4","v":""},{"$f":"+P9","v":""}]
[11,{"$f":"IF(#REF!=2,Eleme!#REF!,IF(#REF!=3,Eleme!#REF!,IF(#REF!=4,Eleme!#REF!,IF(#REF!=5,Eleme!#REF!,IF(#REF!=6,Eleme!#REF!)))))","v":{"$error":"#REF!"}},null,null,null,null,null,null,null,null,{"$f":"CH13","v":0},{"$f":"CI13","v":0},null,null,null,{"$f":"IF(AND(K16=0,L16=0),\"\",IF(K16>L16,I14,I17))","v":""},null,null,null,null,null,null,null,null,null,null,null,null,null,null,null,null,null,null,null,null,null,null,null,null,null,null,null,null,null,null,null,null,null,null,null,null,null,null,null,null,null,null,null,null,null,null,null,null,null,null,null,null,14,null,null,null,null,{"$f":"+P16","v":""},{"$f":"+P21","v":""}]
[null,null,null,{"$f":"CH8","v":0},{"$f":"CI8","v":0},null,null,6,{"$f":"IF(AND(D17=0,E17=0),\"\",IF(D17>E17,B16,B18))","v":""},null,null,null,null,null,null,null,null,null,null,null,null,14,null,null,null,null,null,null,null,null,null,null,null,null,null,null,null,null,null,null,null,null,null,null,null,null,null,null,null,null,null,null,null,null,null,null,null,null,null,null,null,null,null,null,null,null,null,null,15,null,null,null,null,{"$f":"+W7","v":""},{"$f":"+W18","v":""}]
[12,{"$f":"IF(#REF!=2,Eleme!#REF!,IF(#REF!=3,Eleme!#REF!,IF(#REF!=4,Eleme!#REF!,IF(#REF!=5,Eleme!#REF!,IF(#REF!=6,Eleme!#REF!)))))","v":{"$error":"#REF!"}},null,null,null,null,null,null,null,null,null,null,null,null,null,null,null,null,null,null,null,null,{"$f":"IF(AND(R19=0,S19=0),\"\",IF(R19>S19,P16,P21))","v":""}]
[13,{"$f":"IF(#REF!=2,Eleme!#REF!,IF(#REF!=3,Eleme!#REF!,IF(#REF!=4,Eleme!#REF!,IF(#REF!=5,Eleme!#REF!,IF(#REF!=6,Eleme!#REF!)))))","v":{"$error":"#REF!"}},null,null,null,null,null,null,null,null,null,null,null,null,null,null,null,{"$f":"CH16","v":0},{"$f":"CI16","v":0},null,null,null,null,null,null,null,null,null,null,{"$f":"IF(AND(Y13=0,Z13=0),\"\",IF(Y13<Z13,W7,W18))","v":""},null,null,null,null,null,null,"2."]
[null,null,null,{"$f":"CH9","v":0},{"$f":"CI9","v":0},null,null,7,{"$f":"IF(AND(D20=0,E20=0),\"\",IF(D20>E20,B19,B21))","v":""}]
[14,{"$f":"IF(#REF!=2,Eleme!#REF!,IF(#REF!=3,Eleme!#REF!,IF(#REF!=4,Eleme!#REF!,IF(#REF!=5,Eleme!#REF!,IF(#REF!=6,Eleme!#REF!)))))","v":{"$error":"#REF!"}},null,null,null,null,null,null,null,null,null,null,null,null,12,{"$f":"IF(AND(K22=0,L22=0),\"\",IF(K22>L22,I20,I23))","v":""},null,null,null,null,null,null,null,null,null,null,null,null,null,{"$f":"IF(AND(R7=0,S7=0),\"\",IF(R7<S7,P4,P9))","v":""},null,null,null,null,null,null,"3."]
[15,{"$f":"IF(#REF!=2,Eleme!#REF!,IF(#REF!=3,Eleme!#REF!,IF(#REF!=4,Eleme!#REF!,IF(#REF!=5,Eleme!#REF!,IF(#REF!=6,Eleme!#REF!)))))","v":{"$error":"#REF!"}},null,null,null,null,null,null,null,null,{"$f":"CH14","v":0},{"$f":"CI14","v":0}]
[null,null,null,{"$f":"CH10","v":0},{"$f":"CI10","v":0},null,null,8,{"$f":"IF(AND(D23=0,E23=0),\"\",IF(D23>E23,B22,B24))","v":""},null,null,null,null,null,null,null,null,null,null,null,null,null,null,null,null,null,null,null,null,{"$f":"IF(AND(R19=0,S19=0),\"\",IF(R19<S19,P16,P21))","v":""},null,null,null,null,null,null,"3."]
[16,{"$f":"IF(#REF!=2,Eleme!#REF!,IF(#REF!=3,Eleme!#REF!,IF(#REF!=4,Eleme!#REF!,IF(#REF!=5,Eleme!#REF!,IF(#REF!=6,Eleme!#REF!)))))","v":{"$error":"#REF!"}}]
[null,null,null,null,null,null,null,null,null,null,null,null,null,null,null,null,null,null,null,null,null,null,null,null,null,null,null,null,null,null,null,null,null,null,null,null,null,null,null,null,null,null,null,null,null,null,null,null,null,null,null,null,null,null,null,null,null,null,null,null,null,null,null,null,null,null,null,null,null,null,null,null,null,null,null,null,null,null,null,null,null,null,null,null,null,null,null,null,null,null,null,null,null,null,null,null,null,null,null,null,null,null,null,null,null,null,null,null,null,null,null,null,null,null,null,null,null,null,null,null,null,null,null,null,null,null,null,null,null,null,null,null,null,null,null,null,null,null,null,null,null,null,null,null,null,null,null,null,null,null,null,null,null,null,null,null,null,null,null,null,null,null,null,null,null,null,null,null,null,null,null,null,null,null,null,null,null,null,null,null,null,null,null,null,null,null,null,null,null,null,null,null,null,null,null,null,null,null,null,null,null,null,null,null,null,null,null,null,null,null,null,null,null,null,null,null,null,null,null,null,null,null,null,null,null,null,null,null,null,null,null,null,null,null,null,null,null,null,null,null,null,null,null,null,null,null,null,null,null,null,null,null,null,null,null,null,null,null,null,null,null,null,null,null,null,null,null,null,null,null,null,null,null,null,null,null,null,null,null,null,null,null,null,null,null,null,null,null,null,null,null,null,null,null,null,null,null,null,null,null,null,null,null,null,null,null,null,null,null,null,null,null,null,null,null,null,null,null,null,null,null,null,null,null,null,null,null,null,null,null,null,null,null,null,null,null,null,null,null,null,null,null,null,null,null,null,null,null,null,null,null,null,null,null,null,null,null,null,null,null,null,null,null,null,null,null,null,null,null,null,null,null,null,null,null,null,null,null,null,null,null,null,null,null,null,null,null,null,null,null,null,null,null,null,null,null,null,null,null,null,null,null,null,null,null,null,null,null,null,null,null,null,null,null,null,null,null,null,null,null,null,null,null,null,null,null,null,null,null,null,null,null,null,null,null,null,null,null,null,null,null,null,null,null,null,null,null,null,null,null,null,null,null,null,null,null,null,null,null,null,null,null,null,null,null,null,null,null,null,null,null,null,null,null,null,null,null,null,null,null,null,null,null,null,null,null,null,null,null,null,null,null,null,null,null,null,null,null,null,null,null,null,null,null,null,null,null,null,null,null,null,null,null,null,null,null,null,null,null,null,null,null,null,null,null,null,null,null,null,null,null,null,null,null,null,null,null,null,null,null,null,null,null,null,null,null,null,null,null,null,null,null,null,null,null,null,null,null,null,null,null,null,null,null,null,null,null,null,null,null,null,null,null,null,null,null,null,null,null,null,null,null,null,null,null,null,null,null,null,null,null,null,null,null,null,null,null,null,null,null,null,null,null,null,null,null,null,null,null,null,null,null,null,null,null,null,null,null,null,null,null,null,null,null,null,null,null,null,null,null,null,null,null,null,null,null,null,null,null,null,null,null,null,null,null,null,null,null,null,null,null,null,null,null,null,null,null,null,null,null,null,null,null,null,null,null,null,null,null,null,null,null,null,null,null,null,null,null,null,null,null,null,null,null,null,null,null,null,null,null,null,null,null,null,null,null,null,null,null,null,null,null,null,null,null,null,null,null,null,null,null,null,null,null,null,null,null,null,null,null,null,null,null,null,null,null,null,null,null,null,null,null,null,null,null,null,null,null,null,null,null,null,null,null,null,null,null,null,null,null,null,null,null,null,null,null,null,null,null,null,null,null,null,null,null,null,null,null,null,null,null,null,null,null,null,null,null,null,null,null,null,null,null,null,null,null,null,null,null,null,null,null,null,null,null,null,null,null,null,null,null,null,null,null,null,null,null,null,null,null,null,null,null,null,null,null,null,null,null,null,null,null,null,null,null,null,null,null,null,null,null,null,null,null,null,null,null,null,null,null,null,null,null,null,null,null,null,null,null,null,null,null,null,null,null,null,null,null,null,null,null,null,null,null,null,null,null,null,null,null,null,null,null,null,null,null,null,null,null,null,null,null,null,null,null,null,null,null,null,null,null,null,null,null,null,null,null,null,null,null,null,null,null,null,null,null,null,null,null,null,null,null,null,null,null,null,null,null,null,null,null,null,null,null,null,null,null,null,null,null,null,null,null,null,null,null,null,null,null,null,null,null,null,null,null,null,null,null,null,null,null,null,null,null,null,null,null,null,null,null,null,null,null,null,null,null,null,null,null,null,null,null,null,null,null,null,null,null,null,null,null,null,null,null,null,null,null,null,null,null,null,null,null,null,null,null,null,null,null,null,null,null,null,null,null,null,null,null,null,null,null,null,null,null,null,null,null,null,null,null,null,null,null,null,null,null,null,null,null,null,null,null,null,null,null,null,null,null,null,null,null,null,null,null,null,null,null,null,null,null,null,null,null,null,null,null,null,null,null,null,null,null,null,null,null,null,null,null,null,null,null,null,null,null,null,null,null,null,null,null,null,null,null,null,null,null,null,null,null,null,null,null,null,null,null,null,null,null,null,null,null,null,null,null,null,null,null,null,null,null,null,null,null,null,null,null,null,null,null,null,null,null,null,null,null,null,null,null,null,null,null,null,null,null,null,null,null,null,null,null,null,null,null,null,null,null,null,null,null,null,null,null,null,null,null,null,null,null,null,null,null,null,null,null,null,null,null,null,null,null,null,null,null,null,null,null,null,null,null,null,null,null,null,null,null,null,null,null,null,null,null,null,null,null,null,null,null,null,null,null,null,null,null,null,null,null,null,null,null,null,null,null,null,null,null,null,0]

{"sheet":"SIRALAMA","index":14,"n_rows":41,"n_cols":16,"rows_kept":41,"cut":false,"hidden":false,"merged":[[0,1,0,5],[1,1,1,5],[3,1,3,5],[2,1,2,5]]}
[null,"TÜRKİYE MASA TENİSİ FEDERASYONU\nKÜÇÜKLER KUZEYBATI BÖLGESİ YARIŞMALARI",null,null,null,null,null,null,null,null,null,"32 (DE)",4,"--------",1,1]
[null,"12-13 Mart 2025 KOCAELİ",null,null,null,null,null,null,null,null,null,"16 (DE)",null,"Ferdi"]
[null,"ERKEK TAKIM SIRALAMA",null,null,null,null,null,null,null,null,null,"16 (DE)",null,"Ferdi"]
[null,null,null,null,null,null,null,null,null,null,null,"16 (TE)"]
[null,null,"Sıra","Takım","Okul Adı","İli",null,null,null,null,null,"8DE"]
[null,null,1,"","FENERBAHÇE (A)","İSTANBUL",null,null,null,null,null,"8TE"]
[null,null,2,"","İSTANBUL DSİ (A)","İSTANBUL",null,null,null,null,null,"-------"]
[null,null,3,"","YALOVA BLD. GENÇLİK SPOR (A)","YALOVA",null,null,null,null,null,16]
[null,null,4,"","YILDIZ RAKETLER (A)","İSTANBUL",null,null,null,null,null,"Cift-Mix"]
[null,null,5,"","TRAKER SPOR (A)","KIRKLARELİ",null,null,null,null,null,"16(Okul)"]
[null,null,6,"","PENDİK BLD. SPOR (A)","İSTANBUL",null,null,null,null,null,"32DE(16)"]
[null,null,7,"","ÇERKEZKÖY BLD. GSK (A)","TEKİRDAĞ"]
[null,null,8,"","YALOVA BLD. GENÇLİK SPOR (B)","YALOVA"]
[null,null,9,"TRAKER SPOR (B) (KRL)","TRAKER SPOR (B)","KIRKLARELİ"]
[null,null,9,"BURSA B. ŞEH. BLD. SPOR (A) (BRS)","BURSA B. ŞEH. BLD. SPOR (A)","BURSA"]
[null,null,9,"D.S.İ. BENT SPOR (A) (ESK)","D.S.İ. BENT SPOR (A)","ESKİŞEHİR"]
[null,null,9,"YILDIZ RAKETLER (A) (İST)","PENDİK BLD. SPOR (C)","İSTANBUL"]
[null,null,9,"İBB SPOR (A) (İST)","İBB SPOR (A)","İSTANBUL"]
[null,null,9,"ÇERKEZKÖY BLD. GSK (A) (TKD)","LÜLEBURGAZ GENÇLİK SPOR  (A)","KIRKLARELİ"]
[null,null,9,"TRAKER SPOR (A) (KRL)","EDİRNE YURDUM SPOR (A)","EDİRNE"]
[null,null,9,"YALOVA BLD. GENÇLİK SPOR (A) (YLV)","YILDIZ RAKETLER (B)","İSTANBUL"]
[null,null,null,null,0,0]
[null,null,null,null,0,0]
[null,null,null,null,0,0]
[null,null,null,null,0,0]
[null,null,null,null,0,0]
[null,null,null,null,0,0]
[null,null,null,null,0,0]
[null,null,null,null,0,0]
[null,null,null,null,0,0]
[null,null,null,null,0,0]
[null,null,null,null,0,0]
[null,null,null,null,0,0]
[null,null,null,null,0,0]
[null,null,null,null,0,0]
[null,null,null,null,0,0]
[null,null,null,null,0,0]
[null,null,null,null,0,0]
[null,null,null,null,0,0]
[null,null,null,null,0,0]
[null,null,null,null,0,0]

{"sheet":"Ferdi","index":15,"n_rows":31,"n_cols":41,"rows_kept":31,"cut":false,"hidden":true,"merged":[[0,27,0,30],[28,19,28,22],[28,23,28,25],[29,1,29,2],[29,5,29,8],[29,9,29,11],[29,15,29,16],[29,19,29,22],[29,23,29,25],[28,1,28,2],[28,3,28,4],[28,5,28,8],[28,9,28,11],[28,15,28,16],[28,17,28,18],[25,22,26,22],[25,23,26,23],[25,24,26,24],[25,25,26,25],[25,10,26,10],[25,11,26,11],[25,14,26,14],[23,24,24,24],[23,25,24,25],[23,22,24,22],[23,23,24,23],[23,8,24,8],[23,9,24,9],[23,10,24,10],[23,11,24,11],[23,14,24,14],[23,17,24,17],[25,0,26,0],[25,3,26,3],[25,4,26,4],[25,5,26,5],[25,6,26,6],[25,7,26,7],[25,8,26,8],[25,9,26,9],[23,18,24,18],[25,20,26,20],[25,21,26,21],[23,0,24,0],[23,3,24,3],[23,4,24,4],[23,5,24,5],[23,6,24,6],[23,7,24,7],[25,17,26,17],[25,18,26,18],[25,19,26,19],[23,19,24,19],[23,20,24,20],[23,21,24,21],[21,0,22,0],[21,1,22,1],[21,2,22,2],[21,3,21,8],[19,1,19,5],[19,6,19,7],[19,8,19,9],[19,10,19,11],[19,15,19,19],[19,20,19,21],[19,22,19,23],[19,24,19,25],[21,15,22,15],[21,16,22,16],[21,17,21,22],[21,23,21,24],[21,9,21,10],[21,14,22,14],[16,0,16,11],[16,14,16,25],[17,0,17,11],[17,14,17,25],[18,1,18,5],[18,6,18,7],[18,8,18,9],[18,10,18,11],[18,15,18,19],[18,20,18,21],[18,22,18,23],[18,24,18,25],[12,19,12,22],[12,23,12,25],[13,1,13,2],[13,5,13,8],[13,9,13,11],[13,15,13,16],[13,19,13,22],[13,23,13,25],[12,1,12,2],[12,3,12,4],[12,5,12,8],[12,9,12,11],[12,15,12,16],[12,17,12,18],[9,22,10,22],[9,23,10,23],[9,24,10,24],[9,25,10,25],[9,10,10,10],[9,11,10,11],[9,14,10,14],[9,17,10,17],[9,18,10,18],[9,19,10,19],[7,24,8,24],[7,25,8,25],[9,0,10,0],[9,3,10,3],[9,4,10,4],[9,5,10,5],[9,6,10,6],[9,7,10,7],[9,8,10,8],[9,9,10,9],[7,18,8,18],[7,19,8,19],[7,20,8,20],[7,21,8,21],[7,22,8,22],[7,23,8,23],[7,8,8,8],[7,9,8,9],[7,10,8,10],[7,11,8,11],[7,14,8,14],[7,17,8,17],[9,20,10,20],[9,21,10,21],[7,0,8,0],[7,3,8,3],[7,4,8,4],[7,5,8,5],[7,6,8,6],[7,7,8,7],[5,0,6,0],[5,1,6,1],[5,2,6,2],[5,3,5,8],[3,1,3,5],[3,6,3,7],[3,8,3,9],[3,10,3,11],[3,15,3,19],[3,20,3,21],[3,22,3,23],[3,24,3,25],[5,15,6,15],[5,16,6,16],[5,17,5,22],[5,23,5,24],[5,9,5,10],[5,14,6,14],[0,0,0,11],[0,14,0,25],[1,0,1,11],[1,14,1,25],[2,1,2,5],[2,6,2,7],[2,8,2,9],[2,10,2,11],[2,15,2,19],[2,20,2,21],[2,22,2,23],[2,24,2,25]]}
[{"$f":"Katılım!A1","v":"TÜRKİYE MASA TENİSİ FEDERASYONU\nKÜÇÜKLER KUZEYBATI BÖLGESİ YARIŞMALARI"},null,null,null,null,null,null,null,null,null,null,null,null,null,{"$f":"+A1","v":"TÜRKİYE MASA TENİSİ FEDERASYONU\nKÜÇÜKLER KUZEYBATI BÖLGESİ YARIŞMALARI"},null,null,null,null,null,null,null,null,null,null,null,null,"Manuel müsabaka çıktısı almak",null,null,null,null,null,null,null,null,null,null,null,"Ön_Eleme",9]
[{"$f":"Katılım!A2","v":"ERKEK TAKIM  [12-13 Mart 2025 KOCAELİ]"},null,null,null,null,null,null,null,null,null,null,null,null,null,{"$f":"+A2","v":"ERKEK TAKIM  [12-13 Mart 2025 KOCAELİ]"},null,null,null,null,null,null,null,null,null,null,null,null,null,null,null,null,null,null,null,null,null,null,null,null,"Eleme"]
["No","Yarışma",null,null,null,null,"Tarih",null,"Saat",null,"Masa",null,null,null,"No","Yarışma",null,null,null,null,"Tarih",null,"Saat",null,"Masa",null,null,null,null,null,null,null,null,null,null,null,null,null,null,"32DE"]
[null,null,null,null,null,null,null,null,null,null,null,null,null,null,{"$f":"IF(A4=0,0,A4+1)","v":0},null,null,null,null,null,null,null,null,null,null,null,null,null,null,null,null,null,null,null,null,null,null,null,null,"16DE"]
[13,null,null,null,null,null,null,null,null,null,null,null,null,null,{"$f":"O4&\".\"&O4","v":"0.0"},null,null,null,null,null,null,null,null,null,null,null,null,null,null,null,null,null,null,null,null,null,null,null,null,"16(TE)"]
["K","Nr",null,"SETLER",null,null,null,null,null,"Sporcu",null,"Öğ.",null,null,"K","Nr",null,"SETLER",null,null,null,null,null,"Sporcu",null,"Öğ.",null,null,null,null,null,null,null,null,null,null,null,null,null,"16(8DE)"]
[null,null,null,1,2,3,4,5,"N","M","SKK","SK",null,null,null,null,null,1,2,3,4,5,"N","M","SKK","SK",null,null,null,null,null,null,null,null,null,null,null,null,null,"8DE"]
["A","",null,null,null,null,null,null,null,null,null,null,null,null,"A","",null,null,null,null,null,null,null,null,null,null,null,null,null,null,null,null,null,null,null,null,null,null,null,"8TE"]
[null,"FR",null,null,null,null,null,null,null,null,null,null,null,null,null,"FR",null,null,null,null,null,null,null,null,null,null,null,null,null,null,null,null,null,null,null,null,null,null,null,"-----"]
["X","",null,null,null,null,null,null,null,null,null,null,null,null,"X","",null,null,null,null,null,null,null,null,null,null,null,null,null,null,null,null,null,null,null,null,null,null,null,16]
[null,"FR",null,null,null,null,null,null,null,null,null,null,null,null,null,"FR",null,null,null,null,null,null,null,null,null,null,null,null,null,null,null,null,null,null,null,null,null,null,null,"Cift-Mix"]
[null,null,null,null,null,null,null,null,null,null,null,null,null,null,null,null,null,null,null,null,null,null,null,null,null,null,null,null,null,null,null,null,null,null,null,null,null,null,null,"32DE(16)"]
["Nr.","Galip: Adı Soyadı / İmza",null,"SONUÇ",null,"Hakem: Adı Soyadı / İmza",null,null,null,"Başhakem",null,null,null,null,"Nr.","Galip: Adı Soyadı / İmza",null,"SONUÇ",null,"Hakem: Adı Soyadı / İmza",null,null,null,"Başhakem"]
[null,null,null,{"$f":"#REF!","v":{"$error":"#REF!"}},null,null,null,null,null,null,null,null,null,null,null,null,null,{"$f":"#REF!","v":{"$error":"#REF!"}}]
["Başlama Saati:",null,null,"Bitiş Saati:",null,null,null,null,null,null,null,null,null,null,"Başlama Saati:",null,null,"Bitiş Saati:"]
[]
[{"$f":"+A1","v":"TÜRKİYE MASA TENİSİ FEDERASYONU\nKÜÇÜKLER KUZEYBATI BÖLGESİ YARIŞMALARI"},null,null,null,null,null,null,null,null,null,null,null,null,null,{"$f":"+A1","v":"TÜRKİYE MASA TENİSİ FEDERASYONU\nKÜÇÜKLER KUZEYBATI BÖLGESİ YARIŞMALARI"}]
[{"$f":"+A2","v":"ERKEK TAKIM  [12-13 Mart 2025 KOCAELİ]"},null,null,null,null,null,null,null,null,null,null,null,null,null,{"$f":"+A2","v":"ERKEK TAKIM  [12-13 Mart 2025 KOCAELİ]"}]
["No","Yarışma",null,null,null,null,"Tarih",null,"Saat",null,"Masa",null,null,null,"No","Yarışma",null,null,null,null,"Tarih",null,"Saat",null,"Masa"]
[{"$f":"IF(O4=0,0,O4+1)","v":0},null,null,null,null,null,null,null,null,null,null,null,null,null,{"$f":"IF(A20=0,0,A20+1)","v":0}]
[{"$f":"A20&\".\"&A20","v":"0.0"},null,null,null,null,null,null,null,null,null,null,null,null,null,{"$f":"O20&\".\"&O20","v":"0.0"}]
["K","Nr",null,"SETLER",null,null,null,null,null,"Sporcu",null,"Öğ.",null,null,"K","Nr",null,"SETLER",null,null,null,null,null,"Sporcu",null,"Öğ."]
[null,null,null,1,2,3,4,5,"N","M","SKK","SK",null,null,null,null,null,1,2,3,4,5,"N","M","SKK","SK"]
["A","",null,null,null,null,null,null,null,null,null,null,null,null,"A",""]
[null,"FR",null,null,null,null,null,null,null,null,null,null,null,null,null,"FR"]
["X","",null,null,null,null,null,null,null,null,null,null,null,null,"X",""]
[null,"FR",null,null,null,null,null,null,null,null,null,null,null,null,null,"FR"]
[]
["Nr.","Galip: Adı Soyadı / İmza",null,"SONUÇ",null,"Hakem: Adı Soyadı / İmza",null,null,null,"Başhakem",null,null,null,null,"Nr.","Galip: Adı Soyadı / İmza",null,"SONUÇ",null,"Hakem: Adı Soyadı / İmza",null,null,null,"Başhakem"]
[null,null,null,{"$f":"#REF!","v":{"$error":"#REF!"}},null,null,null,null,null,null,null,null,null,null,null,null,null,{"$f":"#REF!","v":{"$error":"#REF!"}}]
["Başlama Saati:",null,null,"Bitiş Saati:",null,null,null,null,null,null,null,null,null,null,"Başlama Saati:",null,null,"Bitiş Saati:"]

{"sheet":"Puan","index":16,"n_rows":259,"n_cols":5,"rows_kept":259,"cut":false,"hidden":true,"merged":[[1,2,1,3],[1,4,2,4],[1,1,2,1]]}
[]
[null,"Sıra","Sporcunun",null,"Puan"]
[null,null,"Adı - Soyadı","Kulübü"]
[null,1,{"$f":"'32DE'!BT39","v":""},{"$f":"IFERROR(VLOOKUP(C4,Katılım!D4:F36,3,0),\"\")","v":""},32]
[null,2,{"$f":"+'32DE'!BT57","v":""},{"$f":"IFERROR(VLOOKUP(C5,Katılım!D5:F36,3,0),\"\")","v":""},31]
[null,3,{"$f":"+'32DE'!BM63","v":""},{"$f":"IFERROR(VLOOKUP(C6,Katılım!D6:F36,3,0),\"\")","v":""},30]
[null,4,{"$f":"+'32DE'!BF71","v":""},{"$f":"IFERROR(VLOOKUP(C7,Katılım!D7:F36,3,0),\"\")","v":""},29]
[null,5,{"$f":"+'32DE'!BF75","v":""},{"$f":"IFERROR(VLOOKUP(C8,Katılım!D8:F36,3,0),\"\")","v":""},28]
[null,6,{"$f":"+'32DE'!BF77","v":""},{"$f":"IFERROR(VLOOKUP(C9,Katılım!D9:F36,3,0),\"\")","v":""},27]
[null,7,{"$f":"+'32DE'!AY79","v":""},{"$f":"IFERROR(VLOOKUP(C10,Katılım!D10:F36,3,0),\"\")","v":""},26]
[null,8,{"$f":"+'32DE'!AY81","v":""},{"$f":"IFERROR(VLOOKUP(C11,Katılım!D11:F36,3,0),\"\")","v":""},25]
[null,9,{"$f":"+'32DE'!AY84","v":""},{"$f":"IFERROR(VLOOKUP(C12,Katılım!D12:F36,3,0),\"\")","v":""},24]
[null,10,{"$f":"+'32DE'!AY86","v":""},{"$f":"IFERROR(VLOOKUP(C13,Katılım!D13:F36,3,0),\"\")","v":""},23]
[null,11,{"$f":"+'32DE'!AY88","v":""},{"$f":"IFERROR(VLOOKUP(C14,Katılım!D14:F36,3,0),\"\")","v":""},22]
[null,12,{"$f":"+'32DE'!AY90","v":""},{"$f":"IFERROR(VLOOKUP(C15,Katılım!D15:F36,3,0),\"\")","v":""},21]
[null,13,{"$f":"+'32DE'!AR92","v":""},{"$f":"IFERROR(VLOOKUP(C16,Katılım!D16:F36,3,0),\"\")","v":""},20]
[null,14,{"$f":"+'32DE'!AR94","v":""},{"$f":"IFERROR(VLOOKUP(C17,Katılım!D17:F36,3,0),\"\")","v":""},19]
[null,15,{"$f":"+'32DE'!AR96","v":""},{"$f":"IFERROR(VLOOKUP(C18,Katılım!D18:F36,3,0),\"\")","v":""},18]
[null,16,{"$f":"+'32DE'!AR98","v":""},{"$f":"IFERROR(VLOOKUP(C19,Katılım!D19:F36,3,0),\"\")","v":""},17]
[null,"17-24",{"$f":"IF('32DE'!$R$51<'32DE'!$S$51,'32DE'!$P$50,'32DE'!$P$52)","v":""},{"$f":"IFERROR(VLOOKUP(C20,Katılım!D20:F36,3,0),\"\")","v":""},16]
[null,"17-24",{"$f":"IF('32DE'!$R$55<'32DE'!$S$55,'32DE'!$P$54,'32DE'!$P$56)","v":""},{"$f":"IFERROR(VLOOKUP(C21,Katılım!D21:F36,3,0),\"\")","v":""},16]
[null,"17-24",{"$f":"IF('32DE'!$R$59<'32DE'!$S$59,'32DE'!$P$58,'32DE'!$P$60)","v":""},{"$f":"IFERROR(VLOOKUP(C22,Katılım!D22:F36,3,0),\"\")","v":""},16]
[null,"17-24",{"$f":"IF('32DE'!$R$63<'32DE'!$S$63,'32DE'!$P$62,'32DE'!$P$64)","v":""},{"$f":"IFERROR(VLOOKUP(C23,Katılım!D23:F36,3,0),\"\")","v":""},16]
[null,"17-24",{"$f":"IF('32DE'!$R$67<'32DE'!$S$67,'32DE'!$P$66,'32DE'!$P$68)","v":""},{"$f":"IFERROR(VLOOKUP(C24,Katılım!D24:F36,3,0),\"\")","v":""},16]
[null,"17-24",{"$f":"IF('32DE'!$R$71<'32DE'!$S$71,'32DE'!$P$70,'32DE'!$P$72)","v":""},{"$f":"IFERROR(VLOOKUP(C25,Katılım!D25:F36,3,0),\"\")","v":""},16]
[null,"17-24",{"$f":"IF('32DE'!$R$75<'32DE'!$S$75,'32DE'!$P$74,'32DE'!$P$76)","v":""},{"$f":"IFERROR(VLOOKUP(C26,Katılım!D26:F36,3,0),\"\")","v":""},16]
[null,"17-24",{"$f":"IF('32DE'!$R$79<'32DE'!$S$79,'32DE'!$P$78,'32DE'!$P$80)","v":""},{"$f":"IFERROR(VLOOKUP(C27,Katılım!D27:F36,3,0),\"\")","v":""},16]
[null,"25-32",{"$f":"IF('32DE'!$K$52<'32DE'!$L$52,'32DE'!$I$51,'32DE'!$I$53)","v":""},{"$f":"IFERROR(VLOOKUP(C28,Katılım!D28:F36,3,0),\"\")","v":""},8]
[null,"25-32",{"$f":"IF('32DE'!$K$56<'32DE'!$L$56,'32DE'!$I$55,'32DE'!$I$57)","v":""},{"$f":"IFERROR(VLOOKUP(C29,Katılım!D29:F36,3,0),\"\")","v":""},8]
[null,"25-32",{"$f":"IF('32DE'!$K$60<'32DE'!$L$60,'32DE'!$I$59,'32DE'!$I$61)","v":""},{"$f":"IFERROR(VLOOKUP(C30,Katılım!D30:F36,3,0),\"\")","v":""},8]
[null,"25-32",{"$f":"IF('32DE'!$K$64<'32DE'!$L$64,'32DE'!$I$63,'32DE'!$I$65)","v":""},{"$f":"IFERROR(VLOOKUP(C31,Katılım!D31:F36,3,0),\"\")","v":""},8]
[null,"25-32",{"$f":"IF('32DE'!$K$68<'32DE'!$L$68,'32DE'!$I$67,'32DE'!$I$69)","v":""},{"$f":"IFERROR(VLOOKUP(C32,Katılım!D32:F36,3,0),\"\")","v":""},8]
[null,"25-32",{"$f":"IF('32DE'!$K$72<'32DE'!$L$72,'32DE'!$I$71,'32DE'!$I$73)","v":""},{"$f":"IFERROR(VLOOKUP(C33,Katılım!D33:F36,3,0),\"\")","v":""},8]
[null,"25-32",{"$f":"IF('32DE'!$K$76<'32DE'!$L$76,'32DE'!$I$75,'32DE'!$I$77)","v":""},{"$f":"IFERROR(VLOOKUP(C34,Katılım!D34:F36,3,0),\"\")","v":""},8]
[null,"25-32",{"$f":"IF('32DE'!$K$80<'32DE'!$L$80,'32DE'!$I$79,'32DE'!$I$81)","v":""},{"$f":"IFERROR(VLOOKUP(C35,Katılım!D35:F36,3,0),\"\")","v":""},8]
[null,"33-64",{"$f":"IF(OR(Eleme!#REF!=\"\",Eleme!#REF!=0,Eleme!#REF!=1,Eleme!#REF!=2),Eleme!#REF!,Eleme!#REF!)","v":{"$error":"#REF!"}},{"$f":"IFERROR(VLOOKUP(C36,Katılım!D36:F36,3,0),\"\")","v":""},4]
[null,"33-64",{"$f":"IF(OR(Eleme!#REF!=\"\",Eleme!#REF!=0,Eleme!#REF!=1,Eleme!#REF!=2),Eleme!#REF!,Eleme!#REF!)","v":{"$error":"#REF!"}},{"$f":"IFERROR(VLOOKUP(C37,Katılım!#REF!,3,0),\"\")","v":""},4]
[null,"33-64",{"$f":"IF(OR(Eleme!#REF!=\"\",Eleme!#REF!=0,Eleme!#REF!=1,Eleme!#REF!=2),Eleme!#REF!,Eleme!#REF!)","v":{"$error":"#REF!"}},{"$f":"IFERROR(VLOOKUP(C38,Katılım!#REF!,3,0),\"\")","v":""},4]
[null,"33-64",{"$f":"IF(OR(Eleme!#REF!=\"\",Eleme!#REF!=0,Eleme!#REF!=1,Eleme!#REF!=2),Eleme!#REF!,Eleme!#REF!)","v":{"$error":"#REF!"}},{"$f":"IFERROR(VLOOKUP(C39,Katılım!#REF!,3,0),\"\")","v":""},4]
[null,"33-64",{"$f":"IF(OR(Eleme!#REF!=\"\",Eleme!#REF!=0,Eleme!#REF!=1,Eleme!#REF!=2),Eleme!#REF!,Eleme!#REF!)","v":{"$error":"#REF!"}},{"$f":"IFERROR(VLOOKUP(C40,Katılım!#REF!,3,0),\"\")","v":""},4]
[null,"33-64",{"$f":"IF(OR(Eleme!#REF!=\"\",Eleme!#REF!=0,Eleme!#REF!=1,Eleme!#REF!=2),Eleme!#REF!,Eleme!#REF!)","v":{"$error":"#REF!"}},{"$f":"IFERROR(VLOOKUP(C41,Katılım!#REF!,3,0),\"\")","v":""},4]
[null,"33-64",{"$f":"IF(OR(Eleme!#REF!=\"\",Eleme!#REF!=0,Eleme!#REF!=1,Eleme!#REF!=2),Eleme!#REF!,Eleme!#REF!)","v":{"$error":"#REF!"}},{"$f":"IFERROR(VLOOKUP(C42,Katılım!#REF!,3,0),\"\")","v":""},4]
[null,"33-64",{"$f":"IF(OR(Eleme!#REF!=\"\",Eleme!#REF!=0,Eleme!#REF!=1,Eleme!#REF!=2),Eleme!#REF!,Eleme!#REF!)","v":{"$error":"#REF!"}},{"$f":"IFERROR(VLOOKUP(C43,Katılım!#REF!,3,0),\"\")","v":""},4]
[null,"33-64",{"$f":"IF(OR(Eleme!#REF!=\"\",Eleme!#REF!=0,Eleme!#REF!=1,Eleme!#REF!=2),Eleme!#REF!,Eleme!#REF!)","v":{"$error":"#REF!"}},{"$f":"IFERROR(VLOOKUP(C44,Katılım!#REF!,3,0),\"\")","v":""},4]
[null,"33-64",{"$f":"IF(OR(Eleme!#REF!=\"\",Eleme!#REF!=0,Eleme!#REF!=1,Eleme!#REF!=2),Eleme!#REF!,Eleme!#REF!)","v":{"$error":"#REF!"}},{"$f":"IFERROR(VLOOKUP(C45,Katılım!#REF!,3,0),\"\")","v":""},4]
[null,"33-64",{"$f":"IF(OR(Eleme!#REF!=\"\",Eleme!#REF!=0,Eleme!#REF!=1,Eleme!#REF!=2),Eleme!#REF!,Eleme!#REF!)","v":{"$error":"#REF!"}},{"$f":"IFERROR(VLOOKUP(C46,Katılım!#REF!,3,0),\"\")","v":""},4]
[null,"33-64",{"$f":"IF(OR(Eleme!#REF!=\"\",Eleme!#REF!=0,Eleme!#REF!=1,Eleme!#REF!=2),Eleme!#REF!,Eleme!#REF!)","v":{"$error":"#REF!"}},{"$f":"IFERROR(VLOOKUP(C47,Katılım!#REF!,3,0),\"\")","v":""},4]
[null,"33-64",{"$f":"IF(OR(Eleme!#REF!=\"\",Eleme!#REF!=0,Eleme!#REF!=1,Eleme!#REF!=2),Eleme!#REF!,Eleme!#REF!)","v":{"$error":"#REF!"}},{"$f":"IFERROR(VLOOKUP(C48,Katılım!#REF!,3,0),\"\")","v":""},4]
[null,"33-64",{"$f":"IF(OR(Eleme!#REF!=\"\",Eleme!#REF!=0,Eleme!#REF!=1,Eleme!#REF!=2),Eleme!#REF!,Eleme!#REF!)","v":{"$error":"#REF!"}},{"$f":"IFERROR(VLOOKUP(C49,Katılım!#REF!,3,0),\"\")","v":""},4]
[null,"33-64",{"$f":"IF(OR(Eleme!#REF!=\"\",Eleme!#REF!=0,Eleme!#REF!=1,Eleme!#REF!=2),Eleme!#REF!,Eleme!#REF!)","v":{"$error":"#REF!"}},{"$f":"IFERROR(VLOOKUP(C50,Katılım!#REF!,3,0),\"\")","v":""},4]
[null,"33-64",{"$f":"IF(OR(Eleme!#REF!=\"\",Eleme!#REF!=0,Eleme!#REF!=1,Eleme!#REF!=2),Eleme!#REF!,Eleme!#REF!)","v":{"$error":"#REF!"}},{"$f":"IFERROR(VLOOKUP(C51,Katılım!#REF!,3,0),\"\")","v":""},4]
[null,"33-64",{"$f":"IF(OR(Eleme!#REF!=\"\",Eleme!#REF!=0,Eleme!#REF!=1,Eleme!#REF!=2),Eleme!#REF!,Eleme!#REF!)","v":{"$error":"#REF!"}},{"$f":"IFERROR(VLOOKUP(C52,Katılım!#REF!,3,0),\"\")","v":""},4]
[null,"33-64",{"$f":"IF(OR(Eleme!#REF!=\"\",Eleme!#REF!=0,Eleme!#REF!=1,Eleme!#REF!=2),Eleme!#REF!,Eleme!#REF!)","v":{"$error":"#REF!"}},{"$f":"IFERROR(VLOOKUP(C53,Katılım!#REF!,3,0),\"\")","v":""},4]
[null,"33-64",{"$f":"IF(OR(Eleme!#REF!=\"\",Eleme!#REF!=0,Eleme!#REF!=1,Eleme!#REF!=2),Eleme!#REF!,Eleme!#REF!)","v":{"$error":"#REF!"}},{"$f":"IFERROR(VLOOKUP(C54,Katılım!#REF!,3,0),\"\")","v":""},4]
[null,"33-64",{"$f":"IF(OR(Eleme!#REF!=\"\",Eleme!#REF!=0,Eleme!#REF!=1,Eleme!#REF!=2),Eleme!#REF!,Eleme!#REF!)","v":{"$error":"#REF!"}},{"$f":"IFERROR(VLOOKUP(C55,Katılım!#REF!,3,0),\"\")","v":""},4]
[null,"33-64",{"$f":"IF(OR(Eleme!#REF!=\"\",Eleme!#REF!=0,Eleme!#REF!=1,Eleme!#REF!=2),Eleme!#REF!,Eleme!#REF!)","v":{"$error":"#REF!"}},{"$f":"IFERROR(VLOOKUP(C56,Katılım!#REF!,3,0),\"\")","v":""},4]
[null,"33-64",{"$f":"IF(OR(Eleme!#REF!=\"\",Eleme!#REF!=0,Eleme!#REF!=1,Eleme!#REF!=2),Eleme!#REF!,Eleme!#REF!)","v":{"$error":"#REF!"}},{"$f":"IFERROR(VLOOKUP(C57,Katılım!#REF!,3,0),\"\")","v":""},4]
[null,"33-64",{"$f":"IF(OR(Eleme!#REF!=\"\",Eleme!#REF!=0,Eleme!#REF!=1,Eleme!#REF!=2),Eleme!#REF!,Eleme!#REF!)","v":{"$error":"#REF!"}},{"$f":"IFERROR(VLOOKUP(C58,Katılım!#REF!,3,0),\"\")","v":""},4]
[null,"33-64",{"$f":"IF(OR(Eleme!#REF!=\"\",Eleme!#REF!=0,Eleme!#REF!=1,Eleme!#REF!=2),Eleme!#REF!,Eleme!#REF!)","v":{"$error":"#REF!"}},{"$f":"IFERROR(VLOOKUP(C59,Katılım!#REF!,3,0),\"\")","v":""},4]
[null,"33-64",{"$f":"IF(OR(Eleme!#REF!=\"\",Eleme!#REF!=0,Eleme!#REF!=1,Eleme!#REF!=2),Eleme!#REF!,Eleme!#REF!)","v":{"$error":"#REF!"}},{"$f":"IFERROR(VLOOKUP(C60,Katılım!#REF!,3,0),\"\")","v":""},4]
[null,"33-64",{"$f":"IF(OR(Eleme!#REF!=\"\",Eleme!#REF!=0,Eleme!#REF!=1,Eleme!#REF!=2),Eleme!#REF!,Eleme!#REF!)","v":{"$error":"#REF!"}},{"$f":"IFERROR(VLOOKUP(C61,Katılım!#REF!,3,0),\"\")","v":""},4]
[null,"33-64",{"$f":"IF(OR(Eleme!#REF!=\"\",Eleme!#REF!=0,Eleme!#REF!=1,Eleme!#REF!=2),Eleme!#REF!,Eleme!#REF!)","v":{"$error":"#REF!"}},{"$f":"IFERROR(VLOOKUP(C62,Katılım!#REF!,3,0),\"\")","v":""},4]
[null,"33-64",{"$f":"IF(OR(Eleme!#REF!=\"\",Eleme!#REF!=0,Eleme!#REF!=1,Eleme!#REF!=2),Eleme!#REF!,Eleme!#REF!)","v":{"$error":"#REF!"}},{"$f":"IFERROR(VLOOKUP(C63,Katılım!#REF!,3,0),\"\")","v":""},4]
[null,"33-64",{"$f":"IF(OR(Eleme!#REF!=\"\",Eleme!#REF!=0,Eleme!#REF!=1,Eleme!#REF!=2),Eleme!#REF!,Eleme!#REF!)","v":{"$error":"#REF!"}},{"$f":"IFERROR(VLOOKUP(C64,Katılım!#REF!,3,0),\"\")","v":""},4]
[null,"33-64",{"$f":"IF(OR(Eleme!#REF!=\"\",Eleme!#REF!=0,Eleme!#REF!=1,Eleme!#REF!=2),Eleme!#REF!,Eleme!#REF!)","v":{"$error":"#REF!"}},{"$f":"IFERROR(VLOOKUP(C65,Katılım!#REF!,3,0),\"\")","v":""},4]
[null,"33-64",{"$f":"IF(OR(Eleme!#REF!=\"\",Eleme!#REF!=0,Eleme!#REF!=1,Eleme!#REF!=2),Eleme!#REF!,Eleme!#REF!)","v":{"$error":"#REF!"}},{"$f":"IFERROR(VLOOKUP(C66,Katılım!#REF!,3,0),\"\")","v":""},4]
[null,"33-64",{"$f":"IF(OR(Eleme!#REF!=\"\",Eleme!#REF!=0,Eleme!#REF!=1,Eleme!#REF!=2),Eleme!#REF!,Eleme!#REF!)","v":{"$error":"#REF!"}},{"$f":"IFERROR(VLOOKUP(C67,Katılım!#REF!,3,0),\"\")","v":""},4]
[null,"65-128",{"$f":"IF(OR(Eleme!#REF!=\"\",Eleme!#REF!=0,Eleme!#REF!=1,Eleme!#REF!=2),Eleme!#REF!,Eleme!#REF!)","v":{"$error":"#REF!"}},{"$f":"IFERROR(VLOOKUP(C68,Katılım!#REF!,3,0),\"\")","v":""},2]
[null,"65-128",{"$f":"IF(OR(Eleme!#REF!=\"\",Eleme!#REF!=0,Eleme!#REF!=1,Eleme!#REF!=2),Eleme!#REF!,Eleme!#REF!)","v":{"$error":"#REF!"}},{"$f":"IFERROR(VLOOKUP(C69,Katılım!#REF!,3,0),\"\")","v":""},2]
[null,"65-128",{"$f":"IF(OR(Eleme!#REF!=\"\",Eleme!#REF!=0,Eleme!#REF!=1,Eleme!#REF!=2),Eleme!#REF!,Eleme!#REF!)","v":{"$error":"#REF!"}},{"$f":"IFERROR(VLOOKUP(C70,Katılım!#REF!,3,0),\"\")","v":""},2]
[null,"65-128",{"$f":"IF(OR(Eleme!#REF!=\"\",Eleme!#REF!=0,Eleme!#REF!=1,Eleme!#REF!=2),Eleme!#REF!,Eleme!#REF!)","v":{"$error":"#REF!"}},{"$f":"IFERROR(VLOOKUP(C71,Katılım!#REF!,3,0),\"\")","v":""},2]
[null,"65-128",{"$f":"IF(OR(Eleme!#REF!=\"\",Eleme!#REF!=0,Eleme!#REF!=1,Eleme!#REF!=2),Eleme!#REF!,Eleme!#REF!)","v":{"$error":"#REF!"}},{"$f":"IFERROR(VLOOKUP(C72,Katılım!#REF!,3,0),\"\")","v":""},2]
[null,"65-128",{"$f":"IF(OR(Eleme!#REF!=\"\",Eleme!#REF!=0,Eleme!#REF!=1,Eleme!#REF!=2),Eleme!#REF!,Eleme!#REF!)","v":{"$error":"#REF!"}},{"$f":"IFERROR(VLOOKUP(C73,Katılım!#REF!,3,0),\"\")","v":""},2]
[null,"65-128",{"$f":"IF(OR(Eleme!#REF!=\"\",Eleme!#REF!=0,Eleme!#REF!=1,Eleme!#REF!=2),Eleme!#REF!,Eleme!#REF!)","v":{"$error":"#REF!"}},{"$f":"IFERROR(VLOOKUP(C74,Katılım!#REF!,3,0),\"\")","v":""},2]
[null,"65-128",{"$f":"IF(OR(Eleme!#REF!=\"\",Eleme!#REF!=0,Eleme!#REF!=1,Eleme!#REF!=2),Eleme!#REF!,Eleme!#REF!)","v":{"$error":"#REF!"}},{"$f":"IFERROR(VLOOKUP(C75,Katılım!#REF!,3,0),\"\")","v":""},2]
[null,"65-128",{"$f":"IF(OR(Eleme!#REF!=\"\",Eleme!#REF!=0,Eleme!#REF!=1,Eleme!#REF!=2),Eleme!#REF!,Eleme!#REF!)","v":{"$error":"#REF!"}},{"$f":"IFERROR(VLOOKUP(C76,Katılım!#REF!,3,0),\"\")","v":""},2]
[null,"65-128",{"$f":"IF(OR(Eleme!#REF!=\"\",Eleme!#REF!=0,Eleme!#REF!=1,Eleme!#REF!=2),Eleme!#REF!,Eleme!#REF!)","v":{"$error":"#REF!"}},{"$f":"IFERROR(VLOOKUP(C77,Katılım!#REF!,3,0),\"\")","v":""},2]
[null,"65-128",{"$f":"IF(OR(Eleme!#REF!=\"\",Eleme!#REF!=0,Eleme!#REF!=1,Eleme!#REF!=2),Eleme!#REF!,Eleme!#REF!)","v":{"$error":"#REF!"}},{"$f":"IFERROR(VLOOKUP(C78,Katılım!#REF!,3,0),\"\")","v":""},2]
[null,"65-128",{"$f":"IF(OR(Eleme!#REF!=\"\",Eleme!#REF!=0,Eleme!#REF!=1,Eleme!#REF!=2),Eleme!#REF!,Eleme!#REF!)","v":{"$error":"#REF!"}},{"$f":"IFERROR(VLOOKUP(C79,Katılım!#REF!,3,0),\"\")","v":""},2]
[null,"65-128",{"$f":"IF(OR(Eleme!#REF!=\"\",Eleme!#REF!=0,Eleme!#REF!=1,Eleme!#REF!=2),Eleme!#REF!,Eleme!#REF!)","v":{"$error":"#REF!"}},{"$f":"IFERROR(VLOOKUP(C80,Katılım!#REF!,3,0),\"\")","v":""},2]
[null,"65-128",{"$f":"IF(OR(Eleme!#REF!=\"\",Eleme!#REF!=0,Eleme!#REF!=1,Eleme!#REF!=2),Eleme!#REF!,Eleme!#REF!)","v":{"$error":"#REF!"}},{"$f":"IFERROR(VLOOKUP(C81,Katılım!#REF!,3,0),\"\")","v":""},2]
[null,"65-128",{"$f":"IF(OR(Eleme!#REF!=\"\",Eleme!#REF!=0,Eleme!#REF!=1,Eleme!#REF!=2),Eleme!#REF!,Eleme!#REF!)","v":{"$error":"#REF!"}},{"$f":"IFERROR(VLOOKUP(C82,Katılım!#REF!,3,0),\"\")","v":""},2]
[null,"65-128",{"$f":"IF(OR(Eleme!#REF!=\"\",Eleme!#REF!=0,Eleme!#REF!=1,Eleme!#REF!=2),Eleme!#REF!,Eleme!#REF!)","v":{"$error":"#REF!"}},{"$f":"IFERROR(VLOOKUP(C83,Katılım!#REF!,3,0),\"\")","v":""},2]
[null,"65-128",{"$f":"IF(OR(Eleme!#REF!=\"\",Eleme!#REF!=0,Eleme!#REF!=1,Eleme!#REF!=2),Eleme!#REF!,Eleme!#REF!)","v":{"$error":"#REF!"}},{"$f":"IFERROR(VLOOKUP(C84,Katılım!#REF!,3,0),\"\")","v":""},2]
[null,"65-128",{"$f":"IF(OR(Eleme!#REF!=\"\",Eleme!#REF!=0,Eleme!#REF!=1,Eleme!#REF!=2),Eleme!#REF!,Eleme!#REF!)","v":{"$error":"#REF!"}},{"$f":"IFERROR(VLOOKUP(C85,Katılım!#REF!,3,0),\"\")","v":""},2]
[null,"65-128",{"$f":"IF(OR(Eleme!#REF!=\"\",Eleme!#REF!=0,Eleme!#REF!=1,Eleme!#REF!=2),Eleme!#REF!,Eleme!#REF!)","v":{"$error":"#REF!"}},{"$f":"IFERROR(VLOOKUP(C86,Katılım!#REF!,3,0),\"\")","v":""},2]
[null,"65-128",{"$f":"IF(OR(Eleme!#REF!=\"\",Eleme!#REF!=0,Eleme!#REF!=1,Eleme!#REF!=2),Eleme!#REF!,Eleme!#REF!)","v":{"$error":"#REF!"}},{"$f":"IFERROR(VLOOKUP(C87,Katılım!#REF!,3,0),\"\")","v":""},2]
[null,"65-128",{"$f":"IF(OR(Eleme!#REF!=\"\",Eleme!#REF!=0,Eleme!#REF!=1,Eleme!#REF!=2),Eleme!#REF!,Eleme!#REF!)","v":{"$error":"#REF!"}},{"$f":"IFERROR(VLOOKUP(C88,Katılım!#REF!,3,0),\"\")","v":""},2]
[null,"65-128",{"$f":"IF(OR(Eleme!#REF!=\"\",Eleme!#REF!=0,Eleme!#REF!=1,Eleme!#REF!=2),Eleme!#REF!,Eleme!#REF!)","v":{"$error":"#REF!"}},{"$f":"IFERROR(VLOOKUP(C89,Katılım!#REF!,3,0),\"\")","v":""},2]
[null,"65-128",{"$f":"IF(OR(Eleme!#REF!=\"\",Eleme!#REF!=0,Eleme!#REF!=1,Eleme!#REF!=2),Eleme!#REF!,Eleme!#REF!)","v":{"$error":"#REF!"}},{"$f":"IFERROR(VLOOKUP(C90,Katılım!#REF!,3,0),\"\")","v":""},2]
[null,"65-128",{"$f":"IF(OR(Eleme!#REF!=\"\",Eleme!#REF!=0,Eleme!#REF!=1,Eleme!#REF!=2),Eleme!#REF!,Eleme!#REF!)","v":{"$error":"#REF!"}},{"$f":"IFERROR(VLOOKUP(C91,Katılım!#REF!,3,0),\"\")","v":""},2]
[null,"65-128",{"$f":"IF(OR(Eleme!#REF!=\"\",Eleme!#REF!=0,Eleme!#REF!=1,Eleme!#REF!=2),Eleme!#REF!,Eleme!#REF!)","v":{"$error":"#REF!"}},{"$f":"IFERROR(VLOOKUP(C92,Katılım!#REF!,3,0),\"\")","v":""},2]
[null,"65-128",{"$f":"IF(OR(Eleme!#REF!=\"\",Eleme!#REF!=0,Eleme!#REF!=1,Eleme!#REF!=2),Eleme!#REF!,Eleme!#REF!)","v":{"$error":"#REF!"}},{"$f":"IFERROR(VLOOKUP(C93,Katılım!#REF!,3,0),\"\")","v":""},2]
[null,"65-128",{"$f":"IF(OR(Eleme!#REF!=\"\",Eleme!#REF!=0,Eleme!#REF!=1,Eleme!#REF!=2),Eleme!#REF!,Eleme!#REF!)","v":{"$error":"#REF!"}},{"$f":"IFERROR(VLOOKUP(C94,Katılım!#REF!,3,0),\"\")","v":""},2]
[null,"65-128",{"$f":"IF(OR(Eleme!#REF!=\"\",Eleme!#REF!=0,Eleme!#REF!=1,Eleme!#REF!=2),Eleme!#REF!,Eleme!#REF!)","v":{"$error":"#REF!"}},{"$f":"IFERROR(VLOOKUP(C95,Katılım!#REF!,3,0),\"\")","v":""},2]
[null,"65-128",{"$f":"IF(OR(Eleme!#REF!=\"\",Eleme!#REF!=0,Eleme!#REF!=1,Eleme!#REF!=2),Eleme!#REF!,Eleme!#REF!)","v":{"$error":"#REF!"}},{"$f":"IFERROR(VLOOKUP(C96,Katılım!#REF!,3,0),\"\")","v":""},2]
[null,"65-128",{"$f":"IF(OR(Eleme!#REF!=\"\",Eleme!#REF!=0,Eleme!#REF!=1,Eleme!#REF!=2),Eleme!#REF!,Eleme!#REF!)","v":{"$error":"#REF!"}},{"$f":"IFERROR(VLOOKUP(C97,Katılım!#REF!,3,0),\"\")","v":""},2]
[null,"65-128",{"$f":"IF(OR(Eleme!#REF!=\"\",Eleme!#REF!=0,Eleme!#REF!=1,Eleme!#REF!=2),Eleme!#REF!,Eleme!#REF!)","v":{"$error":"#REF!"}},{"$f":"IFERROR(VLOOKUP(C98,Katılım!#REF!,3,0),\"\")","v":""},2]
[null,"65-128",{"$f":"IF(OR(Eleme!#REF!=\"\",Eleme!#REF!=0,Eleme!#REF!=1,Eleme!#REF!=2),Eleme!#REF!,Eleme!#REF!)","v":{"$error":"#REF!"}},{"$f":"IFERROR(VLOOKUP(C99,Katılım!#REF!,3,0),\"\")","v":""},2]
[null,"65-128",{"$f":"IF(OR(Eleme!#REF!=\"\",Eleme!#REF!=0,Eleme!#REF!=1,Eleme!#REF!=2),Eleme!#REF!,Eleme!#REF!)","v":{"$error":"#REF!"}},{"$f":"IFERROR(VLOOKUP(C100,Katılım!#REF!,3,0),\"\")","v":""},2]
[null,"65-128",{"$f":"IF(OR(Eleme!#REF!=\"\",Eleme!#REF!=0,Eleme!#REF!=1,Eleme!#REF!=2),Eleme!#REF!,Eleme!#REF!)","v":{"$error":"#REF!"}},{"$f":"IFERROR(VLOOKUP(C101,Katılım!#REF!,3,0),\"\")","v":""},2]
[null,"65-128",{"$f":"IF(OR(Eleme!#REF!=\"\",Eleme!#REF!=0,Eleme!#REF!=1,Eleme!#REF!=2),Eleme!#REF!,Eleme!#REF!)","v":{"$error":"#REF!"}},{"$f":"IFERROR(VLOOKUP(C102,Katılım!#REF!,3,0),\"\")","v":""},2]
[null,"65-128",{"$f":"IF(OR(Eleme!#REF!=\"\",Eleme!#REF!=0,Eleme!#REF!=1,Eleme!#REF!=2),Eleme!#REF!,Eleme!#REF!)","v":{"$error":"#REF!"}},{"$f":"IFERROR(VLOOKUP(C103,Katılım!#REF!,3,0),\"\")","v":""},2]
[null,"65-128",{"$f":"IF(OR(Eleme!#REF!=\"\",Eleme!#REF!=0,Eleme!#REF!=1,Eleme!#REF!=2),Eleme!#REF!,Eleme!#REF!)","v":{"$error":"#REF!"}},{"$f":"IFERROR(VLOOKUP(C104,Katılım!#REF!,3,0),\"\")","v":""},2]
[null,"65-128",{"$f":"IF(OR(Eleme!#REF!=\"\",Eleme!#REF!=0,Eleme!#REF!=1,Eleme!#REF!=2),Eleme!#REF!,Eleme!#REF!)","v":{"$error":"#REF!"}},{"$f":"IFERROR(VLOOKUP(C105,Katılım!#REF!,3,0),\"\")","v":""},2]
[null,"65-128",{"$f":"IF(OR(Eleme!#REF!=\"\",Eleme!#REF!=0,Eleme!#REF!=1,Eleme!#REF!=2),Eleme!#REF!,Eleme!#REF!)","v":{"$error":"#REF!"}},{"$f":"IFERROR(VLOOKUP(C106,Katılım!#REF!,3,0),\"\")","v":""},2]
[null,"65-128",{"$f":"IF(OR(Eleme!#REF!=\"\",Eleme!#REF!=0,Eleme!#REF!=1,Eleme!#REF!=2),Eleme!#REF!,Eleme!#REF!)","v":{"$error":"#REF!"}},{"$f":"IFERROR(VLOOKUP(C107,Katılım!#REF!,3,0),\"\")","v":""},2]
[null,"65-128",{"$f":"IF(OR(Eleme!#REF!=\"\",Eleme!#REF!=0,Eleme!#REF!=1,Eleme!#REF!=2),Eleme!#REF!,Eleme!#REF!)","v":{"$error":"#REF!"}},{"$f":"IFERROR(VLOOKUP(C108,Katılım!#REF!,3,0),\"\")","v":""},2]
[null,"65-128",{"$f":"IF(OR(Eleme!#REF!=\"\",Eleme!#REF!=0,Eleme!#REF!=1,Eleme!#REF!=2),Eleme!#REF!,Eleme!#REF!)","v":{"$error":"#REF!"}},{"$f":"IFERROR(VLOOKUP(C109,Katılım!#REF!,3,0),\"\")","v":""},2]
[null,"65-128",{"$f":"IF(OR(Eleme!#REF!=\"\",Eleme!#REF!=0,Eleme!#REF!=1,Eleme!#REF!=2),Eleme!#REF!,Eleme!#REF!)","v":{"$error":"#REF!"}},{"$f":"IFERROR(VLOOKUP(C110,Katılım!#REF!,3,0),\"\")","v":""},2]
[null,"65-128",{"$f":"IF(OR(Eleme!#REF!=\"\",Eleme!#REF!=0,Eleme!#REF!=1,Eleme!#REF!=2),Eleme!#REF!,Eleme!#REF!)","v":{"$error":"#REF!"}},{"$f":"IFERROR(VLOOKUP(C111,Katılım!#REF!,3,0),\"\")","v":""},2]
[null,"65-128",{"$f":"IF(OR(Eleme!#REF!=\"\",Eleme!#REF!=0,Eleme!#REF!=1,Eleme!#REF!=2),Eleme!#REF!,Eleme!#REF!)","v":{"$error":"#REF!"}},{"$f":"IFERROR(VLOOKUP(C112,Katılım!#REF!,3,0),\"\")","v":""},2]
[null,"65-128",{"$f":"IF(OR(Eleme!#REF!=\"\",Eleme!#REF!=0,Eleme!#REF!=1,Eleme!#REF!=2),Eleme!#REF!,Eleme!#REF!)","v":{"$error":"#REF!"}},{"$f":"IFERROR(VLOOKUP(C113,Katılım!#REF!,3,0),\"\")","v":""},2]
[null,"65-128",{"$f":"IF(OR(Eleme!#REF!=\"\",Eleme!#REF!=0,Eleme!#REF!=1,Eleme!#REF!=2),Eleme!#REF!,Eleme!#REF!)","v":{"$error":"#REF!"}},{"$f":"IFERROR(VLOOKUP(C114,Katılım!#REF!,3,0),\"\")","v":""},2]
[null,"65-128",{"$f":"IF(OR(Eleme!#REF!=\"\",Eleme!#REF!=0,Eleme!#REF!=1,Eleme!#REF!=2),Eleme!#REF!,Eleme!#REF!)","v":{"$error":"#REF!"}},{"$f":"IFERROR(VLOOKUP(C115,Katılım!#REF!,3,0),\"\")","v":""},2]
[null,"65-128",{"$f":"IF(OR(Eleme!#REF!=\"\",Eleme!#REF!=0,Eleme!#REF!=1,Eleme!#REF!=2),Eleme!#REF!,Eleme!#REF!)","v":{"$error":"#REF!"}},{"$f":"IFERROR(VLOOKUP(C116,Katılım!#REF!,3,0),\"\")","v":""},2]
[null,"65-128",{"$f":"IF(OR(Eleme!#REF!=\"\",Eleme!#REF!=0,Eleme!#REF!=1,Eleme!#REF!=2),Eleme!#REF!,Eleme!#REF!)","v":{"$error":"#REF!"}},{"$f":"IFERROR(VLOOKUP(C117,Katılım!#REF!,3,0),\"\")","v":""},2]
[null,"65-128",{"$f":"IF(OR(Eleme!#REF!=\"\",Eleme!#REF!=0,Eleme!#REF!=1,Eleme!#REF!=2),Eleme!#REF!,Eleme!#REF!)","v":{"$error":"#REF!"}},{"$f":"IFERROR(VLOOKUP(C118,Katılım!#REF!,3,0),\"\")","v":""},2]
[null,"65-128",{"$f":"IF(OR(Eleme!#REF!=\"\",Eleme!#REF!=0,Eleme!#REF!=1,Eleme!#REF!=2),Eleme!#REF!,Eleme!#REF!)","v":{"$error":"#REF!"}},{"$f":"IFERROR(VLOOKUP(C119,Katılım!#REF!,3,0),\"\")","v":""},2]
[null,"65-128",{"$f":"IF(OR(Eleme!#REF!=\"\",Eleme!#REF!=0,Eleme!#REF!=1,Eleme!#REF!=2),Eleme!#REF!,Eleme!#REF!)","v":{"$error":"#REF!"}},{"$f":"IFERROR(VLOOKUP(C120,Katılım!#REF!,3,0),\"\")","v":""},2]
[null,"65-128",{"$f":"IF(OR(Eleme!#REF!=\"\",Eleme!#REF!=0,Eleme!#REF!=1,Eleme!#REF!=2),Eleme!#REF!,Eleme!#REF!)","v":{"$error":"#REF!"}},{"$f":"IFERROR(VLOOKUP(C121,Katılım!#REF!,3,0),\"\")","v":""},2]
[null,"65-128",{"$f":"IF(OR(Eleme!#REF!=\"\",Eleme!#REF!=0,Eleme!#REF!=1,Eleme!#REF!=2),Eleme!#REF!,Eleme!#REF!)","v":{"$error":"#REF!"}},{"$f":"IFERROR(VLOOKUP(C122,Katılım!#REF!,3,0),\"\")","v":""},2]
[null,"65-128",{"$f":"IF(OR(Eleme!#REF!=\"\",Eleme!#REF!=0,Eleme!#REF!=1,Eleme!#REF!=2),Eleme!#REF!,Eleme!#REF!)","v":{"$error":"#REF!"}},{"$f":"IFERROR(VLOOKUP(C123,Katılım!#REF!,3,0),\"\")","v":""},2]
[null,"65-128",{"$f":"IF(OR(Eleme!#REF!=\"\",Eleme!#REF!=0,Eleme!#REF!=1,Eleme!#REF!=2),Eleme!#REF!,Eleme!#REF!)","v":{"$error":"#REF!"}},{"$f":"IFERROR(VLOOKUP(C124,Katılım!#REF!,3,0),\"\")","v":""},2]
[null,"65-128",{"$f":"IF(OR(Eleme!#REF!=\"\",Eleme!#REF!=0,Eleme!#REF!=1,Eleme!#REF!=2),Eleme!#REF!,Eleme!#REF!)","v":{"$error":"#REF!"}},{"$f":"IFERROR(VLOOKUP(C125,Katılım!#REF!,3,0),\"\")","v":""},2]
[null,"65-128",{"$f":"IF(OR(Eleme!#REF!=\"\",Eleme!#REF!=0,Eleme!#REF!=1,Eleme!#REF!=2),Eleme!#REF!,Eleme!#REF!)","v":{"$error":"#REF!"}},{"$f":"IFERROR(VLOOKUP(C126,Katılım!#REF!,3,0),\"\")","v":""},2]
[null,"65-128",{"$f":"IF(OR(Eleme!#REF!=\"\",Eleme!#REF!=0,Eleme!#REF!=1,Eleme!#REF!=2),Eleme!#REF!,Eleme!#REF!)","v":{"$error":"#REF!"}},{"$f":"IFERROR(VLOOKUP(C127,Katılım!#REF!,3,0),\"\")","v":""},2]
[null,"65-128",{"$f":"IF(OR(Eleme!#REF!=\"\",Eleme!#REF!=0,Eleme!#REF!=1,Eleme!#REF!=2),Eleme!#REF!,Eleme!#REF!)","v":{"$error":"#REF!"}},{"$f":"IFERROR(VLOOKUP(C128,Katılım!#REF!,3,0),\"\")","v":""},2]
[null,"65-128",{"$f":"IF(OR(Eleme!#REF!=\"\",Eleme!#REF!=0,Eleme!#REF!=1,Eleme!#REF!=2),Eleme!#REF!,Eleme!#REF!)","v":{"$error":"#REF!"}},{"$f":"IFERROR(VLOOKUP(C129,Katılım!#REF!,3,0),\"\")","v":""},2]
[null,"65-128",{"$f":"IF(OR(Eleme!#REF!=\"\",Eleme!#REF!=0,Eleme!#REF!=1,Eleme!#REF!=2),Eleme!#REF!,Eleme!#REF!)","v":{"$error":"#REF!"}},{"$f":"IFERROR(VLOOKUP(C130,Katılım!#REF!,3,0),\"\")","v":""},2]
[null,"65-128",{"$f":"IF(OR(Eleme!#REF!=\"\",Eleme!#REF!=0,Eleme!#REF!=1,Eleme!#REF!=2),Eleme!#REF!,Eleme!#REF!)","v":{"$error":"#REF!"}},{"$f":"IFERROR(VLOOKUP(C131,Katılım!#REF!,3,0),\"\")","v":""},2]
["G1.3","129-256",{"$f":"IFERROR(VLOOKUP(A132,Grup!$N$5:$AE$1000,3,0),\"\")","v":""},{"$f":"IFERROR(VLOOKUP(C132,Katılım!#REF!,3,0),\"\")","v":""},1]
["G1.4","129-256",{"$f":"IFERROR(VLOOKUP(A133,Grup!$N$5:$AE$1000,3,0),\"\")","v":""},{"$f":"IFERROR(VLOOKUP(C133,Katılım!#REF!,3,0),\"\")","v":""},1]
["G2.3","129-256",{"$f":"IFERROR(VLOOKUP(A134,Grup!$N$5:$AE$1000,3,0),\"\")","v":""},{"$f":"IFERROR(VLOOKUP(C134,Katılım!#REF!,3,0),\"\")","v":""},1]
["G2.4","129-256",{"$f":"IFERROR(VLOOKUP(A135,Grup!$N$5:$AE$1000,3,0),\"\")","v":""},{"$f":"IFERROR(VLOOKUP(C135,Katılım!#REF!,3,0),\"\")","v":""},1]
["G3.3","129-256",{"$f":"IFERROR(VLOOKUP(A136,Grup!$N$5:$AE$1000,3,0),\"\")","v":""},{"$f":"IFERROR(VLOOKUP(C136,Katılım!#REF!,3,0),\"\")","v":""},1]
["G3.4","129-256",{"$f":"IFERROR(VLOOKUP(A137,Grup!$N$5:$AE$1000,3,0),\"\")","v":""},{"$f":"IFERROR(VLOOKUP(C137,Katılım!#REF!,3,0),\"\")","v":""},1]
["G4.3","129-256",{"$f":"IFERROR(VLOOKUP(A138,Grup!$N$5:$AE$1000,3,0),\"\")","v":""},{"$f":"IFERROR(VLOOKUP(C138,Katılım!#REF!,3,0),\"\")","v":""},1]
["G4.4","129-256",{"$f":"IFERROR(VLOOKUP(A139,Grup!$N$5:$AE$1000,3,0),\"\")","v":""},{"$f":"IFERROR(VLOOKUP(C139,Katılım!#REF!,3,0),\"\")","v":""},1]
["G5.3","129-256",{"$f":"IFERROR(VLOOKUP(A140,Grup!$N$5:$AE$1000,3,0),\"\")","v":""},{"$f":"IFERROR(VLOOKUP(C140,Katılım!#REF!,3,0),\"\")","v":""},1]
["G5.4","129-256",{"$f":"IFERROR(VLOOKUP(A141,Grup!$N$5:$AE$1000,3,0),\"\")","v":""},{"$f":"IFERROR(VLOOKUP(C141,Katılım!#REF!,3,0),\"\")","v":""},1]
["G6.3","129-256",{"$f":"IFERROR(VLOOKUP(A142,Grup!$N$5:$AE$1000,3,0),\"\")","v":""},{"$f":"IFERROR(VLOOKUP(C142,Katılım!#REF!,3,0),\"\")","v":""},1]
["G6.4","129-256",{"$f":"IFERROR(VLOOKUP(A143,Grup!$N$5:$AE$1000,3,0),\"\")","v":""},{"$f":"IFERROR(VLOOKUP(C143,Katılım!#REF!,3,0),\"\")","v":""},1]
["G7.3","129-256",{"$f":"IFERROR(VLOOKUP(A144,Grup!$N$5:$AE$1000,3,0),\"\")","v":""},{"$f":"IFERROR(VLOOKUP(C144,Katılım!#REF!,3,0),\"\")","v":""},1]
["G7.4","129-256",{"$f":"IFERROR(VLOOKUP(A145,Grup!$N$5:$AE$1000,3,0),\"\")","v":""},{"$f":"IFERROR(VLOOKUP(C145,Katılım!#REF!,3,0),\"\")","v":""},1]
["G8.3","129-256",{"$f":"IFERROR(VLOOKUP(A146,Grup!$N$5:$AE$1000,3,0),\"\")","v":""},{"$f":"IFERROR(VLOOKUP(C146,Katılım!#REF!,3,0),\"\")","v":""},1]
["G8.4","129-256",{"$f":"IFERROR(VLOOKUP(A147,Grup!$N$5:$AE$1000,3,0),\"\")","v":""},{"$f":"IFERROR(VLOOKUP(C147,Katılım!#REF!,3,0),\"\")","v":""},1]
["G9.3","129-256",{"$f":"IFERROR(VLOOKUP(A148,Grup!$N$5:$AE$1000,3,0),\"\")","v":""},{"$f":"IFERROR(VLOOKUP(C148,Katılım!#REF!,3,0),\"\")","v":""},1]
["G9.4","129-256",{"$f":"IFERROR(VLOOKUP(A149,Grup!$N$5:$AE$1000,3,0),\"\")","v":""},{"$f":"IFERROR(VLOOKUP(C149,Katılım!#REF!,3,0),\"\")","v":""},1]
["G10.3","129-256",{"$f":"IFERROR(VLOOKUP(A150,Grup!$N$5:$AE$1000,3,0),\"\")","v":""},{"$f":"IFERROR(VLOOKUP(C150,Katılım!#REF!,3,0),\"\")","v":""},1]
["G10.4","129-256",{"$f":"IFERROR(VLOOKUP(A151,Grup!$N$5:$AE$1000,3,0),\"\")","v":""},{"$f":"IFERROR(VLOOKUP(C151,Katılım!#REF!,3,0),\"\")","v":""},1]
["G11.3","129-256",{"$f":"IFERROR(VLOOKUP(A152,Grup!$N$5:$AE$1000,3,0),\"\")","v":""},{"$f":"IFERROR(VLOOKUP(C152,Katılım!#REF!,3,0),\"\")","v":""},1]
["G11.4","129-256",{"$f":"IFERROR(VLOOKUP(A153,Grup!$N$5:$AE$1000,3,0),\"\")","v":""},{"$f":"IFERROR(VLOOKUP(C153,Katılım!#REF!,3,0),\"\")","v":""},1]
["G12.3","129-256",{"$f":"IFERROR(VLOOKUP(A154,Grup!$N$5:$AE$1000,3,0),\"\")","v":""},{"$f":"IFERROR(VLOOKUP(C154,Katılım!#REF!,3,0),\"\")","v":""},1]
["G12.4","129-256",{"$f":"IFERROR(VLOOKUP(A155,Grup!$N$5:$AE$1000,3,0),\"\")","v":""},{"$f":"IFERROR(VLOOKUP(C155,Katılım!#REF!,3,0),\"\")","v":""},1]
["G13.3","129-256",{"$f":"IFERROR(VLOOKUP(A156,Grup!$N$5:$AE$1000,3,0),\"\")","v":""},{"$f":"IFERROR(VLOOKUP(C156,Katılım!#REF!,3,0),\"\")","v":""},1]
["G13.4","129-256",{"$f":"IFERROR(VLOOKUP(A157,Grup!$N$5:$AE$1000,3,0),\"\")","v":""},{"$f":"IFERROR(VLOOKUP(C157,Katılım!#REF!,3,0),\"\")","v":""},1]
["G14.3","129-256",{"$f":"IFERROR(VLOOKUP(A158,Grup!$N$5:$AE$1000,3,0),\"\")","v":""},{"$f":"IFERROR(VLOOKUP(C158,Katılım!#REF!,3,0),\"\")","v":""},1]
["G14.4","129-256",{"$f":"IFERROR(VLOOKUP(A159,Grup!$N$5:$AE$1000,3,0),\"\")","v":""},{"$f":"IFERROR(VLOOKUP(C159,Katılım!#REF!,3,0),\"\")","v":""},1]
["G15.3","129-256",{"$f":"IFERROR(VLOOKUP(A160,Grup!$N$5:$AE$1000,3,0),\"\")","v":""},{"$f":"IFERROR(VLOOKUP(C160,Katılım!#REF!,3,0),\"\")","v":""},1]
["G15.4","129-256",{"$f":"IFERROR(VLOOKUP(A161,Grup!$N$5:$AE$1000,3,0),\"\")","v":""},{"$f":"IFERROR(VLOOKUP(C161,Katılım!#REF!,3,0),\"\")","v":""},1]
["G16.3","129-256",{"$f":"IFERROR(VLOOKUP(A162,Grup!$N$5:$AE$1000,3,0),\"\")","v":""},{"$f":"IFERROR(VLOOKUP(C162,Katılım!#REF!,3,0),\"\")","v":""},1]
["G16.4","129-256",{"$f":"IFERROR(VLOOKUP(A163,Grup!$N$5:$AE$1000,3,0),\"\")","v":""},{"$f":"IFERROR(VLOOKUP(C163,Katılım!#REF!,3,0),\"\")","v":""},1]
["G17.3","129-256",{"$f":"IFERROR(VLOOKUP(A164,Grup!$N$5:$AE$1000,3,0),\"\")","v":""},{"$f":"IFERROR(VLOOKUP(C164,Katılım!#REF!,3,0),\"\")","v":""},1]
["G17.4","129-256",{"$f":"IFERROR(VLOOKUP(A165,Grup!$N$5:$AE$1000,3,0),\"\")","v":""},{"$f":"IFERROR(VLOOKUP(C165,Katılım!#REF!,3,0),\"\")","v":""},1]
["G18.3","129-256",{"$f":"IFERROR(VLOOKUP(A166,Grup!$N$5:$AE$1000,3,0),\"\")","v":""},{"$f":"IFERROR(VLOOKUP(C166,Katılım!#REF!,3,0),\"\")","v":""},1]
["G18.4","129-256",{"$f":"IFERROR(VLOOKUP(A167,Grup!$N$5:$AE$1000,3,0),\"\")","v":""},{"$f":"IFERROR(VLOOKUP(C167,Katılım!#REF!,3,0),\"\")","v":""},1]
["G19.3","129-256",{"$f":"IFERROR(VLOOKUP(A168,Grup!$N$5:$AE$1000,3,0),\"\")","v":""},{"$f":"IFERROR(VLOOKUP(C168,Katılım!D37:F37,3,0),\"\")","v":""},1]
["G19.4","129-256",{"$f":"IFERROR(VLOOKUP(A169,Grup!$N$5:$AE$1000,3,0),\"\")","v":""},{"$f":"IFERROR(VLOOKUP(C169,Katılım!D37:F38,3,0),\"\")","v":""},1]
["G20.3","129-256",{"$f":"IFERROR(VLOOKUP(A170,Grup!$N$5:$AE$1000,3,0),\"\")","v":""},{"$f":"IFERROR(VLOOKUP(C170,Katılım!D37:F39,3,0),\"\")","v":""},1]
["G20.4","129-256",{"$f":"IFERROR(VLOOKUP(A171,Grup!$N$5:$AE$1000,3,0),\"\")","v":""},{"$f":"IFERROR(VLOOKUP(C171,Katılım!D37:F40,3,0),\"\")","v":""},1]
["G21.3","129-256",{"$f":"IFERROR(VLOOKUP(A172,Grup!$N$5:$AE$1000,3,0),\"\")","v":""},{"$f":"IFERROR(VLOOKUP(C172,Katılım!D37:F41,3,0),\"\")","v":""},1]
["G21.4","129-256",{"$f":"IFERROR(VLOOKUP(A173,Grup!$N$5:$AE$1000,3,0),\"\")","v":""},{"$f":"IFERROR(VLOOKUP(C173,Katılım!D37:F42,3,0),\"\")","v":""},1]
["G22.3","129-256",{"$f":"IFERROR(VLOOKUP(A174,Grup!$N$5:$AE$1000,3,0),\"\")","v":""},{"$f":"IFERROR(VLOOKUP(C174,Katılım!D37:F43,3,0),\"\")","v":""},1]
["G22.4","129-256",{"$f":"IFERROR(VLOOKUP(A175,Grup!$N$5:$AE$1000,3,0),\"\")","v":""},{"$f":"IFERROR(VLOOKUP(C175,Katılım!D37:F44,3,0),\"\")","v":""},1]
["G23.3","129-256",{"$f":"IFERROR(VLOOKUP(A176,Grup!$N$5:$AE$1000,3,0),\"\")","v":""},{"$f":"IFERROR(VLOOKUP(C176,Katılım!D37:F45,3,0),\"\")","v":""},1]
["G23.4","129-256",{"$f":"IFERROR(VLOOKUP(A177,Grup!$N$5:$AE$1000,3,0),\"\")","v":""},{"$f":"IFERROR(VLOOKUP(C177,Katılım!D37:F46,3,0),\"\")","v":""},1]
["G24.3","129-256",{"$f":"IFERROR(VLOOKUP(A178,Grup!$N$5:$AE$1000,3,0),\"\")","v":""},{"$f":"IFERROR(VLOOKUP(C178,Katılım!D37:F47,3,0),\"\")","v":""},1]
["G24.4","129-256",{"$f":"IFERROR(VLOOKUP(A179,Grup!$N$5:$AE$1000,3,0),\"\")","v":""},{"$f":"IFERROR(VLOOKUP(C179,Katılım!D37:F48,3,0),\"\")","v":""},1]
["G25.3","129-256",{"$f":"IFERROR(VLOOKUP(A180,Grup!$N$5:$AE$1000,3,0),\"\")","v":""},{"$f":"IFERROR(VLOOKUP(C180,Katılım!D37:F49,3,0),\"\")","v":""},1]
["G25.4","129-256",{"$f":"IFERROR(VLOOKUP(A181,Grup!$N$5:$AE$1000,3,0),\"\")","v":""},{"$f":"IFERROR(VLOOKUP(C181,Katılım!D37:F50,3,0),\"\")","v":""},1]
["G26.3","129-256",{"$f":"IFERROR(VLOOKUP(A182,Grup!$N$5:$AE$1000,3,0),\"\")","v":""},{"$f":"IFERROR(VLOOKUP(C182,Katılım!D37:F51,3,0),\"\")","v":""},1]
["G26.4","129-256",{"$f":"IFERROR(VLOOKUP(A183,Grup!$N$5:$AE$1000,3,0),\"\")","v":""},{"$f":"IFERROR(VLOOKUP(C183,Katılım!D37:F52,3,0),\"\")","v":""},1]
["G27.3","129-256",{"$f":"IFERROR(VLOOKUP(A184,Grup!$N$5:$AE$1000,3,0),\"\")","v":""},{"$f":"IFERROR(VLOOKUP(C184,Katılım!D37:F53,3,0),\"\")","v":""},1]
["G27.4","129-256",{"$f":"IFERROR(VLOOKUP(A185,Grup!$N$5:$AE$1000,3,0),\"\")","v":""},{"$f":"IFERROR(VLOOKUP(C185,Katılım!D37:F54,3,0),\"\")","v":""},1]
["G28.3","129-256",{"$f":"IFERROR(VLOOKUP(A186,Grup!$N$5:$AE$1000,3,0),\"\")","v":""},{"$f":"IFERROR(VLOOKUP(C186,Katılım!D37:F55,3,0),\"\")","v":""},1]
["G28.4","129-256",{"$f":"IFERROR(VLOOKUP(A187,Grup!$N$5:$AE$1000,3,0),\"\")","v":""},{"$f":"IFERROR(VLOOKUP(C187,Katılım!D37:F56,3,0),\"\")","v":""},1]
["G29.3","129-256",{"$f":"IFERROR(VLOOKUP(A188,Grup!$N$5:$AE$1000,3,0),\"\")","v":""},{"$f":"IFERROR(VLOOKUP(C188,Katılım!D37:F57,3,0),\"\")","v":""},1]
["G29.4","129-256",{"$f":"IFERROR(VLOOKUP(A189,Grup!$N$5:$AE$1000,3,0),\"\")","v":""},{"$f":"IFERROR(VLOOKUP(C189,Katılım!D37:F58,3,0),\"\")","v":""},1]
["G30.3","129-256",{"$f":"IFERROR(VLOOKUP(A190,Grup!$N$5:$AE$1000,3,0),\"\")","v":""},{"$f":"IFERROR(VLOOKUP(C190,Katılım!D37:F59,3,0),\"\")","v":""},1]
["G30.4","129-256",{"$f":"IFERROR(VLOOKUP(A191,Grup!$N$5:$AE$1000,3,0),\"\")","v":""},{"$f":"IFERROR(VLOOKUP(C191,Katılım!D37:F60,3,0),\"\")","v":""},1]
["G31.3","129-256",{"$f":"IFERROR(VLOOKUP(A192,Grup!$N$5:$AE$1000,3,0),\"\")","v":""},{"$f":"IFERROR(VLOOKUP(C192,Katılım!D37:F61,3,0),\"\")","v":""},1]
["G31.4","129-256",{"$f":"IFERROR(VLOOKUP(A193,Grup!$N$5:$AE$1000,3,0),\"\")","v":""},{"$f":"IFERROR(VLOOKUP(C193,Katılım!D37:F62,3,0),\"\")","v":""},1]
["G32.3","129-256",{"$f":"IFERROR(VLOOKUP(A194,Grup!$N$5:$AE$1000,3,0),\"\")","v":""},{"$f":"IFERROR(VLOOKUP(C194,Katılım!D37:F63,3,0),\"\")","v":""},1]
["G32.4","129-256",{"$f":"IFERROR(VLOOKUP(A195,Grup!$N$5:$AE$1000,3,0),\"\")","v":""},{"$f":"IFERROR(VLOOKUP(C195,Katılım!D37:F64,3,0),\"\")","v":""},1]
["G33.3","129-256",{"$f":"IFERROR(VLOOKUP(A196,Grup!$N$5:$AE$1000,3,0),\"\")","v":""},{"$f":"IFERROR(VLOOKUP(C196,Katılım!D37:F65,3,0),\"\")","v":""},1]
["G33.4","129-256",{"$f":"IFERROR(VLOOKUP(A197,Grup!$N$5:$AE$1000,3,0),\"\")","v":""},{"$f":"IFERROR(VLOOKUP(C197,Katılım!D37:F66,3,0),\"\")","v":""},1]
["G34.3","129-256",{"$f":"IFERROR(VLOOKUP(A198,Grup!$N$5:$AE$1000,3,0),\"\")","v":""},{"$f":"IFERROR(VLOOKUP(C198,Katılım!D37:F67,3,0),\"\")","v":""},1]
["G34.4","129-256",{"$f":"IFERROR(VLOOKUP(A199,Grup!$N$5:$AE$1000,3,0),\"\")","v":""},{"$f":"IFERROR(VLOOKUP(C199,Katılım!D37:F68,3,0),\"\")","v":""},1]
["G35.3","129-256",{"$f":"IFERROR(VLOOKUP(A200,Grup!$N$5:$AE$1000,3,0),\"\")","v":""},{"$f":"IFERROR(VLOOKUP(C200,Katılım!D37:F69,3,0),\"\")","v":""},1]
["G35.4","129-256",{"$f":"IFERROR(VLOOKUP(A201,Grup!$N$5:$AE$1000,3,0),\"\")","v":""},{"$f":"IFERROR(VLOOKUP(C201,Katılım!D37:F70,3,0),\"\")","v":""},1]
["G36.3","129-256",{"$f":"IFERROR(VLOOKUP(A202,Grup!$N$5:$AE$1000,3,0),\"\")","v":""},{"$f":"IFERROR(VLOOKUP(C202,Katılım!D37:F71,3,0),\"\")","v":""},1]
["G36.4","129-256",{"$f":"IFERROR(VLOOKUP(A203,Grup!$N$5:$AE$1000,3,0),\"\")","v":""},{"$f":"IFERROR(VLOOKUP(C203,Katılım!D37:F72,3,0),\"\")","v":""},1]
["G37.3","129-256",{"$f":"IFERROR(VLOOKUP(A204,Grup!$N$5:$AE$1000,3,0),\"\")","v":""},{"$f":"IFERROR(VLOOKUP(C204,Katılım!D37:F73,3,0),\"\")","v":""},1]
["G37.4","129-256",{"$f":"IFERROR(VLOOKUP(A205,Grup!$N$5:$AE$1000,3,0),\"\")","v":""},{"$f":"IFERROR(VLOOKUP(C205,Katılım!D37:F74,3,0),\"\")","v":""},1]
["G38.3","129-256",{"$f":"IFERROR(VLOOKUP(A206,Grup!$N$5:$AE$1000,3,0),\"\")","v":""},{"$f":"IFERROR(VLOOKUP(C206,Katılım!D37:F75,3,0),\"\")","v":""},1]
["G38.4","129-256",{"$f":"IFERROR(VLOOKUP(A207,Grup!$N$5:$AE$1000,3,0),\"\")","v":""},{"$f":"IFERROR(VLOOKUP(C207,Katılım!D37:F76,3,0),\"\")","v":""},1]
["G39.3","129-256",{"$f":"IFERROR(VLOOKUP(A208,Grup!$N$5:$AE$1000,3,0),\"\")","v":""},{"$f":"IFERROR(VLOOKUP(C208,Katılım!D37:F77,3,0),\"\")","v":""},1]
["G39.4","129-256",{"$f":"IFERROR(VLOOKUP(A209,Grup!$N$5:$AE$1000,3,0),\"\")","v":""},{"$f":"IFERROR(VLOOKUP(C209,Katılım!D37:F78,3,0),\"\")","v":""},1]
["G40.3","129-256",{"$f":"IFERROR(VLOOKUP(A210,Grup!$N$5:$AE$1000,3,0),\"\")","v":""},{"$f":"IFERROR(VLOOKUP(C210,Katılım!D37:F79,3,0),\"\")","v":""},1]
["G40.4","129-256",{"$f":"IFERROR(VLOOKUP(A211,Grup!$N$5:$AE$1000,3,0),\"\")","v":""},{"$f":"IFERROR(VLOOKUP(C211,Katılım!D37:F80,3,0),\"\")","v":""},1]
["G41.3","129-256",{"$f":"IFERROR(VLOOKUP(A212,Grup!$N$5:$AE$1000,3,0),\"\")","v":""},{"$f":"IFERROR(VLOOKUP(C212,Katılım!D37:F81,3,0),\"\")","v":""},1]
["G41.4","129-256",{"$f":"IFERROR(VLOOKUP(A213,Grup!$N$5:$AE$1000,3,0),\"\")","v":""},{"$f":"IFERROR(VLOOKUP(C213,Katılım!D37:F82,3,0),\"\")","v":""},1]
["G42.3","129-256",{"$f":"IFERROR(VLOOKUP(A214,Grup!$N$5:$AE$1000,3,0),\"\")","v":""},{"$f":"IFERROR(VLOOKUP(C214,Katılım!D37:F83,3,0),\"\")","v":""},1]
["G42.4","129-256",{"$f":"IFERROR(VLOOKUP(A215,Grup!$N$5:$AE$1000,3,0),\"\")","v":""},{"$f":"IFERROR(VLOOKUP(C215,Katılım!D37:F84,3,0),\"\")","v":""},1]
["G43.3","129-256",{"$f":"IFERROR(VLOOKUP(A216,Grup!$N$5:$AE$1000,3,0),\"\")","v":""},{"$f":"IFERROR(VLOOKUP(C216,Katılım!D37:F85,3,0),\"\")","v":""},1]
["G43.4","129-256",{"$f":"IFERROR(VLOOKUP(A217,Grup!$N$5:$AE$1000,3,0),\"\")","v":""},{"$f":"IFERROR(VLOOKUP(C217,Katılım!D37:F86,3,0),\"\")","v":""},1]
["G44.3","129-256",{"$f":"IFERROR(VLOOKUP(A218,Grup!$N$5:$AE$1000,3,0),\"\")","v":""},{"$f":"IFERROR(VLOOKUP(C218,Katılım!D37:F87,3,0),\"\")","v":""},1]
["G44.4","129-256",{"$f":"IFERROR(VLOOKUP(A219,Grup!$N$5:$AE$1000,3,0),\"\")","v":""},{"$f":"IFERROR(VLOOKUP(C219,Katılım!D37:F88,3,0),\"\")","v":""},1]
["G45.3","129-256",{"$f":"IFERROR(VLOOKUP(A220,Grup!$N$5:$AE$1000,3,0),\"\")","v":""},{"$f":"IFERROR(VLOOKUP(C220,Katılım!D37:F89,3,0),\"\")","v":""},1]
["G45.4","129-256",{"$f":"IFERROR(VLOOKUP(A221,Grup!$N$5:$AE$1000,3,0),\"\")","v":""},{"$f":"IFERROR(VLOOKUP(C221,Katılım!D37:F90,3,0),\"\")","v":""},1]
["G46.3","129-256",{"$f":"IFERROR(VLOOKUP(A222,Grup!$N$5:$AE$1000,3,0),\"\")","v":""},{"$f":"IFERROR(VLOOKUP(C222,Katılım!D37:F91,3,0),\"\")","v":""},1]
["G46.4","129-256",{"$f":"IFERROR(VLOOKUP(A223,Grup!$N$5:$AE$1000,3,0),\"\")","v":""},{"$f":"IFERROR(VLOOKUP(C223,Katılım!D37:F92,3,0),\"\")","v":""},1]
["G47.3","129-256",{"$f":"IFERROR(VLOOKUP(A224,Grup!$N$5:$AE$1000,3,0),\"\")","v":""},{"$f":"IFERROR(VLOOKUP(C224,Katılım!D37:F93,3,0),\"\")","v":""},1]
["G47.4","129-256",{"$f":"IFERROR(VLOOKUP(A225,Grup!$N$5:$AE$1000,3,0),\"\")","v":""},{"$f":"IFERROR(VLOOKUP(C225,Katılım!D37:F94,3,0),\"\")","v":""},1]
["G48.3","129-256",{"$f":"IFERROR(VLOOKUP(A226,Grup!$N$5:$AE$1000,3,0),\"\")","v":""},{"$f":"IFERROR(VLOOKUP(C226,Katılım!D37:F95,3,0),\"\")","v":""},1]
["G48.4","129-256",{"$f":"IFERROR(VLOOKUP(A227,Grup!$N$5:$AE$1000,3,0),\"\")","v":""},{"$f":"IFERROR(VLOOKUP(C227,Katılım!D37:F96,3,0),\"\")","v":""},1]
["G49.3","129-256",{"$f":"IFERROR(VLOOKUP(A228,Grup!$N$5:$AE$1000,3,0),\"\")","v":""},{"$f":"IFERROR(VLOOKUP(C228,Katılım!D37:F97,3,0),\"\")","v":""},1]
["G49.4","129-256",{"$f":"IFERROR(VLOOKUP(A229,Grup!$N$5:$AE$1000,3,0),\"\")","v":""},{"$f":"IFERROR(VLOOKUP(C229,Katılım!D37:F98,3,0),\"\")","v":""},1]
["G50.3","129-256",{"$f":"IFERROR(VLOOKUP(A230,Grup!$N$5:$AE$1000,3,0),\"\")","v":""},{"$f":"IFERROR(VLOOKUP(C230,Katılım!D37:F99,3,0),\"\")","v":""},1]
["G50.4","129-256",{"$f":"IFERROR(VLOOKUP(A231,Grup!$N$5:$AE$1000,3,0),\"\")","v":""},{"$f":"IFERROR(VLOOKUP(C231,Katılım!D37:F100,3,0),\"\")","v":""},1]
["G51.3","129-256",{"$f":"IFERROR(VLOOKUP(A232,Grup!$N$5:$AE$1000,3,0),\"\")","v":""},{"$f":"IFERROR(VLOOKUP(C232,Katılım!D37:F101,3,0),\"\")","v":""},1]
["G51.4","129-256",{"$f":"IFERROR(VLOOKUP(A233,Grup!$N$5:$AE$1000,3,0),\"\")","v":""},{"$f":"IFERROR(VLOOKUP(C233,Katılım!D37:F102,3,0),\"\")","v":""},1]
["G52.3","129-256",{"$f":"IFERROR(VLOOKUP(A234,Grup!$N$5:$AE$1000,3,0),\"\")","v":""},{"$f":"IFERROR(VLOOKUP(C234,Katılım!D37:F103,3,0),\"\")","v":""},1]
["G52.4","129-256",{"$f":"IFERROR(VLOOKUP(A235,Grup!$N$5:$AE$1000,3,0),\"\")","v":""},{"$f":"IFERROR(VLOOKUP(C235,Katılım!D37:F104,3,0),\"\")","v":""},1]
["G53.3","129-256",{"$f":"IFERROR(VLOOKUP(A236,Grup!$N$5:$AE$1000,3,0),\"\")","v":""},{"$f":"IFERROR(VLOOKUP(C236,Katılım!D37:F105,3,0),\"\")","v":""},1]
["G53.4","129-256",{"$f":"IFERROR(VLOOKUP(A237,Grup!$N$5:$AE$1000,3,0),\"\")","v":""},{"$f":"IFERROR(VLOOKUP(C237,Katılım!D37:F106,3,0),\"\")","v":""},1]
["G54.3","129-256",{"$f":"IFERROR(VLOOKUP(A238,Grup!$N$5:$AE$1000,3,0),\"\")","v":""},{"$f":"IFERROR(VLOOKUP(C238,Katılım!D37:F107,3,0),\"\")","v":""},1]
["G54.4","129-256",{"$f":"IFERROR(VLOOKUP(A239,Grup!$N$5:$AE$1000,3,0),\"\")","v":""},{"$f":"IFERROR(VLOOKUP(C239,Katılım!D37:F108,3,0),\"\")","v":""},1]
["G55.3","129-256",{"$f":"IFERROR(VLOOKUP(A240,Grup!$N$5:$AE$1000,3,0),\"\")","v":""},{"$f":"IFERROR(VLOOKUP(C240,Katılım!D37:F109,3,0),\"\")","v":""},1]
["G55.4","129-256",{"$f":"IFERROR(VLOOKUP(A241,Grup!$N$5:$AE$1000,3,0),\"\")","v":""},{"$f":"IFERROR(VLOOKUP(C241,Katılım!D37:F110,3,0),\"\")","v":""},1]
["G56.3","129-256",{"$f":"IFERROR(VLOOKUP(A242,Grup!$N$5:$AE$1000,3,0),\"\")","v":""},{"$f":"IFERROR(VLOOKUP(C242,Katılım!D37:F111,3,0),\"\")","v":""},1]
["G56.4","129-256",{"$f":"IFERROR(VLOOKUP(A243,Grup!$N$5:$AE$1000,3,0),\"\")","v":""},{"$f":"IFERROR(VLOOKUP(C243,Katılım!D37:F112,3,0),\"\")","v":""},1]
["G57.3","129-256",{"$f":"IFERROR(VLOOKUP(A244,Grup!$N$5:$AE$1000,3,0),\"\")","v":""},{"$f":"IFERROR(VLOOKUP(C244,Katılım!D37:F113,3,0),\"\")","v":""},1]
["G57.4","129-256",{"$f":"IFERROR(VLOOKUP(A245,Grup!$N$5:$AE$1000,3,0),\"\")","v":""},{"$f":"IFERROR(VLOOKUP(C245,Katılım!D37:F114,3,0),\"\")","v":""},1]
["G58.3","129-256",{"$f":"IFERROR(VLOOKUP(A246,Grup!$N$5:$AE$1000,3,0),\"\")","v":""},{"$f":"IFERROR(VLOOKUP(C246,Katılım!D37:F115,3,0),\"\")","v":""},1]
["G58.4","129-256",{"$f":"IFERROR(VLOOKUP(A247,Grup!$N$5:$AE$1000,3,0),\"\")","v":""},{"$f":"IFERROR(VLOOKUP(C247,Katılım!D37:F116,3,0),\"\")","v":""},1]
["G59.3","129-256",{"$f":"IFERROR(VLOOKUP(A248,Grup!$N$5:$AE$1000,3,0),\"\")","v":""},{"$f":"IFERROR(VLOOKUP(C248,Katılım!D37:F117,3,0),\"\")","v":""},1]
["G59.4","129-256",{"$f":"IFERROR(VLOOKUP(A249,Grup!$N$5:$AE$1000,3,0),\"\")","v":""},{"$f":"IFERROR(VLOOKUP(C249,Katılım!D37:F118,3,0),\"\")","v":""},1]
["G60.3","129-256",{"$f":"IFERROR(VLOOKUP(A250,Grup!$N$5:$AE$1000,3,0),\"\")","v":""},{"$f":"IFERROR(VLOOKUP(C250,Katılım!D37:F119,3,0),\"\")","v":""},1]
["G60.4","129-256",{"$f":"IFERROR(VLOOKUP(A251,Grup!$N$5:$AE$1000,3,0),\"\")","v":""},{"$f":"IFERROR(VLOOKUP(C251,Katılım!D37:F120,3,0),\"\")","v":""},1]
["G61.3","129-256",{"$f":"IFERROR(VLOOKUP(A252,Grup!$N$5:$AE$1000,3,0),\"\")","v":""},{"$f":"IFERROR(VLOOKUP(C252,Katılım!D37:F121,3,0),\"\")","v":""},1]
["G61.4","129-256",{"$f":"IFERROR(VLOOKUP(A253,Grup!$N$5:$AE$1000,3,0),\"\")","v":""},{"$f":"IFERROR(VLOOKUP(C253,Katılım!D37:F122,3,0),\"\")","v":""},1]
["G62.3","129-256",{"$f":"IFERROR(VLOOKUP(A254,Grup!$N$5:$AE$1000,3,0),\"\")","v":""},{"$f":"IFERROR(VLOOKUP(C254,Katılım!D37:F123,3,0),\"\")","v":""},1]
["G62.4","129-256",{"$f":"IFERROR(VLOOKUP(A255,Grup!$N$5:$AE$1000,3,0),\"\")","v":""},{"$f":"IFERROR(VLOOKUP(C255,Katılım!D37:F124,3,0),\"\")","v":""},1]
["G63.3","129-256",{"$f":"IFERROR(VLOOKUP(A256,Grup!$N$5:$AE$1000,3,0),\"\")","v":""},{"$f":"IFERROR(VLOOKUP(C256,Katılım!D37:F125,3,0),\"\")","v":""},1]
["G63.4","129-256",{"$f":"IFERROR(VLOOKUP(A257,Grup!$N$5:$AE$1000,3,0),\"\")","v":""},{"$f":"IFERROR(VLOOKUP(C257,Katılım!D37:F126,3,0),\"\")","v":""},1]
["G64.3","129-256",{"$f":"IFERROR(VLOOKUP(A258,Grup!$N$5:$AE$1000,3,0),\"\")","v":""},{"$f":"IFERROR(VLOOKUP(C258,Katılım!D37:F127,3,0),\"\")","v":""},1]
["G64.4","129-256",{"$f":"IFERROR(VLOOKUP(A259,Grup!$N$5:$AE$1000,3,0),\"\")","v":""},{"$f":"IFERROR(VLOOKUP(C259,Katılım!D37:F128,3,0),\"\")","v":""},1]

{"sheet":"5_Mac","index":17,"n_rows":76,"n_cols":44,"rows_kept":76,"cut":false,"hidden":true,"merged":[[0,40,0,41],[0,42,0,43],[1,21,2,28],[1,29,2,31],[1,32,2,34],[1,35,2,37],[1,38,2,39],[1,40,2,41],[1,42,2,43],[0,21,0,28],[0,29,0,31],[0,32,0,34],[0,35,0,37],[0,38,0,39],[4,27,5,41],[4,42,5,42],[4,43,5,43],[6,25,7,26],[6,27,7,41],[6,42,7,42],[3,21,3,22],[3,23,3,24],[3,25,3,26],[3,27,3,41],[6,43,7,43],[0,0,7,20],[8,30,9,39],[8,40,9,41],[8,42,9,43],[10,3,10,13],[10,17,10,28],[10,30,10,31],[10,32,10,33],[10,34,10,35],[10,36,10,37],[10,38,10,39],[8,0,10,0],[8,1,10,1],[8,2,10,2],[8,3,9,13],[8,14,10,14],[8,15,10,15],[8,16,10,16],[8,17,9,28],[8,29,10,29],[3,42,3,43],[4,21,7,22],[4,23,7,24],[4,25,5,26],[10,40,10,41],[10,42,10,43],[11,0,13,0],[11,1,13,1],[11,3,13,13],[11,14,13,14],[11,15,13,15],[11,17,13,28],[11,29,13,29],[17,0,19,0],[17,1,19,1],[17,3,19,13],[17,14,19,14],[17,15,19,15],[17,17,19,28],[17,29,19,29],[14,29,16,29],[14,0,16,0],[14,1,16,1],[14,3,16,13],[14,14,16,14],[14,15,16,15],[14,17,16,28],[23,29,25,29],[20,29,22,29],[20,0,22,0],[20,1,22,1],[26,0,26,4],[26,15,26,19],[26,30,27,39],[27,0,27,4],[27,5,27,6],[27,7,27,8],[27,9,27,10],[27,11,27,12],[20,3,22,13],[20,14,22,14],[20,15,22,15],[20,17,22,28],[23,0,25,0],[23,1,25,1],[23,3,25,13],[23,14,25,14],[23,15,25,15],[23,17,25,28],[29,11,29,12],[29,13,29,14],[27,28,27,29],[28,0,28,4],[28,5,28,6],[28,7,28,8],[28,9,28,10],[28,11,28,12],[28,13,28,14],[28,15,28,19],[28,20,28,21],[28,22,28,23],[27,13,27,14],[27,15,27,19],[27,20,27,21],[27,22,27,23],[27,24,27,25],[27,26,27,27],[29,15,29,19],[29,20,29,21],[29,22,29,23],[29,24,29,25],[29,26,29,27],[29,28,29,29],[28,24,28,25],[28,26,28,27],[28,28,28,29],[30,33,31,43],[31,0,31,4],[31,5,31,7],[31,10,31,12],[31,15,31,19],[31,20,31,22],[31,25,31,27],[30,15,30,19],[30,20,30,21],[30,22,30,23],[30,24,30,25],[30,26,30,27],[30,28,30,29],[30,0,30,4],[30,5,30,6],[30,7,30,8],[30,9,30,10],[30,11,30,12],[30,13,30,14],[28,30,31,32],[29,0,29,4],[29,5,29,6],[29,7,29,8],[29,9,29,10],[32,30,32,36],[32,37,32,43],[33,30,36,36],[33,37,36,43],[39,0,46,20],[39,21,39,28],[39,29,39,31],[39,32,39,34],[39,35,39,37],[39,38,39,39],[39,40,39,41],[39,42,39,43],[40,21,41,28],[40,29,41,31],[40,32,41,34],[40,35,41,37],[40,38,41,39],[40,40,41,41],[40,42,41,43],[42,21,42,22],[42,23,42,24],[42,25,42,26],[42,27,42,41],[42,42,42,43],[43,21,46,22],[43,23,46,24],[43,25,44,26],[43,27,44,41],[43,42,44,42],[43,43,44,43],[45,25,46,26],[45,27,46,41],[45,42,46,42],[45,43,46,43],[47,42,48,43],[49,3,49,13],[49,17,49,28],[49,30,49,31],[49,32,49,33],[49,34,49,35],[49,36,49,37],[49,38,49,39],[49,40,49,41],[49,42,49,43],[47,15,49,15],[47,16,49,16],[47,17,48,28],[47,29,49,29],[47,30,48,39],[47,40,48,41],[53,29,55,29],[50,29,52,29],[50,0,52,0],[50,1,52,1],[50,3,52,13],[50,14,52,14],[50,15,52,15],[50,17,52,28],[47,0,49,0],[47,1,49,1],[47,2,49,2],[47,3,48,13],[47,14,49,14],[59,14,61,14],[59,15,61,15],[59,17,61,28],[53,0,55,0],[53,1,55,1],[53,3,55,13],[53,14,55,14],[53,15,55,15],[53,17,55,28],[59,29,61,29],[56,29,58,29],[56,0,58,0],[56,1,58,1],[65,0,65,4],[65,15,65,19],[65,30,66,39],[66,0,66,4],[66,5,66,6],[66,7,66,8],[62,29,64,29],[62,0,64,0],[62,1,64,1],[62,3,64,13],[62,14,64,14],[62,15,64,15],[62,17,64,28],[56,3,58,13],[56,14,58,14],[56,15,58,15],[56,17,58,28],[59,0,61,0],[59,1,61,1],[59,3,61,13],[67,0,67,4],[67,5,67,6],[67,7,67,8],[67,9,67,10],[67,11,67,12],[67,13,67,14],[67,15,67,19],[66,9,66,10],[66,11,66,12],[66,13,66,14],[66,15,66,19],[67,20,67,21],[67,22,67,23],[67,24,67,25],[67,26,67,27],[67,28,67,29],[67,30,70,32],[66,24,66,25],[66,26,66,27],[66,28,66,29],[66,20,66,21],[66,22,66,23],[68,15,68,19],[68,20,68,21],[68,22,68,23],[68,24,68,25],[68,26,68,27],[68,28,68,29],[68,0,68,4],[68,5,68,6],[68,7,68,8],[68,9,68,10],[68,11,68,12],[68,13,68,14],[71,30,71,36],[71,37,71,43],[72,30,75,36],[72,37,75,43],[69,33,70,43],[70,0,70,4],[70,5,70,7],[70,10,70,12],[70,15,70,19],[70,20,70,22],[70,25,70,27],[69,15,69,19],[69,20,69,21],[69,22,69,23],[69,24,69,25],[69,26,69,27],[69,28,69,29],[69,0,69,4],[69,5,69,6],[69,7,69,8],[69,9,69,10],[69,11,69,12],[69,13,69,14]]}
["TÜRKİYE\nMASA TENİSİ FEDERASYONU\nYARIŞMA CETVELİ 5 Maçlık Sistem\n(Yeni swaythling kupa sistemi, 5 Tek)",null,null,null,null,null,null,null,null,null,null,null,null,null,null,null,null,null,null,null,null,"Yarışma Adı",null,null,null,null,null,null,null,"Yeri",null,null,"Tarih",null,null,"Saat",null,null,"Grup",null,"Maç No",null,"Masa"]
[]
[]
[null,null,null,null,null,null,null,null,null,null,null,null,null,null,null,null,null,null,null,null,null,"Erkek",null,"Kadın",null,"Galip",null,"Takımlar",null,null,null,null,null,null,null,null,null,null,null,null,null,null,"Kura"]
[null,null,null,null,null,null,null,null,null,null,null,null,null,null,null,null,null,null,null,null,null,null,null,null,null,null,null,null,null,null,null,null,null,null,null,null,null,null,null,null,null,null,"A","X"]
[]
[null,null,null,null,null,null,null,null,null,null,null,null,null,null,null,null,null,null,null,null,null,null,null,null,null,null,null,null,null,null,null,null,null,null,null,null,null,null,null,null,null,null,"A","X"]
[]
["Maç No","Kura","Lisans No","A-",null,null,null,null,null,null,null,null,null,null,"Mola","Kura","Lisans No","X-",null,null,null,null,null,null,null,null,null,null,null,"Mola","Sayılar",null,null,null,null,null,null,null,null,null,"Setler",null,"Puan"]
[]
[null,null,null,"Sporcular",null,null,null,null,null,null,null,null,null,null,null,null,null,"Sporcular",null,null,null,null,null,null,null,null,null,null,null,null,"1.Set",null,"2.Set",null,"3.Set",null,"4.Set",null,"5.Set",null,"A / X",null,"A / X"]
[1,"A",null,null,null,null,null,null,null,null,null,null,null,null,null,"X"]
[]
[]
[2,"B",null,null,null,null,null,null,null,null,null,null,null,null,null,"Y"]
[]
[]
[3,"C",null,null,null,null,null,null,null,null,null,null,null,null,null,"Z"]
[]
[]
[4,"A",null,null,null,null,null,null,null,null,null,null,null,null,null,"Y"]
[]
[]
[5,"B",null,null,null,null,null,null,null,null,null,null,null,null,null,"X"]
[]
[]
["Forma Rengi",null,null,null,null,null,null,null,null,null,null,null,null,null,null,"Forma Rengi",null,null,null,null,null,null,null,null,null,null,null,null,null,null,"Toplam"]
["Kart\\Oyuncuya",null,null,null,null,1,null,2,null,3,null,4,null,5,null,"Kart\\Oyuncuya",null,null,null,null,1,null,2,null,3,null,4,null,5]
["Sarı",null,null,null,null,null,null,null,null,null,null,null,null,null,null,"Sarı",null,null,null,null,null,null,null,null,null,null,null,null,null,null,"Galip"]
["1. Sarı + Kırmızı",null,null,null,null,null,null,null,null,null,null,null,null,null,null,"1. Sarı + Kırmızı"]
["2. Sarı + Kırmızı",null,null,null,null,null,null,null,null,null,null,null,null,null,null,"2. Sarı + Kırmızı",null,null,null,null,null,null,null,null,null,null,null,null,null,null,null,null,null,{"$f":"\"(  \"&#REF!&\"  -     )\"","v":{"$error":"#REF!"}}]
["Kart\\Öğütücüye",null,null,null,null,"Sarı",null,null,null,null,"Kırmızı",null,null,null,null,"Kart\\Öğütücüye",null,null,null,null,"Sarı",null,null,null,null,"Kırmızı"]
["Kaptan",null,null,null,null,null,null,null,null,null,null,null,null,null,null,"Kaptan",null,null,null,null,null,null,null,null,null,null,null,null,null,null,"Hakemler",null,null,null,null,null,null,"Baş Hakem"]
["Adı Soyadı",null,null,null,":",null,null,null,null,null,null,null,null,null,null,"Adı Soyadı",null,null,null,":"]
["İmza",null,null,null,":",null,null,null,null,null,null,null,null,null,null,"İmza",null,null,null,":"]
[]
["Başlama Saati",null,null,null,null,":",null,null,null,null,null,null,null,null,null,"Bitiş Saati",null,null,null,null,":"]
[]
[]
["TÜRKİYE\nMASA TENİSİ FEDERASYONU\nYARIŞMA CETVELİ 5 Maçlık Sistem\n(Yeni swaythling kupa sistemi, 5 Tek)",null,null,null,null,null,null,null,null,null,null,null,null,null,null,null,null,null,null,null,null,"Yarışma Adı",null,null,null,null,null,null,null,"Yeri",null,null,"Tarih",null,null,"Saat",null,null,"Grup",null,"Maç No",null,"Masa"]
[]
[]
[null,null,null,null,null,null,null,null,null,null,null,null,null,null,null,null,null,null,null,null,null,"Erkek",null,"Kadın",null,"Galip",null,"Takımlar",null,null,null,null,null,null,null,null,null,null,null,null,null,null,"Kura"]
[null,null,null,null,null,null,null,null,null,null,null,null,null,null,null,null,null,null,null,null,null,null,null,null,null,null,null,null,null,null,null,null,null,null,null,null,null,null,null,null,null,null,"A","X"]
[]
[null,null,null,null,null,null,null,null,null,null,null,null,null,null,null,null,null,null,null,null,null,null,null,null,null,null,null,null,null,null,null,null,null,null,null,null,null,null,null,null,null,null,"A","X"]
[]
["Maç No","Kura","Lisans No","A-",null,null,null,null,null,null,null,null,null,null,"Mola","Kura","Lisans No","X-",null,null,null,null,null,null,null,null,null,null,null,"Mola","Sayılar",null,null,null,null,null,null,null,null,null,"Setler",null,"Puan"]
[]
[null,null,null,"Sporcular",null,null,null,null,null,null,null,null,null,null,null,null,null,"Sporcular",null,null,null,null,null,null,null,null,null,null,null,null,"1.Set",null,"2.Set",null,"3.Set",null,"4.Set",null,"5.Set",null,"A / X",null,"A / X"]
[1,"A",null,null,null,null,null,null,null,null,null,null,null,null,null,"X"]
[]
[]
[2,"B",null,null,null,null,null,null,null,null,null,null,null,null,null,"Y"]
[]
[]
[3,"C",null,null,null,null,null,null,null,null,null,null,null,null,null,"Z"]
[]
[]
[4,"A",null,null,null,null,null,null,null,null,null,null,null,null,null,"Y"]
[]
[]
[5,"B",null,null,null,null,null,null,null,null,null,null,null,null,null,"X"]
[]
[]
["Forma Rengi",null,null,null,null,null,null,null,null,null,null,null,null,null,null,"Forma Rengi",null,null,null,null,null,null,null,null,null,null,null,null,null,null,"Toplam"]
["Kart\\Oyuncuya",null,null,null,null,1,null,2,null,3,null,4,null,5,null,"Kart\\Oyuncuya",null,null,null,null,1,null,2,null,3,null,4,null,5]
["Sarı",null,null,null,null,null,null,null,null,null,null,null,null,null,null,"Sarı",null,null,null,null,null,null,null,null,null,null,null,null,null,null,"Galip"]
["1. Sarı + Kırmızı",null,null,null,null,null,null,null,null,null,null,null,null,null,null,"1. Sarı + Kırmızı"]
["2. Sarı + Kırmızı",null,null,null,null,null,null,null,null,null,null,null,null,null,null,"2. Sarı + Kırmızı",null,null,null,null,null,null,null,null,null,null,null,null,null,null,null,null,null,{"$f":"\"(  \"&#REF!&\"  -     )\"","v":{"$error":"#REF!"}}]
["Kart\\Öğütücüye",null,null,null,null,"Sarı",null,null,null,null,"Kırmızı",null,null,null,null,"Kart\\Öğütücüye",null,null,null,null,"Sarı",null,null,null,null,"Kırmızı"]
["Kaptan",null,null,null,null,null,null,null,null,null,null,null,null,null,null,"Kaptan",null,null,null,null,null,null,null,null,null,null,null,null,null,null,"Hakemler",null,null,null,null,null,null,"Baş Hakem"]
["Adı Soyadı",null,null,null,":",null,null,null,null,null,null,null,null,null,null,"Adı Soyadı",null,null,null,":"]
["İmza",null,null,null,":",null,null,null,null,null,null,null,null,null,null,"İmza",null,null,null,":"]
[]
["Başlama Saati",null,null,null,null,":",null,null,null,null,null,null,null,null,null,"Bitiş Saati",null,null,null,null,":"]

{"sheet":"Olimpik","index":18,"n_rows":75,"n_cols":44,"rows_kept":75,"cut":false,"hidden":true,"merged":[[0,40,0,41],[0,42,0,43],[3,21,3,22],[3,23,3,24],[3,25,3,26],[3,27,3,41],[3,42,3,43],[0,0,7,20],[0,21,0,28],[0,29,0,31],[0,32,0,34],[0,35,0,37],[0,38,0,39],[1,21,2,28],[1,29,2,31],[1,32,2,34],[1,35,2,37],[1,38,2,39],[1,40,2,41],[1,42,2,43],[4,23,7,24],[4,25,5,26],[6,25,7,26],[8,40,9,41],[8,42,9,43],[10,38,10,39],[4,42,5,42],[4,43,5,43],[6,42,7,42],[6,43,7,43],[8,0,10,0],[8,1,10,1],[8,2,10,2],[8,3,9,13],[8,14,10,14],[8,15,10,15],[10,3,10,13],[10,17,10,28],[10,30,10,31],[10,32,10,33],[10,34,10,35],[10,36,10,37],[8,16,10,16],[8,17,9,28],[8,29,10,29],[8,30,9,39],[4,21,7,22],[14,0,16,0],[14,1,16,1],[14,3,16,13],[14,14,16,14],[14,15,16,15],[14,17,16,28],[14,29,16,29],[11,29,13,29],[11,0,13,0],[11,1,13,1],[11,3,13,13],[11,14,13,14],[11,15,13,15],[11,17,13,28],[28,15,28,19],[28,20,28,21],[28,22,28,23],[28,24,28,25],[28,26,28,27],[28,28,28,29],[25,0,25,4],[25,15,25,19],[25,30,26,39],[26,0,26,4],[26,5,26,6],[26,7,26,8],[26,9,26,10],[26,11,26,12],[27,24,27,25],[27,26,27,27],[27,28,27,29],[26,28,26,29],[17,0,18,0],[17,29,18,29],[27,5,27,6],[27,7,27,8],[27,9,27,10],[27,11,27,12],[27,13,27,14],[27,15,27,19],[27,20,27,21],[27,22,27,23],[26,13,26,14],[26,15,26,19],[26,20,26,21],[26,22,26,23],[19,0,21,0],[26,24,26,25],[26,26,26,27],[22,0,24,0],[22,1,24,1],[22,3,24,13],[22,14,24,14],[22,15,24,15],[22,17,24,28],[22,29,24,29],[29,33,30,43],[30,0,30,4],[30,5,30,7],[30,10,30,12],[30,15,30,19],[30,20,30,22],[30,25,30,27],[29,15,29,19],[29,20,29,21],[29,22,29,23],[29,24,29,25],[29,26,29,27],[29,28,29,29],[29,0,29,4],[29,5,29,6],[29,7,29,8],[29,9,29,10],[29,11,29,12],[29,13,29,14],[27,30,30,32],[28,0,28,4],[28,11,28,12],[28,13,28,14],[27,0,27,4],[39,40,39,41],[39,42,39,43],[42,21,42,22],[42,23,42,24],[42,25,42,26],[42,27,42,41],[42,42,42,43],[31,30,31,36],[31,37,31,43],[32,30,35,36],[32,37,35,43],[39,21,39,28],[39,29,39,31],[39,32,39,34],[39,35,39,37],[39,38,39,39],[40,21,41,28],[40,29,41,31],[40,32,41,34],[40,35,41,37],[40,38,41,39],[40,40,41,41],[40,42,41,43],[47,40,48,41],[47,42,48,43],[49,38,49,39],[43,42,44,42],[43,43,44,43],[45,42,46,42],[45,43,46,43],[47,0,49,0],[47,1,49,1],[47,2,49,2],[47,3,48,13],[47,14,49,14],[47,15,49,15],[39,0,46,20],[49,3,49,13],[49,17,49,28],[49,30,49,31],[49,32,49,33],[49,34,49,35],[49,36,49,37],[47,16,49,16],[47,17,48,28],[47,29,49,29],[47,30,48,39],[50,0,52,0],[50,1,52,1],[50,3,52,13],[50,14,52,14],[50,15,52,15],[50,17,52,28],[64,0,64,4],[64,15,64,19],[64,30,65,39],[65,0,65,4],[65,5,65,6],[65,7,65,8],[65,9,65,10],[65,11,65,12],[65,28,65,29],[65,13,65,14],[65,15,65,19],[65,20,65,21],[65,22,65,23],[65,24,65,25],[65,26,65,27],[53,0,55,0],[53,1,55,1],[53,3,55,13],[67,24,67,25],[67,26,67,27],[67,28,67,29],[66,24,66,25],[66,26,66,27],[66,28,66,29],[66,0,66,4],[66,5,66,6],[66,7,66,8],[66,9,66,10],[66,11,66,12],[66,13,66,14],[66,15,66,19],[66,20,66,21],[66,22,66,23],[67,0,67,4],[67,5,67,6],[67,7,67,8],[67,9,67,10],[67,11,67,12],[67,13,67,14],[67,15,67,19],[67,20,67,21],[67,22,67,23],[68,13,68,14],[71,30,74,36],[71,37,74,43],[68,33,69,43],[69,0,69,4],[69,5,69,7],[69,10,69,12],[69,15,69,19],[69,20,69,22],[69,25,69,27],[68,15,68,19],[68,20,68,21],[68,22,68,23],[68,24,68,25],[68,26,68,27],[68,28,68,29],[68,0,68,4],[68,5,68,6],[68,7,68,8],[68,9,68,10],[68,11,68,12],[70,30,70,36],[70,37,70,43],[66,30,69,32],[61,0,63,0],[61,1,63,1],[61,3,63,13],[61,14,63,14],[61,15,63,15],[61,17,63,28],[61,29,63,29],[58,0,60,0],[58,1,60,1],[58,3,60,13],[58,14,60,14],[58,15,60,15],[58,17,60,28],[58,29,60,29],[56,0,57,0],[56,29,57,29],[43,21,46,22],[43,23,46,24],[43,25,44,26],[45,25,46,26],[4,27,5,41],[6,27,7,41],[43,27,44,41],[45,27,46,41],[53,14,55,14],[53,15,55,15],[53,17,55,28],[53,29,55,29],[19,1,21,1],[19,3,21,13],[19,14,21,14],[19,15,21,15],[19,17,21,28],[19,29,21,29],[50,29,52,29],[28,5,28,6],[28,7,28,8],[28,9,28,10]]}
["          TÜRKİYE\n          MASA TENİSİ FEDERASYONU\n          YARIŞMA CETVELİ\n          Olimpik Sistem (4 Tek, 1 Çift)",null,null,null,null,null,null,null,null,null,null,null,null,null,null,null,null,null,null,null,null,"Yarışma Adı",null,null,null,null,null,null,null,"Yeri",null,null,"Tarih",null,null,"Saat",null,null,"Etap",null,"Maç No",null,"Masa"]
[]
[]
[null,null,null,null,null,null,null,null,null,null,null,null,null,null,null,null,null,null,null,null,null,"Erkek",null,"Bayan",null,"Galip",null,"Takımlar",null,null,null,null,null,null,null,null,null,null,null,null,null,null,"Kura"]
[null,null,null,null,null,null,null,null,null,null,null,null,null,null,null,null,null,null,null,null,null,null,null,null,null,null,null,null,null,null,null,null,null,null,null,null,null,null,null,null,null,null,"A","X"]
[]
[null,null,null,null,null,null,null,null,null,null,null,null,null,null,null,null,null,null,null,null,null,null,null,null,null,null,null,null,null,null,null,null,null,null,null,null,null,null,null,null,null,null,"A","X"]
[]
["Maç No","Kura","Lisans No","A-",null,null,null,null,null,null,null,null,null,null,"Mola","Kura","Lisans No","X-",null,null,null,null,null,null,null,null,null,null,null,"Mola","Sayılar",null,null,null,null,null,null,null,null,null,"Setler",null,"Puan"]
[]
[null,null,null,"Sporcular",null,null,null,null,null,null,null,null,null,null,null,null,null,"Sporcular",null,null,null,null,null,null,null,null,null,null,null,null,"1.Set",null,"2.Set",null,"3.Set",null,"4.Set",null,"5.Set",null,"A","X","A","X"]
[1,"A",null,null,null,null,null,null,null,null,null,null,null,null,null,"X"]
[]
[]
[2,"B",null,null,null,null,null,null,null,null,null,null,null,null,null,"Y"]
[]
[]
[3,"C",null,null,null,null,null,null,null,null,null,null,null,null,null,"Z"]
[null,"A\nB",null,null,null,null,null,null,null,null,null,null,null,null,null,"X\nY"]
[4,"B\nA",null,null,null,null,null,null,null,null,null,null,null,null,null,"Z"]
[]
[]
[5,"C",null,null,null,null,null,null,null,null,null,null,null,null,null,"Y\nX"]
[]
[]
["Forma Rengi",null,null,null,null,null,null,null,null,null,null,null,null,null,null,"Forma Rengi",null,null,null,null,null,null,null,null,null,null,null,null,null,null,"Toplam"]
["Kart\\Oyuncuya",null,null,null,null,1,null,2,null,3,null,4,null,5,null,"Kart\\Oyuncuya",null,null,null,null,1,null,2,null,3,null,4,null,5]
["Sarı",null,null,null,null,null,null,null,null,null,null,null,null,null,null,"Sarı",null,null,null,null,null,null,null,null,null,null,null,null,null,null,"Galip"]
["1. Sarı + Kırmızı",null,null,null,null,null,null,null,null,null,null,null,null,null,null,"1. Sarı + Kırmızı"]
["2. Sarı + Kırmızı",null,null,null,null,null,null,null,null,null,null,null,null,null,null,"2. Sarı + Kırmızı",null,null,null,null,null,null,null,null,null,null,null,null,null,null,null,null,null,{"$f":"\"(  \"&#REF!&\"  -     )\"","v":{"$error":"#REF!"}}]
["Kart\\Öğütücüye",null,null,null,null,"Sarı",null,null,null,null,"Kırmızı",null,null,null,null,"Kart\\Öğütücüye",null,null,null,null,"Sarı",null,null,null,null,"Kırmızı"]
["Kaptan",null,null,null,null,null,null,null,null,null,null,null,null,null,null,"Kaptan",null,null,null,null,null,null,null,null,null,null,null,null,null,null,"Hakemler",null,null,null,null,null,null,"Baş Hakem"]
["Adı Soyadı",null,null,null,":",null,null,null,null,null,null,null,null,null,null,"Adı Soyadı",null,null,null,":"]
["İmza",null,null,null,":",null,null,null,null,null,null,null,null,null,null,"İmza",null,null,null,":"]
[]
["Başlama Saati",null,null,null,null,":",null,null,null,null,null,null,null,null,null,"Bitiş Saati",null,null,null,null,":"]
[]
[]
[]
["          TÜRKİYE\n          MASA TENİSİ FEDERASYONU\n          YARIŞMA CETVELİ\n          Olimpik Sistem (4 Tek, 1 Çift)",null,null,null,null,null,null,null,null,null,null,null,null,null,null,null,null,null,null,null,null,"Yarışma Adı",null,null,null,null,null,null,null,"Yeri",null,null,"Tarih",null,null,"Saat",null,null,"Etap",null,"Maç No",null,"Masa"]
[]
[]
[null,null,null,null,null,null,null,null,null,null,null,null,null,null,null,null,null,null,null,null,null,"Erkek",null,"Bayan",null,"Galip",null,"Takımlar",null,null,null,null,null,null,null,null,null,null,null,null,null,null,"Kura"]
[null,null,null,null,null,null,null,null,null,null,null,null,null,null,null,null,null,null,null,null,null,null,null,null,null,null,null,null,null,null,null,null,null,null,null,null,null,null,null,null,null,null,"A","X"]
[]
[null,null,null,null,null,null,null,null,null,null,null,null,null,null,null,null,null,null,null,null,null,null,null,null,null,null,null,null,null,null,null,null,null,null,null,null,null,null,null,null,null,null,"A","X"]
[]
["Maç No","Kura","Lisans No","A-",null,null,null,null,null,null,null,null,null,null,"Mola","Kura","Lisans No","X-",null,null,null,null,null,null,null,null,null,null,null,"Mola","Sayılar",null,null,null,null,null,null,null,null,null,"Setler",null,"Puan"]
[]
[null,null,null,"Sporcular",null,null,null,null,null,null,null,null,null,null,null,null,null,"Sporcular",null,null,null,null,null,null,null,null,null,null,null,null,"1.Set",null,"2.Set",null,"3.Set",null,"4.Set",null,"5.Set",null,"A","X","A","X"]
[1,"A",null,null,null,null,null,null,null,null,null,null,null,null,null,"X"]
[]
[]
[2,"B",null,null,null,null,null,null,null,null,null,null,null,null,null,"Y"]
[]
[]
[3,"C",null,null,null,null,null,null,null,null,null,null,null,null,null,"Z"]
[null,"A\nB",null,null,null,null,null,null,null,null,null,null,null,null,null,"X\nY"]
[4,"B\nA",null,null,null,null,null,null,null,null,null,null,null,null,null,"Z"]
[]
[]
[5,"C",null,null,null,null,null,null,null,null,null,null,null,null,null,"Y\nX"]
[]
[]
["Forma Rengi",null,null,null,null,null,null,null,null,null,null,null,null,null,null,"Forma Rengi",null,null,null,null,null,null,null,null,null,null,null,null,null,null,"Toplam"]
["Kart\\Oyuncuya",null,null,null,null,1,null,2,null,3,null,4,null,5,null,"Kart\\Oyuncuya",null,null,null,null,1,null,2,null,3,null,4,null,5]
["Sarı",null,null,null,null,null,null,null,null,null,null,null,null,null,null,"Sarı",null,null,null,null,null,null,null,null,null,null,null,null,null,null,"Galip"]
["1. Sarı + Kırmızı",null,null,null,null,null,null,null,null,null,null,null,null,null,null,"1. Sarı + Kırmızı"]
["2. Sarı + Kırmızı",null,null,null,null,null,null,null,null,null,null,null,null,null,null,"2. Sarı + Kırmızı",null,null,null,null,null,null,null,null,null,null,null,null,null,null,null,null,null,{"$f":"\"(  \"&#REF!&\"  -     )\"","v":{"$error":"#REF!"}}]
["Kart\\Öğütücüye",null,null,null,null,"Sarı",null,null,null,null,"Kırmızı",null,null,null,null,"Kart\\Öğütücüye",null,null,null,null,"Sarı",null,null,null,null,"Kırmızı"]
["Kaptan",null,null,null,null,null,null,null,null,null,null,null,null,null,null,"Kaptan",null,null,null,null,null,null,null,null,null,null,null,null,null,null,"Hakemler",null,null,null,null,null,null,"Baş Hakem"]
["Adı Soyadı",null,null,null,":",null,null,null,null,null,null,null,null,null,null,"Adı Soyadı",null,null,null,":"]
["İmza",null,null,null,":",null,null,null,null,null,null,null,null,null,null,"İmza",null,null,null,":"]
[]
["Başlama Saati",null,null,null,null,":",null,null,null,null,null,null,null,null,null,"Bitiş Saati",null,null,null,null,":"]

{"sheet":"Yeni_Olimpik","index":19,"n_rows":75,"n_cols":44,"rows_kept":75,"cut":false,"hidden":true,"merged":[[0,40,0,41],[0,42,0,43],[3,21,3,22],[3,23,3,24],[3,25,3,26],[3,27,3,41],[3,42,3,43],[0,0,7,20],[0,21,0,28],[0,29,0,31],[0,32,0,34],[0,35,0,37],[0,38,0,39],[1,32,2,34],[1,35,2,37],[1,38,2,39],[1,40,2,41],[1,42,2,43],[1,29,2,31],[1,21,2,28],[4,21,7,22],[4,23,7,24],[4,25,5,26],[6,25,7,26],[8,0,10,0],[8,1,10,1],[8,2,10,2],[8,3,9,13],[8,14,10,14],[8,15,10,15],[8,40,9,41],[8,42,9,43],[10,38,10,39],[4,42,5,42],[4,43,5,43],[6,42,7,42],[6,43,7,43],[6,27,7,41],[4,27,5,41],[10,36,10,37],[10,3,10,13],[10,17,10,28],[10,30,10,31],[10,32,10,33],[10,34,10,35],[8,16,10,16],[8,17,9,28],[8,29,10,29],[8,30,9,39],[14,0,16,0],[14,1,16,1],[14,3,16,13],[14,14,16,14],[14,15,16,15],[14,17,16,28],[14,29,16,29],[11,29,13,29],[11,0,13,0],[11,1,13,1],[11,3,13,13],[11,14,13,14],[11,15,13,15],[11,17,13,28],[23,0,24,0],[23,1,24,1],[23,14,24,14],[23,15,24,15],[23,29,24,29],[17,0,19,0],[17,1,19,1],[17,3,19,13],[17,14,19,14],[17,15,19,15],[17,17,19,28],[20,0,22,0],[20,1,22,1],[20,3,22,13],[20,14,22,14],[20,15,22,15],[20,17,22,28],[17,29,19,29],[20,29,22,29],[25,0,25,4],[25,15,25,19],[25,30,26,39],[26,0,26,4],[26,5,26,6],[26,7,26,8],[26,9,26,10],[26,11,26,12],[27,30,30,32],[28,0,28,4],[28,5,28,6],[28,7,28,8],[28,9,28,10],[28,11,28,12],[28,13,28,14],[26,28,26,29],[27,0,27,4],[27,5,27,6],[27,7,27,8],[27,9,27,10],[27,11,27,12],[27,13,27,14],[27,15,27,19],[27,20,27,21],[26,13,26,14],[26,15,26,19],[26,20,26,21],[26,22,26,23],[26,24,26,25],[26,26,26,27],[29,13,29,14],[28,15,28,19],[28,20,28,21],[28,22,28,23],[28,24,28,25],[28,26,28,27],[29,24,29,25],[29,26,29,27],[28,28,28,29],[27,24,27,25],[27,26,27,27],[27,28,27,29],[39,0,46,20],[39,21,39,28],[39,29,39,31],[39,32,39,34],[39,35,39,37],[42,21,42,22],[42,23,42,24],[42,25,42,26],[42,27,42,41],[27,22,27,23],[29,33,30,43],[30,0,30,4],[30,5,30,7],[30,10,30,12],[30,15,30,19],[30,20,30,22],[30,25,30,27],[29,15,29,19],[29,20,29,21],[29,22,29,23],[29,28,29,29],[29,0,29,4],[29,5,29,6],[29,7,29,8],[29,9,29,10],[29,11,29,12],[47,0,49,0],[47,1,49,1],[47,2,49,2],[47,3,48,13],[47,14,49,14],[47,15,49,15],[49,3,49,13],[42,42,42,43],[31,30,31,36],[31,37,31,43],[32,30,35,36],[32,37,35,43],[40,21,41,28],[40,29,41,31],[40,32,41,34],[40,35,41,37],[40,38,41,39],[40,40,41,41],[40,42,41,43],[39,38,39,39],[39,40,39,41],[39,42,39,43],[50,29,52,29],[47,16,49,16],[47,17,48,28],[47,29,49,29],[47,30,48,39],[49,32,49,33],[49,34,49,35],[49,17,49,28],[49,30,49,31],[49,36,49,37],[49,38,49,39],[64,30,65,39],[65,0,65,4],[65,5,65,6],[65,7,65,8],[65,9,65,10],[65,11,65,12],[59,14,61,14],[59,15,61,15],[62,0,63,0],[62,1,63,1],[62,14,63,14],[62,15,63,15],[59,0,61,0],[59,1,61,1],[59,3,61,13],[65,28,65,29],[65,13,65,14],[65,15,65,19],[65,20,65,21],[65,22,65,23],[65,24,65,25],[65,26,65,27],[67,0,67,4],[67,5,67,6],[67,7,67,8],[67,9,67,10],[67,11,67,12],[67,13,67,14],[66,0,66,4],[66,5,66,6],[66,7,66,8],[66,9,66,10],[66,11,66,12],[66,13,66,14],[69,0,69,4],[69,5,69,7],[69,10,69,12],[69,15,69,19],[69,20,69,22],[69,25,69,27],[68,15,68,19],[68,20,68,21],[68,22,68,23],[68,24,68,25],[68,26,68,27],[68,0,68,4],[68,5,68,6],[68,7,68,8],[68,9,68,10],[68,11,68,12],[66,20,66,21],[50,0,52,0],[50,1,52,1],[50,3,52,13],[64,0,64,4],[64,15,64,19],[50,14,52,14],[50,15,52,15],[50,17,52,28],[47,40,48,41],[68,13,68,14],[71,30,74,36],[71,37,74,43],[66,30,69,32],[68,33,69,43],[53,29,55,29],[70,30,70,36],[70,37,70,43],[68,28,68,29],[53,17,55,28],[67,22,67,23],[67,24,67,25],[67,26,67,27],[67,28,67,29],[66,24,66,25],[66,26,66,27],[66,28,66,29],[59,17,61,28],[62,29,63,29],[59,29,61,29],[67,15,67,19],[67,20,67,21],[66,15,66,19],[47,42,48,43],[66,22,66,23],[43,42,44,42],[43,43,44,43],[45,42,46,42],[45,43,46,43],[56,0,58,0],[56,1,58,1],[56,3,58,13],[56,14,58,14],[56,15,58,15],[56,17,58,28],[53,0,55,0],[53,1,55,1],[53,3,55,13],[53,14,55,14],[53,15,55,15],[56,29,58,29],[43,27,44,41],[45,27,46,41],[43,21,46,22],[43,23,46,24],[43,25,44,26],[45,25,46,26]]}
["          TÜRKİYE\n          MASA TENİSİ FEDERASYONU\n          YARIŞMA CETVELİ\n          Yeni Olimpik Sistem (4 Tek, 1 Çift)",null,null,null,null,null,null,null,null,null,null,null,null,null,null,null,null,null,null,null,null,"Yarışma Adı",null,null,null,null,null,null,null,"Yeri",null,null,"Tarih",null,null,"Saat",null,null,"Etap",null,"Maç No",null,"Masa"]
[]
[]
[null,null,null,null,null,null,null,null,null,null,null,null,null,null,null,null,null,null,null,null,null,"Erkek",null,"Bayan",null,"Galip",null,"Takımlar",null,null,null,null,null,null,null,null,null,null,null,null,null,null,"Kura"]
[null,null,null,null,null,null,null,null,null,null,null,null,null,null,null,null,null,null,null,null,null,null,null,null,null,null,null,null,null,null,null,null,null,null,null,null,null,null,null,null,null,null,"A","X"]
[]
[null,null,null,null,null,null,null,null,null,null,null,null,null,null,null,null,null,null,null,null,null,null,null,null,null,null,null,null,null,null,null,null,null,null,null,null,null,null,null,null,null,null,"A","X"]
[]
["Maç No","Kura","Lisans No","A-",null,null,null,null,null,null,null,null,null,null,"Mola","Kura","Lisans No","X-",null,null,null,null,null,null,null,null,null,null,null,"Mola","Sayılar",null,null,null,null,null,null,null,null,null,"Setler",null,"Puan"]
[]
[null,null,null,"Sporcular",null,null,null,null,null,null,null,null,null,null,null,null,null,"Sporcular",null,null,null,null,null,null,null,null,null,null,null,null,"1.Set",null,"2.Set",null,"3.Set",null,"4.Set",null,"5.Set",null,"A","X","A","X"]
[1,"A",null,null,null,null,null,null,null,null,null,null,null,null,null,"X"]
[]
[]
[2,"B",null,null,null,null,null,null,null,null,null,null,null,null,null,"Y"]
[]
[]
[3,"C",null,null,null,null,null,null,null,null,null,null,null,null,null,"Z"]
[]
[]
[4,"A",null,null,null,null,null,null,null,null,null,null,null,null,null,"Y"]
[]
[]
[5,"Çift",null,null,null,null,null,null,null,null,null,null,null,null,null,"Çift"]
[]
["Forma Rengi",null,null,null,null,null,null,null,null,null,null,null,null,null,null,"Forma Rengi",null,null,null,null,null,null,null,null,null,null,null,null,null,null,"Toplam"]
["Kart\\Oyuncuya",null,null,null,null,1,null,2,null,3,null,4,null,5,null,"Kart\\Oyuncuya",null,null,null,null,1,null,2,null,3,null,4,null,5]
["Sarı",null,null,null,null,null,null,null,null,null,null,null,null,null,null,"Sarı",null,null,null,null,null,null,null,null,null,null,null,null,null,null,"Galip"]
["1. Sarı + Kırmızı",null,null,null,null,null,null,null,null,null,null,null,null,null,null,"1. Sarı + Kırmızı"]
["2. Sarı + Kırmızı",null,null,null,null,null,null,null,null,null,null,null,null,null,null,"2. Sarı + Kırmızı",null,null,null,null,null,null,null,null,null,null,null,null,null,null,null,null,null,{"$f":"\"(  \"&#REF!&\"  -     )\"","v":{"$error":"#REF!"}}]
["Kart\\Öğütücüye",null,null,null,null,"Sarı",null,null,null,null,"Kırmızı",null,null,null,null,"Kart\\Öğütücüye",null,null,null,null,"Sarı",null,null,null,null,"Kırmızı"]
["Kaptan",null,null,null,null,null,null,null,null,null,null,null,null,null,null,"Kaptan",null,null,null,null,null,null,null,null,null,null,null,null,null,null,"Hakemler",null,null,null,null,null,null,"Baş Hakem"]
["Adı Soyadı",null,null,null,":",null,null,null,null,null,null,null,null,null,null,"Adı Soyadı",null,null,null,":"]
["İmza",null,null,null,":",null,null,null,null,null,null,null,null,null,null,"İmza",null,null,null,":"]
[]
["Başlama Saati",null,null,null,null,":",null,null,null,null,null,null,null,null,null,"Bitiş Saati",null,null,null,null,":"]
[]
[]
[]
["          TÜRKİYE\n          MASA TENİSİ FEDERASYONU\n          YARIŞMA CETVELİ\n          Yeni Olimpik Sistem (4 Tek, 1 Çift)",null,null,null,null,null,null,null,null,null,null,null,null,null,null,null,null,null,null,null,null,"Yarışma Adı",null,null,null,null,null,null,null,"Yeri",null,null,"Tarih",null,null,"Saat",null,null,"Etap",null,"Maç No",null,"Masa"]
[]
[]
[null,null,null,null,null,null,null,null,null,null,null,null,null,null,null,null,null,null,null,null,null,"Erkek",null,"Bayan",null,"Galip",null,"Takımlar",null,null,null,null,null,null,null,null,null,null,null,null,null,null,"Kura"]
[null,null,null,null,null,null,null,null,null,null,null,null,null,null,null,null,null,null,null,null,null,null,null,null,null,null,null,null,null,null,null,null,null,null,null,null,null,null,null,null,null,null,"A","X"]
[]
[null,null,null,null,null,null,null,null,null,null,null,null,null,null,null,null,null,null,null,null,null,null,null,null,null,null,null,null,null,null,null,null,null,null,null,null,null,null,null,null,null,null,"A","X"]
[]
["Maç No","Kura","Lisans No","A-",null,null,null,null,null,null,null,null,null,null,"Mola","Kura","Lisans No","X-",null,null,null,null,null,null,null,null,null,null,null,"Mola","Sayılar",null,null,null,null,null,null,null,null,null,"Setler",null,"Puan"]
[]
[null,null,null,"Sporcular",null,null,null,null,null,null,null,null,null,null,null,null,null,"Sporcular",null,null,null,null,null,null,null,null,null,null,null,null,"1.Set",null,"2.Set",null,"3.Set",null,"4.Set",null,"5.Set",null,"A","X","A","X"]
[1,"A",null,null,null,null,null,null,null,null,null,null,null,null,null,"X"]
[]
[]
[2,"B",null,null,null,null,null,null,null,null,null,null,null,null,null,"Y"]
[]
[]
[3,"C",null,null,null,null,null,null,null,null,null,null,null,null,null,"Z"]
[]
[]
[4,"A",null,null,null,null,null,null,null,null,null,null,null,null,null,"Y"]
[]
[]
[5,"Çift",null,null,null,null,null,null,null,null,null,null,null,null,null,"Çift"]
[]
["Forma Rengi",null,null,null,null,null,null,null,null,null,null,null,null,null,null,"Forma Rengi",null,null,null,null,null,null,null,null,null,null,null,null,null,null,"Toplam"]
["Kart\\Oyuncuya",null,null,null,null,1,null,2,null,3,null,4,null,5,null,"Kart\\Oyuncuya",null,null,null,null,1,null,2,null,3,null,4,null,5]
["Sarı",null,null,null,null,null,null,null,null,null,null,null,null,null,null,"Sarı",null,null,null,null,null,null,null,null,null,null,null,null,null,null,"Galip"]
["1. Sarı + Kırmızı",null,null,null,null,null,null,null,null,null,null,null,null,null,null,"1. Sarı + Kırmızı"]
["2. Sarı + Kırmızı",null,null,null,null,null,null,null,null,null,null,null,null,null,null,"2. Sarı + Kırmızı",null,null,null,null,null,null,null,null,null,null,null,null,null,null,null,null,null,{"$f":"\"(  \"&#REF!&\"  -     )\"","v":{"$error":"#REF!"}}]
["Kart\\Öğütücüye",null,null,null,null,"Sarı",null,null,null,null,"Kırmızı",null,null,null,null,"Kart\\Öğütücüye",null,null,null,null,"Sarı",null,null,null,null,"Kırmızı"]
["Kaptan",null,null,null,null,null,null,null,null,null,null,null,null,null,null,"Kaptan",null,null,null,null,null,null,null,null,null,null,null,null,null,null,"Hakemler",null,null,null,null,null,null,"Baş Hakem"]
["Adı Soyadı",null,null,null,":",null,null,null,null,null,null,null,null,null,null,"Adı Soyadı",null,null,null,":"]
["İmza",null,null,null,":",null,null,null,null,null,null,null,null,null,null,"İmza",null,null,null,":"]
[]
["Başlama Saati",null,null,null,null,":",null,null,null,null,null,null,null,null,null,"Bitiş Saati",null,null,null,null,":"]

{"sheet":"5_Mac_KC","index":20,"n_rows":47,"n_cols":10,"rows_kept":47,"cut":false,"hidden":true,"merged":[[13,0,13,3],[13,6,13,9],[0,0,0,3],[0,6,0,9],[1,0,1,3],[1,6,1,9],[5,2,5,3],[5,8,5,9],[6,2,6,3],[6,8,6,9],[7,8,7,9],[12,0,12,3],[12,6,12,9],[17,2,17,3],[17,8,17,9],[18,2,18,3],[18,8,18,9],[19,8,19,9],[24,0,24,3],[24,6,24,9],[25,0,25,3],[25,6,25,9],[29,2,29,3],[29,8,29,9],[30,2,30,3],[30,8,30,9],[31,8,31,9],[36,0,36,3],[36,6,36,9],[43,8,43,9],[37,0,37,3],[37,6,37,9],[41,2,41,3],[41,8,41,9],[42,2,42,3],[42,8,42,9]]}
["TÜRKİYE",null,null,null,null,null,"TÜRKİYE"]
["MASA TENİSİ FEDERASYONU",null,null,null,null,null,"MASA TENİSİ FEDERASYONU"]
["TAKIM LİSTESİ",null,null,null,null,null,"TAKIM LİSTESİ"]
["Takım Adı",null,null,":",null,null,"Takım Adı",null,null,":"]
["Karşılaşacağı Takım",null,null,":",null,null,"Karşılaşacağı Takım",null,null,":"]
["A",null,": ………………………………..…………………..……….……….",null,null,null,"X",null,": ………………………………..…………………..……….………."]
["B",null,": ………………………………..…………………..……….……….",null,null,null,"Y",null,": ………………………………..…………………..……….………."]
["C",null,": ………………………………..…………………..……….……….",null,null,null,"Z",null,": ………………………………..…………………..……….………."]
["Karşılaşma Tarihi",null,null,":……………………………………...",null,null,"Karşılaşma Tarihi",null,null,":……………………………………..."]
["Takım Kaptanı",null,null,":……………………………………...",null,null,"Takım Kaptanı",null,null,":……………………………………..."]
["İmza",null,null,":……………………………………...",null,null,"İmza",null,null,":……………………………………..."]
[]
["TÜRKİYE",null,null,null,null,null,"TÜRKİYE"]
["MASA TENİSİ FEDERASYONU",null,null,null,null,null,"MASA TENİSİ FEDERASYONU"]
["TAKIM LİSTESİ",null,null,null,null,null,"TAKIM LİSTESİ"]
["Takım Adı",null,null,":",null,null,"Takım Adı",null,null,":"]
["Karşılaşacağı Takım",null,null,":",null,null,"Karşılaşacağı Takım",null,null,":"]
["A",null,": ………………………………..…………………..……….……….",null,null,null,"X",null,": ………………………………..…………………..……….………."]
["B",null,": ………………………………..…………………..……….……….",null,null,null,"Y",null,": ………………………………..…………………..……….………."]
["C",null,": ………………………………..…………………..……….……….",null,null,null,"Z",null,": ………………………………..…………………..……….………."]
["Karşılaşma Tarihi",null,null,":……………………………………...",null,null,"Karşılaşma Tarihi",null,null,":……………………………………..."]
["Takım Kaptanı",null,null,":……………………………………...",null,null,"Takım Kaptanı",null,null,":……………………………………..."]
["İmza",null,null,":……………………………………...",null,null,"İmza",null,null,":……………………………………..."]
[]
["TÜRKİYE",null,null,null,null,null,"TÜRKİYE"]
["MASA TENİSİ FEDERASYONU",null,null,null,null,null,"MASA TENİSİ FEDERASYONU"]
["TAKIM LİSTESİ",null,null,null,null,null,"TAKIM LİSTESİ"]
["Takım Adı",null,null,":",null,null,"Takım Adı",null,null,":"]
["Karşılaşacağı Takım",null,null,":",null,null,"Karşılaşacağı Takım",null,null,":"]
["A",null,": ………………………………..…………………..……….……….",null,null,null,"X",null,": ………………………………..…………………..……….………."]
["B",null,": ………………………………..…………………..……….……….",null,null,null,"Y",null,": ………………………………..…………………..……….………."]
["C",null,": ………………………………..…………………..……….……….",null,null,null,"Z",null,": ………………………………..…………………..……….………."]
["Karşılaşma Tarihi",null,null,":……………………………………...",null,null,"Karşılaşma Tarihi",null,null,":……………………………………..."]
["Takım Kaptanı",null,null,":……………………………………...",null,null,"Takım Kaptanı",null,null,":……………………………………..."]
["İmza",null,null,":……………………………………...",null,null,"İmza",null,null,":……………………………………..."]
[]
["TÜRKİYE",null,null,null,null,null,"TÜRKİYE"]
["MASA TENİSİ FEDERASYONU",null,null,null,null,null,"MASA TENİSİ FEDERASYONU"]
["TAKIM LİSTESİ",null,null,null,null,null,"TAKIM LİSTESİ"]
["Takım Adı",null,null,":",null,null,"Takım Adı",null,null,":"]
["Karşılaşacağı Takım",null,null,":",null,null,"Karşılaşacağı Takım",null,null,":"]
["A",null,": ………………………………..…………………..……….……….",null,null,null,"X",null,": ………………………………..…………………..……….………."]
["B",null,": ………………………………..…………………..……….……….",null,null,null,"Y",null,": ………………………………..…………………..……….………."]
["C",null,": ………………………………..…………………..……….……….",null,null,null,"Z",null,": ………………………………..…………………..……….………."]
["Karşılaşma Tarihi",null,null,":……………………………………...",null,null,"Karşılaşma Tarihi",null,null,":……………………………………..."]
["Takım Kaptanı",null,null,":……………………………………...",null,null,"Takım Kaptanı",null,null,":……………………………………..."]
["İmza",null,null,":……………………………………...",null,null,"İmza",null,null,":……………………………………..."]

{"sheet":"Olimpik_KC","index":21,"n_rows":51,"n_cols":10,"rows_kept":51,"cut":false,"hidden":true,"merged":[[0,0,0,3],[0,6,0,9],[1,0,1,3],[1,6,1,9],[5,2,5,3],[5,8,5,9],[6,2,6,3],[6,8,6,9],[13,0,13,3],[13,6,13,9],[14,0,14,3],[14,6,14,9],[7,0,8,0],[7,6,8,6],[31,2,31,3],[31,8,31,9],[18,2,18,3],[18,8,18,9],[19,2,19,3],[19,8,19,9],[32,2,32,3],[32,8,32,9],[33,0,34,0],[33,6,34,6],[39,0,39,3],[20,0,21,0],[20,6,21,6],[27,0,27,3],[27,6,27,9],[26,0,26,3],[26,6,26,9],[46,0,47,0],[46,6,47,6],[39,6,39,9],[40,0,40,3],[40,6,40,9],[44,2,44,3],[45,2,45,3],[45,8,45,9],[44,8,44,9]]}
["TÜRKİYE",null,null,null,null,null,"TÜRKİYE"]
["MASA TENİSİ FEDERASYONU",null,null,null,null,null,"MASA TENİSİ FEDERASYONU"]
["TAKIM LİSTESİ",null,null,null,null,null,"TAKIM LİSTESİ"]
["Takım Adı",null,null,":",null,null,"Takım Adı",null,null,":"]
["Karşılaşacağı Takım",null,null,":",null,null,"Karşılaşacağı Takım",null,null,":"]
["A",null,": ………………………………..…………………..……….……….",null,null,null,"X",null,": ………………………………..…………………..……….………."]
["B",null,": ………………………………..…………………..……….……….",null,null,null,"Y",null,": ………………………………..…………………..……….………."]
["Çift","C",": ………………………………..…………………..……….……….",null,null,null,"Çift","Z",": ………………………………..…………………..……….………."]
[null,null,": ………………………………..…………………..……….……….",null,null,null,null,null,": ………………………………..…………………..……….………."]
["Karşılaşma Tarihi",null,null,":……………………………………...",null,null,"Karşılaşma Tarihi",null,null,":……………………………………..."]
["Takım Kaptanı",null,null,":……………………………………...",null,null,"Takım Kaptanı",null,null,":……………………………………..."]
["İmza",null,null,":……………………………………...",null,null,"İmza",null,null,":……………………………………..."]
[]
["TÜRKİYE",null,null,null,null,null,"TÜRKİYE"]
["MASA TENİSİ FEDERASYONU",null,null,null,null,null,"MASA TENİSİ FEDERASYONU"]
["TAKIM LİSTESİ",null,null,null,null,null,"TAKIM LİSTESİ"]
["Takım Adı",null,null,":",null,null,"Takım Adı",null,null,":"]
["Karşılaşacağı Takım",null,null,":",null,null,"Karşılaşacağı Takım",null,null,":"]
["A",null,": ………………………………..…………………..……….……….",null,null,null,"X",null,": ………………………………..…………………..……….………."]
["B",null,": ………………………………..…………………..……….……….",null,null,null,"Y",null,": ………………………………..…………………..……….………."]
["Çift","C",": ………………………………..…………………..……….……….",null,null,null,"Çift","Z",": ………………………………..…………………..……….………."]
[null,null,": ………………………………..…………………..……….……….",null,null,null,null,null,": ………………………………..…………………..……….………."]
["Karşılaşma Tarihi",null,null,":……………………………………...",null,null,"Karşılaşma Tarihi",null,null,":……………………………………..."]
["Takım Kaptanı",null,null,":……………………………………...",null,null,"Takım Kaptanı",null,null,":……………………………………..."]
["İmza",null,null,":……………………………………...",null,null,"İmza",null,null,":……………………………………..."]
[]
["TÜRKİYE",null,null,null,null,null,"TÜRKİYE"]
["MASA TENİSİ FEDERASYONU",null,null,null,null,null,"MASA TENİSİ FEDERASYONU"]
["TAKIM LİSTESİ",null,null,null,null,null,"TAKIM LİSTESİ"]
["Takım Adı",null,null,":",null,null,"Takım Adı",null,null,":"]
["Karşılaşacağı Takım",null,null,":",null,null,"Karşılaşacağı Takım",null,null,":"]
["A",null,": ………………………………..…………………..……….……….",null,null,null,"X",null,": ………………………………..…………………..……….………."]
["B",null,": ………………………………..…………………..……….……….",null,null,null,"Y",null,": ………………………………..…………………..……….………."]
["Çift","C",": ………………………………..…………………..……….……….",null,null,null,"Çift","Z",": ………………………………..…………………..……….………."]
[null,null,": ………………………………..…………………..……….……….",null,null,null,null,null,": ………………………………..…………………..……….………."]
["Karşılaşma Tarihi",null,null,":……………………………………...",null,null,"Karşılaşma Tarihi",null,null,":……………………………………..."]
["Takım Kaptanı",null,null,":……………………………………...",null,null,"Takım Kaptanı",null,null,":……………………………………..."]
["İmza",null,null,":……………………………………...",null,null,"İmza",null,null,":……………………………………..."]
[]
["TÜRKİYE",null,null,null,null,null,"TÜRKİYE"]
["MASA TENİSİ FEDERASYONU",null,null,null,null,null,"MASA TENİSİ FEDERASYONU"]
["TAKIM LİSTESİ",null,null,null,null,null,"TAKIM LİSTESİ"]
["Takım Adı",null,null,":",null,null,"Takım Adı",null,null,":"]
["Karşılaşacağı Takım",null,null,":",null,null,"Karşılaşacağı Takım",null,null,":"]
["A",null,": ………………………………..…………………..……….……….",null,null,null,"X",null,": ………………………………..…………………..……….………."]
["B",null,": ………………………………..…………………..……….……….",null,null,null,"Y",null,": ………………………………..…………………..……….………."]
["Çift","C",": ………………………………..…………………..……….……….",null,null,null,"Çift","Z",": ………………………………..…………………..……….………."]
[null,null,": ………………………………..…………………..……….……….",null,null,null,null,null,": ………………………………..…………………..……….………."]
["Karşılaşma Tarihi",null,null,":……………………………………...",null,null,"Karşılaşma Tarihi",null,null,":……………………………………..."]
["Takım Kaptanı",null,null,":……………………………………...",null,null,"Takım Kaptanı",null,null,":……………………………………..."]
["İmza",null,null,":……………………………………...",null,null,"İmza",null,null,":……………………………………..."]

{"sheet":"Yeni_Olimpik_KC","index":22,"n_rows":55,"n_cols":10,"rows_kept":55,"cut":false,"hidden":true,"merged":[[0,0,0,3],[0,6,0,9],[1,0,1,3],[1,6,1,9],[5,2,5,3],[5,8,5,9],[6,2,6,3],[6,8,6,9],[8,0,9,0],[8,6,9,6],[14,0,14,3],[14,6,14,9],[7,2,7,3],[7,8,7,9],[8,2,8,3],[9,2,9,3],[9,8,9,9],[8,8,8,9],[21,2,21,3],[21,8,21,9],[22,0,23,0],[22,2,22,3],[15,0,15,3],[15,6,15,9],[19,2,19,3],[19,8,19,9],[20,2,20,3],[20,8,20,9],[22,6,23,6],[22,8,22,9],[23,2,23,3],[23,8,23,9],[42,0,42,3],[42,6,42,9],[43,0,43,3],[43,6,43,9],[33,2,33,3],[33,8,33,9],[34,2,34,3],[34,8,34,9],[35,2,35,3],[35,8,35,9],[29,0,29,3],[29,6,29,9],[28,0,28,3],[28,6,28,9],[36,0,37,0],[36,2,36,3],[36,6,37,6],[36,8,36,9],[37,2,37,3],[37,8,37,9],[47,2,47,3],[47,8,47,9],[48,2,48,3],[48,8,48,9],[49,2,49,3],[49,8,49,9],[50,0,51,0],[50,2,50,3],[50,6,51,6],[50,8,50,9],[51,2,51,3],[51,8,51,9]]}
["TÜRKİYE",null,null,null,null,null,"TÜRKİYE"]
["MASA TENİSİ FEDERASYONU",null,null,null,null,null,"MASA TENİSİ FEDERASYONU"]
["TAKIM LİSTESİ",null,null,null,null,null,"TAKIM LİSTESİ"]
["Takım Adı",null,null,":",null,null,"Takım Adı",null,null,":"]
["Karşılaşacağı Takım",null,null,":",null,null,"Karşılaşacağı Takım",null,null,":"]
["A",null,": ………………………………..…………………..……….……….",null,null,null,"X",null,": ………………………………..…………………..……….………."]
["B",null,": ………………………………..…………………..……….……….",null,null,null,"Y",null,": ………………………………..…………………..……….………."]
["C",null,": ………………………………..…………………..……….……….",null,null,null,"Z",null,": ………………………………..…………………..……….………."]
["Çift",null,": ………………………………..…………………..……….……….",null,null,null,"Çift",null,": ………………………………..…………………..……….………."]
[null,null,": ………………………………..…………………..……….……….",null,null,null,null,null,": ………………………………..…………………..……….………."]
["Karşılaşma Tarihi",null,null,":……………………………………...",null,null,"Karşılaşma Tarihi",null,null,":……………………………………..."]
["Takım Kaptanı",null,null,":……………………………………...",null,null,"Takım Kaptanı",null,null,":……………………………………..."]
["İmza",null,null,":……………………………………...",null,null,"İmza",null,null,":……………………………………..."]
[]
["TÜRKİYE",null,null,null,null,null,"TÜRKİYE"]
["MASA TENİSİ FEDERASYONU",null,null,null,null,null,"MASA TENİSİ FEDERASYONU"]
["TAKIM LİSTESİ",null,null,null,null,null,"TAKIM LİSTESİ"]
["Takım Adı",null,null,":",null,null,"Takım Adı",null,null,":"]
["Karşılaşacağı Takım",null,null,":",null,null,"Karşılaşacağı Takım",null,null,":"]
["A",null,": ………………………………..…………………..……….……….",null,null,null,"X",null,": ………………………………..…………………..……….………."]
["B",null,": ………………………………..…………………..……….……….",null,null,null,"Y",null,": ………………………………..…………………..……….………."]
["C",null,": ………………………………..…………………..……….……….",null,null,null,"Z",null,": ………………………………..…………………..……….………."]
["Çift",null,": ………………………………..…………………..……….……….",null,null,null,"Çift",null,": ………………………………..…………………..……….………."]
[null,null,": ………………………………..…………………..……….……….",null,null,null,null,null,": ………………………………..…………………..……….………."]
["Karşılaşma Tarihi",null,null,":……………………………………...",null,null,"Karşılaşma Tarihi",null,null,":……………………………………..."]
["Takım Kaptanı",null,null,":……………………………………...",null,null,"Takım Kaptanı",null,null,":……………………………………..."]
["İmza",null,null,":……………………………………...",null,null,"İmza",null,null,":……………………………………..."]
[]
["TÜRKİYE",null,null,null,null,null,"TÜRKİYE"]
["MASA TENİSİ FEDERASYONU",null,null,null,null,null,"MASA TENİSİ FEDERASYONU"]
["TAKIM LİSTESİ",null,null,null,null,null,"TAKIM LİSTESİ"]
["Takım Adı",null,null,":",null,null,"Takım Adı",null,null,":"]
["Karşılaşacağı Takım",null,null,":",null,null,"Karşılaşacağı Takım",null,null,":"]
["A",null,": ………………………………..…………………..……….……….",null,null,null,"X",null,": ………………………………..…………………..……….………."]
["B",null,": ………………………………..…………………..……….……….",null,null,null,"Y",null,": ………………………………..…………………..……….………."]
["C",null,": ………………………………..…………………..……….……….",null,null,null,"Z",null,": ………………………………..…………………..……….………."]
["Çift",null,": ………………………………..…………………..……….……….",null,null,null,"Çift",null,": ………………………………..…………………..……….………."]
[null,null,": ………………………………..…………………..……….……….",null,null,null,null,null,": ………………………………..…………………..……….………."]
["Karşılaşma Tarihi",null,null,":……………………………………...",null,null,"Karşılaşma Tarihi",null,null,":……………………………………..."]
["Takım Kaptanı",null,null,":……………………………………...",null,null,"Takım Kaptanı",null,null,":……………………………………..."]
["İmza",null,null,":……………………………………...",null,null,"İmza",null,null,":……………………………………..."]
[]
["TÜRKİYE",null,null,null,null,null,"TÜRKİYE"]
["MASA TENİSİ FEDERASYONU",null,null,null,null,null,"MASA TENİSİ FEDERASYONU"]
["TAKIM LİSTESİ",null,null,null,null,null,"TAKIM LİSTESİ"]
["Takım Adı",null,null,":",null,null,"Takım Adı",null,null,":"]
["Karşılaşacağı Takım",null,null,":",null,null,"Karşılaşacağı Takım",null,null,":"]
["A",null,": ………………………………..…………………..……….……….",null,null,null,"X",null,": ………………………………..…………………..……….………."]
["B",null,": ………………………………..…………………..……….……….",null,null,null,"Y",null,": ………………………………..…………………..……….………."]
["C",null,": ………………………………..…………………..……….……….",null,null,null,"Z",null,": ………………………………..…………………..……….………."]
["Çift",null,": ………………………………..…………………..……….……….",null,null,null,"Çift",null,": ………………………………..…………………..……….………."]
[null,null,": ………………………………..…………………..……….……….",null,null,null,null,null,": ………………………………..…………………..……….………."]
["Karşılaşma Tarihi",null,null,":……………………………………...",null,null,"Karşılaşma Tarihi",null,null,":……………………………………..."]
["Takım Kaptanı",null,null,":……………………………………...",null,null,"Takım Kaptanı",null,null,":……………………………………..."]
["İmza",null,null,":……………………………………...",null,null,"İmza",null,null,":……………………………………..."]