{"text_format":"1","workbook":"xlsx","n_sheets":6,"sheets":["Sablon","Katılım","On_Eleme","Eleme","Ana Tablo","SIRALAMA"],"not_rendered":{"charts":0,"images":8,"macros":1,"external_links":0,"defined_names":5,"comments":0,"pivot_tables":0},"unopened":[],"bounds":{"document_bytes":16777216,"sheet_cells":100000,"rows_first":2000,"rows_last":500,"rows_between":2000,"halvings":0,"cell_chars":16384,"cell_head_chars":4096},"cells_cut":0,"cells_raw":0,"read":"whole","date_system":"1900"}

{"sheet":"Sablon","index":0,"n_rows":385,"n_cols":125,"rows_kept":385,"cut":false,"hidden":true,"merged":[[1,31,1,34],[1,1,1,4],[1,7,1,10],[1,13,1,16],[1,19,1,22],[1,25,1,28]]}
[null,"Template",null,null,null,null,null,null,null,null,null,null,null,null,null,null,null,null,null,null,null,null,null,null,null,null,null,null,null,null,null,null,null,null,null,null,null,null,null,null,null,null,null,null,null,null,null,null,null,null,null,null,null,null,null,null,null,null,null,null,null,null,null,null,null,null,null,null,null,null,null,null,null,null,null,null,"Y","S","B","Q",null,"Y","S","B","Q",null,"Y","S","B","Q",null,"Y","S","B","Q",null,"Y","S","B","Q",null,"Y","S","B","Q",null,null,null,null,null,256,128,64,32,16,8,null,null,null,256,128,64,32,16,8]
[null,256,null,null,null,null,null,128,null,null,null,null,null,64,null,null,null,null,null,32,null,null,null,null,null,16,null,null,null,null,null,8,null,null,null,null,null,null,null,null,null,null,null,null,null,null,null,null,null,null,null,null,null,null,null,null,null,null,null,null,null,null,null,null,null,null,null,null,null,null,null,null,null,null,null,null,null,1,null,null,1,null,1,0,0,1,null,1,0," ",1,null,1,0,0,1,null,1,0,0,1,null,1,0,0,1,null,null,null,1,null,84,38,24,9,6,null,null,"E1",171,75,22,14,5,3]
[null,"Y","S","B","Q",null,null,"Y","S","B","Q",null,null,"Y","S","B","Q",null,null,"Y",8,"B","Q",null,null,"Y","S","B","Q",null,null,"Y","S","B","Q",null,null,null,null,null,null,null,null,null,null,null,null,null,null,null,null,null,null,null,null,null,null,null,null,null,null,null,null,null,null,null,null,null,null,null,null,null,null,null,null,null,null,null,null,null,null,null,null,null,null,null,null,null,null,null,null,null,null,null,null,null,null,null,null,null,null,null,null,null,null,null,null,null,null,null,null,null,null,null,17,9,null,null,"E2",229,76,21,12,6,4]
[null,1,1,null,null,1,null,1,1,null,null,1,null,1,1,null," ",1,null,1,1,null,null,1,null,1,1,null,null,1,null,1,1,null,null,1,null,null,null,null,null,null,null,null,null,null,null,null,null,null,null,null,null,null,null,null,null,null,null,null,null,null,null,null,null,null,null,null,null,null,null,null,null,null,null,null,null,129,999,"",256,null,65,1,"E64",128,null,33,1,"E32",64,null,17,1,"E16",32,null,9,1,"E8",16,null,5,1,"E4",8,null,null,null,null,null,105,65,33,null,null,null,null,"E3",87,74,23,10,7,2]
[null,2,129,999,null,256,null,2,65,1,64,128,null,2,33,1,32,64,null,2,17,1,16,32,null,2,9,1,8,16,null,2,5,1,4,8,null,null,null,null,null,null,null,null,null,null,null,null,null,null,null,null,null,null,null,null,null,null,null,null,null,null,null,null,null,null,null,null,null,null,null,null,null,null,null,null,null,129,999,"",128,null,65,33,"E32",64,null,33,17,"E16",48,null,17,9,"E8",16,null,9,5,"E4",12,null,5,3,"E2",5,null,null,null,2,null,null,null,null,10,5,null,null,"E4",169,73,24,9,8,1]
[null,3,129,999,null,128,null,3,65,33,32,64,null,3,33,17,16,48,null,3,17,9,8,16,null,3,9,5,4,12,null,3,5,3,2,5,null,null,null,null,null,null,null,null,null,null,null,null,null,null,null,null,null,null,null,null,null,null,null,null,null,null,null,null,null,null,null,null,null,null,null,null,null,null,null,null,null,null,null,"",null,null,null,null,"",null,null,null,null,"",null,null,null,null,"",null,null,null,null,"",null,null,null,null,null,null,null,null,null,null,null,null,null,null,18,10,null,null,"E5",83,78,19,11,3]
[null,4,65,999,null,129,null,4,33,null,null,65,null,4,17,null," ",32,null,4,9,null,null,17,null,4,5,null,null,8,null,4,3,null,null,4,null,null,null,null,null,null,null,null,null,null,null,null,null,null,null,null,null,null,null,null,null,null,null,null,null,null,null,null,null,null,null,null,null,null,null,null,null,null,null,null,null,65,999,"",129,null,33,0,"",65,null,17,0,"",32,null,9,0,"",17,null,5,0,"",8,null,3,0,0,4,null,null,null,null,null,61,37,23,null,null,null,null,"E6",173,77,20,13,4]
[null,5,65,999,null,65,null,5,33,null,null,32,null,5,17,null," ",17,null,5,9,null,null,9,null,5,5,null,null,6,null,5,3,null,null,3,null,null,null,null,null,null,null,null,null,null,null,null,null,null,null,null,null,null,null,null,null,null,null,null,null,null,null,null,null,null,null,null,null,null,null,null,null,null,null,null,null,65,999,"",65,null,33,0,"",32,null,17,0,"",17,null,9,0,"",9,null,5,0,"",6,null,3,0,0,3,null,null,null,3,null,null,null,null,11,7,null,null,"E7",175,79,18,15,2]
[null,6,129,999,null,192,null,6,65,49,16,97,null,6,33,25,8,33,null,6,17,13,4,24,null,6,9,7,2,10,null,6,5,null,1,6,null,null,null,null,null,null,null,null,null,null,null,null,null,null,null,null,null,null,null,null,null,null,null,null,null,null,null,null,null,null,null,null,null,null,null,null,null,null,null,null,null,null,null,"",null,null,null,null,"",null,null,null,null,"",null,null,null,null,"",null,null,null,null,"",null,null,null,null,null,null,null,null,null,null,null,106,66,34,19,11,null,null,"E8",81,80,17,16,1]
[null,7,129,999,null,64,null,7,65,17,48,33,null,7,33,9,24,49,null,7,17,5,12,25,null,7,9,3,6,14,null,7,5,2,3,7,null,null,null,null,null,null,null,null,null,null,null,null,null,null,null,null,null,null,null,null,null,null,null,null,null,null,null,null,null,null,null,null,null,null,null,null,null,null,null,null,null,129,999,"",192,null,65,49,"E16",97,null,33,25,"E8",33,null,17,13,"E4",24,null,9,7,"E2",10,null,5,0,"E1",6,null,null,null,null,null,null,null,null,null,null,null,null,"E9",91,27,27,6]
[null,8,64,999,null,193,null,8,17,null,null,96,null,8,9," "," ",16,null,8,5,null,null,8,null,8,3,null,null,4,null,8,2,null,null,2,null,null,null,null,null,null,null,null,null,null,null,null,null,null,null,null,null,null,null,null,null,null,null,null,null,null,null,null,null,null,null,null,null,null,null,null,null,null,null,null,null,129,999,"",64,null,65,17,"E48",33,null,33,9,"E24",49,null,17,5,"E12",25,null,9,3,"E6",14,null,5,2,"E3",7,null,null,null,4,null,null,null,null,12,8,null,null,"E10",165,28,28,5]
[null,9,49,null,null,33,null,9,17,null,null,16,null,9,9,null," ",9,null,9,5,null,null,5,null,9,3,null,null,3,null,null,null,null,null,null,null,null,null,null,null,null,null,null,null,null,null,null,null,null,null,null,null,null,null,null,null,null,null,null,null,null,null,null,null,null,null,null,null,null,null,null,null,null,null,null,null,null,null,"",null,null,null,null,"",null,null,null,null,"",null,null,null,null,"",null,null,null,null,"",null,null,null,null,null,null,null,null,null,null,null,93,39,22,20,12,null,null,"E11",167,26,26,7]
[null,10,129,49,null,224,null,10,65,25,40,113,null,10,33,13,20,56,null,10,17,7,10,28,null,10,9,4,5,13,null,null,null,null,null,null,null,null,null,null,null,null,null,null,null,null,null,null,null,null,null,null,null,null,null,null,null,null,null,null,null,null,null,null,null,null,null,null,null,null,null,null,null,null,null,null,null,64,999,"",193,null,17,0,"",96,null,9," ","",16,null,5,0,"",8,null,3,0,"",4,null,2,0,0,2,null,null,null,null,null,null,null,null,null,null,null,null,"E12",109,25,25,8]
[null,11,129,null,null,96,null,11,65,57,8,49,null,11,33,29,4,40,null,11,17,15,2,20,null,11,9,null,1,9,null,null,null,null,null,null,null,null,null,null,null,null,null,null,null,null,null,null,null,null,null,null,null,null,null,null,null,null,null,null,null,null,null,null,null,null,null,null,null,null,null,null,null,null,null,null,null,49,null,"",33,null,17,0,"",16,null,9,0,"",9,null,5,0,"",5,null,3,0,"",3,null,null,null,null,null,null,null,null,5,null,107,67,35,13,null,null,null,"E13",163,30,30,3]
[null,12,65,null,null,161,null,12,33,null,null,80,null,12,17,null," ",24,null,12,9,null,null,12,null,12,5,null,null,5,null,"Y","Fikstür yerleri",null,null,null,null,null,null,null,null,null,null,null,null,null,null,null,null,null,null,null,null,null,null,null,null,null,null,null,null,null,null,null,null,null,null,null,null,null,null,null,null,null,null,null,null,null,null,"",null,null,null,null,"",null,null,null,null,"",null,null,null,null,"",null,null,null,null,"",null,null,null,null,null,null,null,null,null,null,null,null,null,null,21,null,null,null,"E14",93,29,29,4]
[null,13,65,null,null,97,null,13,33,null,null,17,null,13,17,null," ",25,null,13,9,null,null,13,null,13,5,null,null,7,null,"S","Derece yerleri",null,null,null,null,null,null,null,null,null,null,null,null,null,null,null,null,null,null,null,null,null,null,null,null,null,null,null,null,null,null,null,null,null,null,null,null,null,null,null,null,null,null,null,null,129,49,"",224,null,65,25,"E40",113,null,33,13,"E20",56,null,17,7,"E10",28,null,9,4,"E5",13,null,null,null,null,null,null,null,null,null,null,null,null,null,null,null,null,null,"E15",95,31,31,2]
[null,14,129,null,null,160,null,14,65,41,24,112,null,14,33,21,12,41,null,14,17,11,6,21,null,14,9,6,3,11,null,"B","Bay yerleri",null,null,null,null,null,null,null,null,null,null,null,null,null,null,null,null,null,null,null,null,null,null,null,null,null,null,null,null,null,null,null,null,null,null,null,null,null,null,null,null,null,null,null,null,129,null,"",96,null,65,57,"E8",49,null,33,29,"E4",40,null,17,15,"E2",20,null,9,0,"E1",9,null,null,null,null,null,null,null,null,6,null,52,40,21,14,null,null,null,"E16",85,32,32,1]
[null,15,129,32,29,32,null,15,65,9,56,48,null,15,33,5,28,57,null,15,17,3,14,29,null,15,9,2,7,15,null,"Q","Ön Eleme yeri",null,null,null,null,null,null,null,null,null,null,null,null,null,null,null,null,null,null,null,null,null,null,null,null,null,null,null,null,null,null,null,null,null,null,null,null,null,null,null,null,null,null,null,null,null,null,"",null,null,null,null,"",null,null,null,null,"",null,null,null,null,"",null,null,null,null,"",null,null,null,null,null,null,null,null,null,null,null,null,null,null,22,null,null,null,"E17",75,22,11]
[null,16,32,null,null,225,null,16,9,null,null,81,null,16,5," "," ",8,null,16,3,null,null,4,null,16,2,null,null,2,null,null,null,null,null,null,null,null,null,null,null,null,null,null,null,null,null,null,null,null,null,null,null,null,null,null,null,null,null,null,null,null,null,null,null,null,null,null,null,null,null,null,null,null,null,null,null,65,null,"",161,null,33,0,"",80,null,17,0,"",24,null,9,0,"",12,null,5,0,"",5,null,null,null,null,null,null,null,null,null,null,108,68,36,null,null,null,null,"E18",181,21,12]
[null,17,17,null,null,17,null,17,9,null,null,88,null,17,5,null," ",5,null,17,3,null,null,3,null,null,null,null,null,null,null,null,null,null,null,null,null,null,null,null,null,null,null,null,null,null,null,null,null,null,null,null,null,null,null,null,null,null,null,null,null,null,null,null,null,null,null,null,null,null,null,null,null,null,null,null,null,65,null,"",97,null,33,0,"",17,null,17,0,"",25,null,9,0,"",13,null,5,0,"",7,null,null,null,null,null,null,null,null,7,null,null,null,null,15,null,null,null,"E19",183,23,10]
[null,18,129,17,null,240,null,18,65,13,52,41,null,18,33,7,26,60,null,18,17,4,13,30,null,null,null,null,null,null,null,null,null,null,null,null,null,null,null,null,null,null,null,null,null,null,null,null,null,null,null,null,null,null,null,null,null,null,null,null,null,null,null,null,null,null,null,null,null,null,null,null,null,null,null,null,null,null,null,"",null,null,null,null,"",null,null,null,null,"",null,null,null,null,"",null,null,null,null,"",null,null,null,null,null,null,null,null,null,null,null,null,null,null,23,null,null,null,"E20",73,24,9]
[null,19,129,null,null,112,null,19,65,45,20,105,null,19,33,23,10,44,null,19,17,12,5,22,null,null,null,null,null,null,null,null,null,null,null,null,null,null,null,null,null,null,null,null,null,null,null,null,null,null,null,null,null,null,null,null,null,null,null,null,null,null,null,null,null,null,null,null,null,null,null,null,null,null,null,null,null,129,null,"",160,null,65,41,"E24",112,null,33,21,"E12",41,null,17,11,"E6",21,null,9,6,"E3",11,null,null,null,null,null,null,null,null,null,null,77,35,20,null,null,null,null,"E21",179,19,14]
[null,20,65,null,null,145,null,20,33,null,null,24,null,20,17,null," ",28,null,20,9,null,null,11,null,null,null,null,null,null,null,null,null,null,null,null,null,null,null,null,null,null,null,null,null,null,null,null,null,null,null,null,null,null,null,null,null,null,null,null,null,null,null,null,null,null,null,null,null,null,null,null,null,null,null,null,null,129,32,"E29",32,null,65,9,"E56",48,null,33,5,"E28",57,null,17,3,"E14",29,null,9,2,"E7",15,null,null,null,null,null,null,null,null,8,null,null,null,null,16,null,null,null,"E22",77,20,13]
[null,21,65,null,null,81,null,21,33,null,null,73,null,21,17,null," ",21,null,21,9,null,null,14,null,null,null,null,null,null,null,null,null,null,null,null,null,null,null,null,null,null,null,null,null,null,null,null,null,null,null,null,null,null,null,null,null,null,null,null,null,null,null,null,null,null,null,null,null,null,null,null,null,null,null,null,null,null,null,"",null,null,null,null,"",null,null,null,null,"",null,null,null,null,"",null,null,null,null,null,null,null,null,null,null,null,null,null,null,null,null,109,69,37,24,null,null,null,"E23",79,18,15]
[null,22,129,null,8,176,null,22,65,61,4,56,null,22,33,31,2,37,null,22,17,null,1,19,null,null,null,null,null,null,null,null,null,null,null,null,null,null,null,null,null,null,null,null,null,null,null,null,null,null,null,null,null,null,null,null,null,null,null,null,null,null,null,null,null,null,null,null,null,null,null,null,null,null,null,null,null,32,null,"",225,null,9,0,"",81,null,5," ","",8,null,3,0,"",4,null,2,0,0,2,null,null,null,null,null,null,null,null,null,null,null,null,null,null,null,null,null,"E24",177,17,16]
[null,23,129,48,null,48,null,23,65,29,36,120,null,23,33,15,18,53,null,23,17,8,9,27,null,null,null,null,null,null,null,null,null,null,null,null,null,null,null,null,null,null,null,null,null,null,null,null,null,null,null,null,null,null,null,null,null,null,null,null,null,null,null,null,null,null,null,null,null,null,null,null,null,null,null,null,null,17,null,"",17,null,9,0,"",88,null,5,0,"",5,null,3,0,"",3,null,null,null,null,null,null,null,null,null,null,null,null,null,9,null,null,null,null,null,null,null,null,"E25",103,70,6]
[null,24,48,null,null,209,null,24,17,null,null,9,null,24,9," "," ",12,null,24,5,null,null,6,null,null,null,null,null,null,null,null,null,null,null,null,null,null,null,null,null,null,null,null,null,null,null,null,null,null,null,null,null,null,null,null,null,null,null,null,null,null,null,null,null,null,null,null,null,null,null,null,null,null,null,null,null,null,null,"",null,null,null,null,"",null,null,null,null,"",null,null,null,null,"",null,null,null,null,null,null,null,null,null,null,null,null,null,null,null,null,68,36,19,null,null,null,null,"E26",89,69,5]
[null,25,33,null,null,49,null,25,17,null,null,89,null,25,9,null," ",13,null,25,5,null,null,7,null,null,null,null,null,null,null,null,null,null,null,null,null,null,null,null,null,null,null,null,null,null,null,null,null,null,null,null,null,null,null,null,null,null,null,null,null,null,null,null,null,null,null,null,null,null,null,null,null,null,null,null,null,129,17,"",240,null,65,13,"E52",41,null,33,7,"E26",60,null,17,4,"E13",30,null,null,null,null,null,null,null,null,null,null,null,null,null,null,null,null,null,null,null,null,null,null,"E27",141,71,7]
[null,26,129,33,null,208,null,26,65,21,44,40,null,26,33,11,22,52,null,26,17,6,11,26,null,null,null,null,null,null,null,null,null,null,null,null,null,null,null,null,null,null,null,null,null,null,null,null,null,null,null,null,null,null,null,null,null,null,null,null,null,null,null,null,null,null,null,null,null,null,null,null,null,null,null,null,null,129,null,"",112,null,65,45,"E20",105,null,33,23,"E10",44,null,17,12,"E5",22,null,null,null,null,null,null,null,null,null,null,null,null,null,10,null,110,70,38,null,null,null,null,"E28",227,72,8]
[null,27,129,null,24,80,null,27,65,53,12,104,null,27,33,27,6,36,null,27,17,14,3,18,null,null,null,null,null,null,null,null,null,null,null,null,null,null,null,null,null,null,null,null,null,null,null,null,null,null,null,null,null,null,null,null,null,null,null,null,null,null,null,null,null,null,null,null,null,null,null,null,null,null,null,null,null,null,null,"",null,null,null,null,"",null,null,null,null,"",null,null,null,null,"",null,null,null,null,null,null,null,null,null,null,null,null,null,null,null,null,null,null,null,null,null,null,null,"E29",225,67,3]
[null,28,65,null,null,177,null,28,33,null,null,25,null,28,17,null," ",20,null,28,9,null,null,10,null,null,null,null,null,null,null,null,null,null,null,null,null,null,null,null,null,null,null,null,null,null,null,null,null,null,null,null,null,null,null,null,null,null,null,null,null,null,null,null,null,null,null,null,null,null,null,null,null,null,null,null,null,65,null,"",145,null,33,0,"",24,null,17,0,"",28,null,9,0,"",11,null,null,null,null,null,null,null,null,null,null,null,null,null,null,null,null,null,null,null,null,null,null,"E30",21,68,4]
[null,29,65,null,null,113,null,29,33,null,null,72,null,29,17,null," ",29,null,29,9,null,null,15,null,null,null,null,null,null,null,null,null,null,null,null,null,null,null,null,null,null,null,null,null,null,null,null,null,null,null,null,null,null,null,null,null,null,null,null,null,null,null,null,null,null,null,null,null,null,null,null,null,null,null,null,null,65,null,"",81,null,33,0,"",73,null,17,0,"",21,null,9,0,"",14,null,null,null,null,null,null,null,null,null,null,null,null,null,11,null,100,34,18,null,null,null,null,"E31",115,66,2]
[null,30,129,null,null,144,null,30,65,37,28,57,null,30,33,19,14,45,null,30,17,10,7,23,null,null,null,null,null,null,null,null,null,null,null,null,null,null,null,null,null,null,null,null,null,null,null,null,null,null,null,null,null,null,null,null,null,null,null,null,null,null,null,null,null,null,null,null,null,null,null,null,null,null,null,null,null,null,null,"",null,null,null,null,"",null,null,null,null,"",null,null,null,null,"",null,null,null,null,null,null,null,null,null,null,null,null,null,null,null,null,null,null,null,null,null,null,null,"E32",143,65,1]
[null,31,129,16,null,16,null,31,65,5,60,121,null,31,33,3,30,61,null,31,17,2,15,31,null,null,null,null,null,null,null,null,null,null,null,null,null,null,null,null,null,null,null,null,null,null,null,null,null,null,null,null,null,null,null,null,null,null,null,null,null,null,null,null,null,null,null,null,null,null,null,null,null,null,null,null,null,129,null,"E8",176,null,65,61,"E4",56,null,33,31,"E2",37,null,17,0,"E1",19,null,null,null,null,null,null,null,null,null,null,null,null,null,null,null,111,71,39,null,null,null,null,"E33",null,11]
[null,32,16,null,null,241,null,32,5,null,null,8,null,32,3," "," ",4,null,32,2,null,null,2,null,null,null,null,null,null,null,null,null,null,null,null,null,null,null,null,null,null,null,null,null,null,null,null,null,null,null,null,null,null,null,null,null,null,null,null,null,null,null,null,null,null,null,null,null,null,null,null,null,null,null,null,null,129,48,"",48,null,65,29,"E36",120,null,33,15,"E18",53,null,17,8,"E9",27,null,null,null,null,null,null,null,null,null,null,null,null,null,12,null,null,null,null,null,null,null,null,"E34",null,12]
[null,33,9,null,null,9,null,33,5,null,null,5,null,33,3,null," ",3,null,null,null,null,null,null,null,null,null,null,null,null,null,null,null,null,null,null,null,null,null,null,null,null,null,null,null,null,null,null,null,null,null,null,null,null,null,null,null,null,null,null,null,null,null,null,null,null,null,null,null,null,null,null,null,null,null,null,null,null,null,"",null,null,null,null,"",null,null,null,null,"",null,null,null,null,"",null,null,null,null,null,null,null,null,null,null,null,null,null,null,null,null,null,null,null,null,null,null,null,"E35",null,10]
[null,34,129,9,null,248,null,34,65,7,58,124,null,34,33,4,29,62,null,null,null,null,null,null,null,null,null,null,null,null,null,null,null,null,null,null,null,null,null,null,null,null,null,null,null,null,null,null,null,null,null,null,null,null,null,null,null,null,null,null,null,null,null,null,null,null,null,null,null,null,null,null,null,null,null,null,null,48,null,"",209,null,17,0,"",9,null,9," ","",12,null,5,0,"",6,null,null,null,null,null,null,null,null,null,null,null,null,null,null,null,45,33,17,null,null,null,null,"E36",null,9]
[null,35,129,null,null,120,null,35,65,39,26,60,null,35,33,20,13,46,null,null,null,null,null,null,null,null,null,null,null,null,null,null,null,null,null,null,null,null,null,null,null,null,null,null,null,null,null,null,null,null,null,null,null,null,null,null,null,null,null,null,null,null,null,null,null,null,null,null,null,null,null,null,null,null,null,null,null,33,null,"",49,null,17,0,"",89,null,9,0,"",13,null,5,0,"",7,null,null,null,null,null,null,null,null,null,null,null,null,null,13,null,null,null,null,null,null,null,null,"E37",null,14]
[null,36,65,null,null,137,null,36,33,null,null,69,null,36,17,null," ",30,null,null,null,null,null,null,null,null,null,null,null,null,null,null,null,null,null,null,null,null,null,null,null,null,null,null,null,null,null,null,null,null,null,null,null,null,null,null,null,null,null,null,null,null,null,null,null,null,null,null,null,null,null,null,null,null,null,null,null,null,null,"",null,null,null,null,"",null,null,null,null,"",null,null,null,null,"",null,null,null,null,null,null,null,null,null,null,null,null,null,null,null,null,112,72,40,null,null,null,null,"E38",null,13]
[null,37,65,null,null,73,null,37,33,null,null,28,null,37,17,null," ",19,null,null,null,null,null,null,null,null,null,null,null,null,null,null,null,null,null,null,null,null,null,null,null,null,null,null,null,null,null,null,null,null,null,null,null,null,null,null,null,null,null,null,null,null,null,null,null,null,null,null,null,null,null,null,null,null,null,null,null,129,33,"",208,null,65,21,"E44",40,null,33,11,"E22",52,null,17,6,"E11",26,null,null,null,null,null,null,null,null,null,null,null,null,null,null,null,null,null,null,null,null,null,null,"E39",null,15]
[null,38,129,null,20,184,null,38,65,55,10,101,null,38,33,28,5,35,null,null,null,null,null,null,null,null,null,null,null,null,null,null,null,null,null,null,null,null,null,null,null,null,null,null,null,null,null,null,null,null,null,null,null,null,null,null,null,null,null,null,null,null,null,null,null,null,null,null,null,null,null,null,null,null,null,null,null,129,null,"E24",80,null,65,53,"E12",104,null,33,27,"E6",36,null,17,14,"E3",18,null,null,null,null,null,null,null,null,null,null,null,null,null,14,null,null,null,null,null,null,null,null,"E40",null,16]
[null,39,129,40,null,56,null,39,65,23,42,37,null,39,33,12,21,51,null,null,null,null,null,null,null,null,null,null,null,null,null,null,null,null,null,null,null,null,null,null,null,null,null,null,null,null,null,null,null,null,null,null,null,null,null,null,null,null,null,null,null,null,null,null,null,null,null,null,null,null,null,null,null,null,null,null,null,null,null,"",null,null,null,null,"",null,null,null,null,"",null,null,null,null,"",null,null,null,null,null,null,null,null,null,null,null,null,null,null,null,null,87,43,16,null,null,null,null,"E41",null,91]
[null,40,40,null,null,201,null,40,17,null,null,92,null,40,9," "," ",14,null,null,null,null,null,null,null,null,null,null,null,null,null,null,null,null,null,null,null,null,null,null,null,null,null,null,null,null,null,null,null,null,null,null,null,null,null,null,null,null,null,null,null,null,null,null,null,null,null,null,null,null,null,null,null,null,null,null,null,65,null,"",177,null,33,0,"",25,null,17,0,"",20,null,9,0,"",10,null,null,null,null,null,null,null,null,null,null,null,null,null,null,null,null,null,null,null,null,null,null,"E42",null,92]
[null,41,41,null,null,41,null,41,17,null,null,12,null,41,9,null," ",11,null,null,null,null,null,null,null,null,null,null,null,null,null,null,null,null,null,null,null,null,null,null,null,null,null,null,null,null,null,null,null,null,null,null,null,null,null,null,null,null,null,null,null,null,null,null,null,null,null,null,null,null,null,null,null,null,null,null,null,65,null,"",113,null,33,0,"",72,null,17,0,"",29,null,9,0,"",15,null,null,null,null,null,null,null,null,null,null,null,null,null,15,null,113,73,41,null,null,null,null,"E43",null,90]
[null,42,129,41,null,216,null,42,65,31,34,117,null,42,33,16,17,54,null,null,null,null,null,null,null,null,null,null,null,null,null,null,null,null,null,null,null,null,null,null,null,null,null,null,null,null,null,null,null,null,null,null,null,null,null,null,null,null,null,null,null,null,null,null,null,null,null,null,null,null,null,null,null,null,null,null,null,null,null,"",null,null,null,null,"",null,null,null,null,"",null,null,null,null,"",null,null,null,null,null,null,null,null,null,null,null,null,null,null,null,null,null,null,null,null,null,null,null,"E44",null,89]
[null,43,129,null,4,88,null,43,65,63,2,53,null,43,33,null,1,38,null,null,null,null,null,null,null,null,null,null,null,null,null,null,null,null,null,null,null,null,null,null,null,null,null,null,null,null,null,null,null,null,null,null,null,null,null,null,null,null,null,null,null,null,null,null,null,null,null,null,null,null,null,null,null,null,null,null,null,129,null,"",144,null,65,37,"E28",57,null,33,19,"E14",45,null,17,10,"E7",23,null,null,null,null,null,null,null,null,null,null,null,null,null,null,null,null,null,null,null,null,null,null,"E45",null,94]
[null,44,65,null,null,169,null,44,33,null,null,76,null,44,17,null," ",22,null,null,null,null,null,null,null,null,null,null,null,null,null,null,null,null,null,null,null,null,null,null,null,null,null,null,null,null,null,null,null,null,null,null,null,null,null,null,null,null,null,null,null,null,null,null,null,null,null,null,null,null,null,null,null,null,null,null,null,129,16,"",16,null,65,5,"E60",121,null,33,3,"E30",61,null,17,2,"E15",31,null,null,null,null,null,null,null,null,null,null,null,null,null,16,null,58,44,15,null,null,null,null,"E46",null,93]
[null,45,65,null,null,105,null,45,33,null,null,21,null,45,17,null," ",27,null,null,null,null,null,null,null,null,null,null,null,null,null,null,null,null,null,null,null,null,null,null,null,null,null,null,null,null,null,null,null,null,null,null,null,null,null,null,null,null,null,null,null,null,null,null,null,null,null,null,null,null,null,null,null,null,null,null,null,null,null,"",null,null,null,null,"",null,null,null,null,"",null,null,null,null,null,null,null,null,null,null,null,null,null,null,null,null,null,null,null,null,null,null,null,null,null,null,null,null,"E47",null,95]
[null,46,129,null,null,152,null,46,65,47,18,108,null,46,33,24,9,43,null,null,null,null,null,null,null,null,null,null,null,null,null,null,null,null,null,null,null,null,null,null,null,null,null,null,null,null,null,null,null,null,null,null,null,null,null,null,null,null,null,null,null,null,null,null,null,null,null,null,null,null,null,null,null,null,null,null,null,16,null,"",241,null,5,0,"",8,null,3," ","",4,null,2,0,0,2,null,null,null,null,null,null,null,null,null,null,null,null,null,null,null,114,74,42,null,null,null,null,"E48",null,96]
[null,47,129,24,null,24,null,47,65,15,50,44,null,47,33,8,25,59,null,null,null,null,null,null,null,null,null,null,null,null,null,null,null,null,null,null,null,null,null,null,null,null,null,null,null,null,null,null,null,null,null,null,null,null,null,null,null,null,null,null,null,null,null,null,null,null,null,null,null,null,null,null,null,null,null,null,null,9,null,"",9,null,5,0,"",5,null,3,0,"",3,null,null,null,null,null,null,null,null,null,null,null,null,null,null,null,null,null,null,17,null,null,null,null,null,null,null,null,"E49",null,86]
[null,48,24,null,null,233,null,48,9,null,null,85,null,48,5," "," ",6,null,null,null,null,null,null,null,null,null,null,null,null,null,null,null,null,null,null,null,null,null,null,null,null,null,null,null,null,null,null,null,null,null,null,null,null,null,null,null,null,null,null,null,null,null,null,null,null,null,null,null,null,null,null,null,null,null,null,null,null,null,"",null,null,null,null,"",null,null,null,null,"",null,null,null,null,null,null,null,null,null,null,null,null,null,null,null,null,null,null,null,null,null,null,null,null,null,null,null,null,"E50",null,85]
[null,49,25,null,null,25,null,49,9,null,null,84,null,49,5,null," ",7,null,null,null,null,null,null,null,null,null,null,null,null,null,null,null,null,null,null,null,null,null,null,null,null,null,null,null,null,null,null,null,null,null,null,null,null,null,null,null,null,null,null,null,null,null,null,null,null,null,null,null,null,null,null,null,null,null,null,null,129,9,"",248,null,65,7,"E58",124,null,33,4,"E29",62,null,null,null,null,null,null,null,null,null,null,null,null,null,null,null,null,null,null,null,null,90,42,14,null,null,null,null,"E51",null,87]
[null,50,129,25,null,232,null,50,65,11,54,45,null,50,33,6,27,58,null,null,null,null,null,null,null,null,null,null,null,null,null,null,null,null,null,null,null,null,null,null,null,null,null,null,null,null,null,null,null,null,null,null,null,null,null,null,null,null,null,null,null,null,null,null,null,null,null,null,null,null,null,null,null,null,null,null,null,129,null,"",120,null,65,39,"E26",60,null,33,20,"E13",46,null,null,null,null,null,null,null,null,null,null,null,null,null,null,null,null,null,null,18,null,null,null,null,null,null,null,null,"E52",null,88]
[null,51,129,null,null,104,null,51,65,43,22,109,null,51,33,22,11,42,null,null,null,null,null,null,null,null,null,null,null,null,null,null,null,null,null,null,null,null,null,null,null,null,null,null,null,null,null,null,null,null,null,null,null,null,null,null,null,null,null,null,null,null,null,null,null,null,null,null,null,null,null,null,null,null,null,null,null,null,null,"",null,null,null,null,"",null,null,null,null,"",null,null,null,null,null,null,null,null,null,null,null,null,null,null,null,null,null,null,null,null,null,115,75,43,null,null,null,null,"E53",null,83]
[null,52,65,null,null,153,null,52,33,null,null,20,null,52,17,null," ",26,null,null,null,null,null,null,null,null,null,null,null,null,null,null,null,null,null,null,null,null,null,null,null,null,null,null,null,null,null,null,null,null,null,null,null,null,null,null,null,null,null,null,null,null,null,null,null,null,null,null,null,null,null,null,null,null,null,null,null,65,null,"",137,null,33,0,"",69,null,17,0,"",30,null,null,null,null,null,null,null,null,null,null,null,null,null,null,null,null,null,null,null,null,null,null,null,null,null,null,null,"E54",null,84]
[null,53,65,null,null,89,null,53,33,null,null,77,null,53,17,null," ",23,null,null,null,null,null,null,null,null,null,null,null,null,null,null,null,null,null,null,null,null,null,null,null,null,null,null,null,null,null,null,null,null,null,null,null,null,null,null,null,null,null,null,null,null,null,null,null,null,null,null,null,null,null,null,null,null,null,null,null,65,null,"",73,null,33,0,"",28,null,17,0,"",19,null,null,null,null,null,null,null,null,null,null,null,null,null,null,null,null,null,null,19,null,null,null,null,null,null,null,null,"E55",null,82]
[null,54,129,null,26,168,null,54,65,59,6,52,null,54,33,14,3,39,null,null,null,null,null,null,null,null,null,null,null,null,null,null,null,null,null,null,null,null,null,null,null,null,null,null,null,null,null,null,null,null,null,null,null,null,null,null,null,null,null,null,null,null,null,null,null,null,null,null,null,null,null,null,null,null,null,null,null,null,null,"",null,null,null,null,"",null,null,null,null,"",null,null,null,null,null,null,null,null,null,null,null,null,null,null,null,null,null,null,null,null,null,55,41,13,null,null,null,null,"E56",null,81]
[null,55,129,56,null,40,null,55,65,27,38,116,null,55,33,8,19,55,null,null,null,null,null,null,null,null,null,null,null,null,null,null,null,null,null,null,null,null,null,null,null,null,null,null,null,null,null,null,null,null,null,null,null,null,null,null,null,null,null,null,null,null,null,null,null,null,null,null,null,null,null,null,null,null,null,null,null,129,null,"E20",184,null,65,55,"E10",101,null,33,28,"E5",35,null,null,null,null,null,null,null,null,null,null,null,null,null,null,null,null,null,null,null,null,null,null,null,null,null,null,null,"E57",null,6]
[null,56,56,null,null,217,null,56,17,null,null,13,null,56,9," "," ",10,null,null,null,null,null,null,null,null,null,null,null,null,null,null,null,null,null,null,null,null,null,null,null,null,null,null,null,null,null,null,null,null,null,null,null,null,null,null,null,null,null,null,null,null,null,null,null,null,null,null,null,null,null,null,null,null,null,null,null,129,40,"",56,null,65,23,"E42",37,null,33,12,"E21",51,null,null,null,null,null,null,null,null,null,null,null,null,null,null,null,null,null,null,20,null,116,76,44,null,null,null,null,"E58",null,5]
[null,57,57,999,null,57,null,57,17,null,null,93,null,57,9,null," ",15,null,null,null,null,null,null,null,null,null,null,null,null,null,null,null,null,null,null,null,null,null,null,null,null,null,null,null,null,null,null,null,null,null,null,null,null,null,null,null,null,null,null,null,null,null,null,null,null,null,null,null,null,null,null,null,null,null,null,null,null,null,"",null,null,null,null,"",null,null,null,null,"",null,null,null,null,null,null,null,null,null,null,null,null,null,null,null,null,null,null,null,null,null,null,null,null,null,null,null,null,"E59",null,7]
[null,58,129,999,null,200,null,58,65,19,46,36,null,58,33,10,23,50,null,null,null,null,null,null,null,null,null,null,null,null,null,null,null,null,null,null,null,null,null,null,null,null,null,null,null,null,null,null,null,null,null,null,null,null,null,null,null,null,null,null,null,null,null,null,null,null,null,null,null,null,null,null,null,null,null,null,null,40,null,"",201,null,17,0,"",92,null,9," ","",14,null,null,null,null,null,null,null,null,null,null,null,null,null,null,null,null,null,null,null,null,null,null,null,null,null,null,null,"E60",null,8]
[null,59,129,999,null,72,null,59,65,51,14,100,null,59,33,26,7,34,null,null,null,null,null,null,null,null,null,null,null,null,null,null,null,null,null,null,null,null,null,null,null,null,null,null,null,null,null,null,null,null,null,null,null,null,null,null,null,null,null,null,null,null,null,null,null,null,null,null,null,null,null,null,null,null,null,null,null,41,null,"",41,null,17,0,"",12,null,9,0,"",11,null,null,null,null,null,null,null,null,null,null,null,null,null,null,null,null,null,null,21,null,74,46,12,null,null,null,null,"E61",null,3]
[null,60,65,999,null,185,null,60,33,null,null,29,null,60,17,null," ",18,null,null,null,null,null,null,null,null,null,null,null,null,null,null,null,null,null,null,null,null,null,null,null,null,null,null,null,null,null,null,null,null,null,null,null,null,null,null,null,null,null,null,null,null,null,null,null,null,null,null,null,null,null,null,null,null,null,null,null,null,null,"",null,null,null,null,"",null,null,null,null,"",null,null,null,null,null,null,null,null,null,null,null,null,null,null,null,null,null,null,null,null,null,null,null,null,null,null,null,null,"E62",null,4]
[null,61,65,999,null,121,null,61,33,null,null,68,null,61,17,null," ",31,null,null,null,null,null,null,null,null,null,null,null,null,null,null,null,null,null,null,null,null,null,null,null,null,null,null,null,null,null,null,null,null,null,null,null,null,null,null,null,null,null,null,null,null,null,null,null,null,null,null,null,null,null,null,null,null,null,null,null,129,41,"",216,null,65,31,"E34",117,null,33,16,"E17",54,null,null,null,null,null,null,null,null,null,null,null,null,null,null,null,null,null,null,null,null,117,77,45,null,null,null,null,"E63",null,2]
[null,62,129,999,null,136,null,62,65,35,30,61,null,62,33,18,15,47,null,null,null,null,null,null,null,null,null,null,null,null,null,null,null,null,null,null,null,null,null,null,null,null,null,null,null,null,null,null,null,null,null,null,null,null,null,null,null,null,null,null,null,null,null,null,null,null,null,null,null,null,null,null,null,null,null,null,null,129,null,"E4",88,null,65,63,"E2",53,null,33,0,"E1",38,null,null,null,null,null,null,null,null,null,null,null,null,null,null,null,null,null,null,22,null,null,null,null,null,null,null,null,"E64",null,1]
[null,63,129,999,null,249,null,63,65,3,62,125,null,63,33,2,31,63,null,null,null,null,null,null,null,null,null,null,null,null,null,null,null,null,null,null,null,null,null,null,null,null,null,null,null,null,null,null,null,null,null,null,null,null,null,null,null,null,null,null,null,null,null,null,null,null,null,null,null,null,null,null,null,null,null,null,null,null,null,"",null,null,null,null,"",null,null,null,null,""]
[null,64,8,null,null,8,null,64,3,null,null,4,null,64,2," "," ",2,null,null,null,null,null,null,null,null,null,null,null,null,null,null,null,null,null,null,null,null,null,null,null,null,null,null,null,null,null,null,null,null,null,null,null,null,null,null,null,null,null,null,null,null,null,null,null,null,null,null,null,null,null,null,null,null,null,null,null,65,null,"",169,null,33,0,"",76,null,17,0,"",22,null,null,null,null,null,null,null,null,null,null,null,null,null,null,null,null,null,null,null,null,71,45,11]
[null,65,5,null,null,5,null,65,3,null,null,3,null,null,null,null,null,null,null,null,null,null,null,null,null,null,null,null,null,null,null,null,null,null,null,null,null,null,null,null,null,null,null,null,null,null,null,null,null,null,null,null,null,null,null,null,null,null,null,null,null,null,null,null,null,null,null,null,null,null,null,null,null,null,null,null,null,65,null,"",105,null,33,0,"",21,null,17,0,"",27,null,null,null,null,null,null,null,null,null,null,null,null,null,null,null,null,null,null,23]
[null,66,129,999,null,252,null,66,65,4,61,126,null,null,null,null,null,null,null,null,null,null,null,null,null,null,null,null,null,null,null,null,null,null,null,null,null,null,null,null,null,null,null,null,null,null,null,null,null,null,null,null,null,null,null,null,null,null,null,null,null,null,null,null,null,null,null,null,null,null,null,null,null,null,null,null,null,null,null,"",null,null,null,null,"",null,null,null,null,"",null,null,null,null,null,null,null,null,null,null,null,null,null,null,null,null,null,null,null,null,null,118,78,46]
[null,67,129,999,null,124,null,67,65,36,29,62,null,null,null,null,null,null,null,null,null,null,null,null,null,null,null,null,null,null,null,null,null,null,null,null,null,null,null,null,null,null,null,null,null,null,null,null,null,null,null,null,null,null,null,null,null,null,null,null,null,null,null,null,null,null,null,null,null,null,null,null,null,null,null,null,null,129,null,"",152,null,65,47,"E18",108,null,33,24,"E9",43]
[null,68,65,999,null,133,null,68,33,null,null,67,null,null,null,null,null,null,null,null,null,null,null,null,null,null,null,null,null,null,null,null,null,null,null,null,null,null,null,null,null,null,null,null,null,null,null,null,null,null,null,null,null,null,null,null,null,null,null,null,null,null,null,null,null,null,null,null,null,null,null,null,null,null,null,null,null,129,24,"",24,null,65,15,"E50",44,null,33,8,"E25",59,null,null,null,null,null,null,null,null,null,null,null,null,null,null,null,null,null,null,24]
[null,69,65,999,null,69,null,69,33,null,null,30,null,null,null,null,null,null,null,null,null,null,null,null,null,null,null,null,null,null,null,null,null,null,null,null,null,null,null,null,null,null,null,null,null,null,null,null,null,null,null,null,null,null,null,null,null,null,null,null,null,null,null,null,null,null,null,null,null,null,null,null,null,null,null,null,null,null,null,"",null,null,null,null,"",null,null,null,null,"",null,null,null,null,null,null,null,null,null,null,null,null,null,null,null,null,null,null,null,null,null,103,47,10]
[null,70,129,999,null,188,null,70,65,52,13,99,null,null,null,null,null,null,null,null,null,null,null,null,null,null,null,null,null,null,null,null,null,null,null,null,null,null,null,null,null,null,null,null,null,null,null,null,null,null,null,null,null,null,null,null,null,null,null,null,null,null,null,null,null,null,null,null,null,null,null,null,null,null,null,null,null,24,null,"",233,null,9,0,"",85,null,5," ","",6]
[null,71,129,999,null,60,null,71,65,20,45,35,null,null,null,null,null,null,null,null,null,null,null,null,null,null,null,null,null,null,null,null,null,null,null,null,null,null,null,null,null,null,null,null,null,null,null,null,null,null,null,null,null,null,null,null,null,null,null,null,null,null,null,null,null,null,null,null,null,null,null,null,null,null,null,null,null,25,null,"",25,null,9,0,"",84,null,5,0,"",7,null,null,null,null,null,null,null,null,null,null,null,null,null,null,null,null,null,null,25,null,119,79,47]
[null,72,60,999,null,197,null,72,17,null,null,94,null,null,null,null,null,null,null,null,null,null,null,null,null,null,null,null,null,null,null,null,null,null,null,null,null,null,null,null,null,null,null,null,null,null,null,null,null,null,null,null,null,null,null,null,null,null,null,null,null,null,null,null,null,null,null,null,null,null,null,null,null,null,null,null,null,null,null,"",null,null,null,null,"",null,null,null,null,""]
[null,73,53,null,null,37,null,73,17,null,null,14,null,null,null,null,null,null,null,null,null,null,null,null,null,null,null,null,null,null,null,null,null,null,null,null,null,null,null,null,null,null,null,null,null,null,null,null,null,null,null,null,null,null,null,null,null,null,null,null,null,null,null,null,null,null,null,null,null,null,null,null,null,null,null,null,null,129,25,"",232,null,65,11,"E54",45,null,33,6,"E27",58]
[null,74,129,53,null,220,null,74,65,28,37,115,null,null,null,null,null,null,null,null,null,null,null,null,null,null,null,null,null,null,null,null,null,null,null,null,null,null,null,null,null,null,null,null,null,null,null,null,null,null,null,null,null,null,null,null,null,null,null,null,null,null,null,null,null,null,null,null,null,null,null,null,null,null,null,null,null,129,null,"",104,null,65,43,"E22",109,null,33,22,"E11",42,null,null,null,null,null,null,null,null,null,null,null,null,null,null,null,null,null,null,26,null,42,48,9]
[null,75,129,null,10,92,null,75,65,60,5,51,null,null,null,null,null,null,null,null,null,null,null,null,null,null,null,null,null,null,null,null,null,null,null,null,null,null,null,null,null,null,null,null,null,null,null,null,null,null,null,null,null,null,null,null,null,null,null,null,null,null,null,null,null,null,null,null,null,null,null,null,null,null,null,null,null,null,null,"",null,null,null,null,"",null,null,null,null,""]
[null,76,65,null,null,165,null,76,33,null,null,78,null,null,null,null,null,null,null,null,null,null,null,null,null,null,null,null,null,null,null,null,null,null,null,null,null,null,null,null,null,null,null,null,null,null,null,null,null,null,null,null,null,null,null,null,null,null,null,null,null,null,null,null,null,null,null,null,null,null,null,null,null,null,null,null,null,65,null,"",153,null,33,0,"",20,null,17,0,"",26,null,null,null,null,null,null,null,null,null,null,null,null,null,null,null,null,null,null,null,null,120,80,48]
[null,77,65,null,null,101,null,77,33,null,null,19,null,null,null,null,null,null,null,null,null,null,null,null,null,null,null,null,null,null,null,null,null,null,null,null,null,null,null,null,null,null,null,null,null,null,null,null,null,null,null,null,null,null,null,null,null,null,null,null,null,null,null,null,null,null,null,null,null,null,null,null,null,null,null,null,null,65,null,"",89,null,33,0,"",77,null,17,0,"",23,null,null,null,null,null,null,null,null,null,null,null,null,null,null,null,null,null,null,27]
[null,78,129,null,null,156,null,78,65,44,21,110,null,null,null,null,null,null,null,null,null,null,null,null,null,null,null,null,null,null,null,null,null,null,null,null,null,null,null,null,null,null,null,null,null,null,null,null,null,null,null,null,null,null,null,null,null,null,null,null,null,null,null,null,null,null,null,null,null,null,null,null,null,null,null,null,null,null,null,"",null,null,null,null,"",null,null,null,null,""]
[null,79,129,28,2,28,null,79,65,12,53,46,null,null,null,null,null,null,null,null,null,null,null,null,null,null,null,null,null,null,null,null,null,null,null,null,null,null,null,null,null,null,null,null,null,null,null,null,null,null,null,null,null,null,null,null,null,null,null,null,null,null,null,null,null,null,null,null,null,null,null,null,null,null,null,null,null,129,null,"E26",168,null,65,59,"E6",52,null,33,14,"E3",39,null,null,null,null,null,null,null,null,null,null,null,null,null,null,null,null,null,null,null,null,82,54]
[null,80,28,null,null,229,null,80,9,null,null,83,null,null,null,null,null,null,null,null,null,null,null,null,null,null,null,null,null,null,null,null,null,null,null,null,null,null,null,null,null,null,null,null,null,null,null,null,null,null,null,null,null,null,null,null,null,null,null,null,null,null,null,null,null,null,null,null,null,null,null,null,null,null,null,null,null,129,56,"",40,null,65,27,"E38",116,null,33,8,"E19",55,null,null,null,null,null,null,null,null,null,null,null,null,null,null,null,null,null,null,28]
[null,81,21,null,null,21,null,81,9,null,null,86,null,null,null,null,null,null,null,null,null,null,null,null,null,null,null,null,null,null,null,null,null,null,null,null,null,null,null,null,null,null,null,null,null,null,null,null,null,null,null,null,null,null,null,null,null,null,null,null,null,null,null,null,null,null,null,null,null,null,null,null,null,null,null,null,null,null,null,"",null,null,null,null,"",null,null,null,null,"",null,null,null,null,null,null,null,null,null,null,null,null,null,null,null,null,null,null,null,null,null,121,81]
[null,82,129,21,30,236,null,82,65,16,49,43,null,null,null,null,null,null,null,null,null,null,null,null,null,null,null,null,null,null,null,null,null,null,null,null,null,null,null,null,null,null,null,null,null,null,null,null,null,null,null,null,null,null,null,null,null,null,null,null,null,null,null,null,null,null,null,null,null,null,null,null,null,null,null,null,null,56,null,"",217,null,17,0,"",13,null,9," ","",10]
[null,83,129,null,null,108,null,83,65,48,17,107,null,null,null,null,null,null,null,null,null,null,null,null,null,null,null,null,null,null,null,null,null,null,null,null,null,null,null,null,null,null,null,null,null,null,null,null,null,null,null,null,null,null,null,null,null,null,null,null,null,null,null,null,null,null,null,null,null,null,null,null,null,null,null,null,null,57,999,"",57,null,17,0,"",93,null,9,0,"",15,null,null,null,null,null,null,null,null,null,null,null,null,null,null,null,null,null,null,29]
[null,84,65,null,null,149,null,84,33,null,null,22,null,null,null,null,null,null,null,null,null,null,null,null,null,null,null,null,null,null,null,null,null,null,null,null,null,null,null,null,null,null,null,null,null,null,null,null,null,null,null,null,null,null,null,null,null,null,null,null,null,null,null,null,null,null,null,null,null,null,null,null,null,null,null,null,null,null,null,"",null,null,null,null,"",null,null,null,null,"",null,null,null,null,null,null,null,null,null,null,null,null,null,null,null,null,null,null,null,null,null,63,53]
[null,85,65,null,null,85,null,85,33,null,null,75,null,null,null,null,null,null,null,null,null,null,null,null,null,null,null,null,null,null,null,null,null,null,null,null,null,null,null,null,null,null,null,null,null,null,null,null,null,null,null,null,null,null,null,null,null,null,null,null,null,null,null,null,null,null,null,null,null,null,null,null,null,null,null,null,null,129,999,"",200,null,65,19,"E46",36,null,33,10,"E23",50]
[null,86,129,null,16,172,null,86,65,64,1,54,null,null,null,null,null,null,null,null,null,null,null,null,null,null,null,null,null,null,null,null,null,null,null,null,null,null,null,null,null,null,null,null,null,null,null,null,null,null,null,null,null,null,null,null,null,null,null,null,null,null,null,null,null,null,null,null,null,null,null,null,null,null,null,null,null,129,999,"",72,null,65,51,"E14",100,null,33,26,"E7",34,null,null,null,null,null,null,null,null,null,null,null,null,null,null,null,null,null,null,30,null,122,82]
[null,87,129,44,null,44,null,87,65,32,33,118,null,null,null,null,null,null,null,null,null,null,null,null,null,null,null,null,null,null,null,null,null,null,null,null,null,null,null,null,null,null,null,null,null,null,null,null,null,null,null,null,null,null,null,null,null,null,null,null,null,null,null,null,null,null,null,null,null,null,null,null,null,null,null,null,null,null,null,"",null,null,null,null,"",null,null,null,null,""]
[null,88,44,null,null,213,null,88,17,null,null,11,null,null,null,null,null,null,null,null,null,null,null,null,null,null,null,null,null,null,null,null,null,null,null,null,null,null,null,null,null,null,null,null,null,null,null,null,null,null,null,null,null,null,null,null,null,null,null,null,null,null,null,null,null,null,null,null,null,null,null,null,null,null,null,null,null,65,999,"",185,null,33,0,"",29,null,17,0,"",18]
[null,89,37,null,null,53,null,89,17,null,null,91,null,null,null,null,null,null,null,null,null,null,null,null,null,null,null,null,null,null,null,null,null,null,null,null,null,null,null,null,null,null,null,null,null,null,null,null,null,null,null,null,null,null,null,null,null,null,null,null,null,null,null,null,null,null,null,null,null,null,null,null,null,null,null,null,null,65,999,"",121,null,33,0,"",68,null,17,0,"",31,null,null,null,null,null,null,null,null,null,null,null,null,null,null,null,null,null,null,31,null,95,55]
[null,90,129,37,null,204,null,90,65,24,41,38,null,null,null,null,null,null,null,null,null,null,null,null,null,null,null,null,null,null,null,null,null,null,null,null,null,null,null,null,null,null,null,null,null,null,null,null,null,null,null,null,null,null,null,null,null,null,null,null,null,null,null,null,null,null,null,null,null,null,null,null,null,null,null,null,null,null,null,"",null,null,null,null,"",null,null,null,null,""]
[null,91,129,null,18,76,null,91,65,56,9,102,null,null,null,null,null,null,null,null,null,null,null,null,null,null,null,null,null,null,null,null,null,null,null,null,null,null,null,null,null,null,null,null,null,null,null,null,null,null,null,null,null,null,null,null,null,null,null,null,null,null,null,null,null,null,null,null,null,null,null,null,null,null,null,null,null,129,999,"",136,null,65,35,"E30",61,null,33,18,"E15",47,null,null,null,null,null,null,null,null,null,null,null,null,null,null,null,null,null,null,null,null,123,83]
[null,92,65,null,null,181,null,92,33,null,null,27,null,null,null,null,null,null,null,null,null,null,null,null,null,null,null,null,null,null,null,null,null,null,null,null,null,null,null,null,null,null,null,null,null,null,null,null,null,null,null,null,null,null,null,null,null,null,null,null,null,null,null,null,null,null,null,null,null,null,null,null,null,null,null,null,null,129,999,"",249,null,65,3,"E62",125,null,33,2,"E31",63,null,null,null,null,null,null,null,null,null,null,null,null,null,null,null,null,null,null,32]
[null,93,65,null,null,117,null,93,33,null,null,70,null,null,null,null,null,null,null,null,null,null,null,null,null,null,null,null,null,null,null,null,null,null,null,null,null,null,null,null,null,null,null,null,null,null,null,null,null,null,null,null,null,null,null,null,null,null,null,null,null,null,null,null,null,null,null,null,null,null,null,null,null,null,null,null,null,null,null,"",null,null,null,null,""]
[null,94,129,null,null,140,null,94,65,40,25,59,null,null,null,null,null,null,null,null,null,null,null,null,null,null,null,null,null,null,null,null,null,null,null,null,null,null,null,null,null,null,null,null,null,null,null,null,null,null,null,null,null,null,null,null,null,null,null,null,null,null,null,null,null,null,null,null,null,null,null,null,null,null,null,null,null,8,null,"",8,null,3,0,"",4,null,2," "," ",2,null,null,null,null,null,null,null,null,null,null,null,null,null,null,null,null,null,null,null,null,50,56]
[null,95,129,12,null,12,null,95,65,8,57,123,null,null,null,null,null,null,null,null,null,null,null,null,null,null,null,null,null,null,null,null,null,null,null,null,null,null,null,null,null,null,null,null,null,null,null,null,null,null,null,null,null,null,null,null,null,null,null,null,null,null,null,null,null,null,null,null,null,null,null,null,null,null,null,null,null,5,null,"",5,null,3,0,"",3,null,null,null,null,null,null,null,null,null,null,null,null,null,null,null,null,null,null,null,null,null,null,null,33]
[null,96,12,null,null,245,null,96,5,null,null,6,null,null,null,null,null,null,null,null,null,null,null,null,null,null,null,null,null,null,null,null,null,null,null,null,null,null,null,null,null,null,null,null,null,null,null,null,null,null,null,null,null,null,null,null,null,null,null,null,null,null,null,null,null,null,null,null,null,null,null,null,null,null,null,null,null,null,null,"",null,null,null,null,"",null,null,null,null,null,null,null,null,null,null,null,null,null,null,null,null,null,null,null,null,null,null,null,null,null,null,124,84]
[null,97,13,null,null,13,null,97,5,null,null,7,null,null,null,null,null,null,null,null,null,null,null,null,null,null,null,null,null,null,null,null,null,null,null,null,null,null,null,null,null,null,null,null,null,null,null,null,null,null,null,null,null,null,null,null,null,null,null,null,null,null,null,null,null,null,null,null,null,null,null,null,null,null,null,null,null,129,999,"",252,null,65,4,"E61",126]
[null,98,129,13,null,244,null,98,65,6,59,122,null,null,null,null,null,null,null,null,null,null,null,null,null,null,null,null,null,null,null,null,null,null,null,null,null,null,null,null,null,null,null,null,null,null,null,null,null,null,null,null,null,null,null,null,null,null,null,null,null,null,null,null,null,null,null,null,null,null,null,null,null,null,null,null,null,129,999,"",124,null,65,36,"E29",62,null,null,null,null,null,null,null,null,null,null,null,null,null,null,null,null,null,null,null,null,null,null,null,34]
[null,99,129,null,27,116,null,99,65,38,27,58,null,null,null,null,null,null,null,null,null,null,null,null,null,null,null,null,null,null,null,null,null,null,null,null,null,null,null,null,null,null,null,null,null,null,null,null,null,null,null,null,null,null,null,null,null,null,null,null,null,null,null,null,null,null,null,null,null,null,null,null,null,null,null,null,null,null,null,"",null,null,null,null,"",null,null,null,null,null,null,null,null,null,null,null,null,null,null,null,null,null,null,null,null,null,null,null,null,null,null,79,51]
[null,100,65,null,null,141,null,100,33,null,null,71,null,null,null,null,null,null,null,null,null,null,null,null,null,null,null,null,null,null,null,null,null,null,null,null,null,null,null,null,null,null,null,null,null,null,null,null,null,null,null,null,null,null,null,null,null,null,null,null,null,null,null,null,null,null,null,null,null,null,null,null,null,null,null,null,null,65,999,"",133,null,33,0,"",67]
[null,101,65,null,null,77,null,101,33,null,null,26,null,null,null,null,null,null,null,null,null,null,null,null,null,null,null,null,null,null,null,null,null,null,null,null,null,null,null,null,null,null,null,null,null,null,null,null,null,null,null,null,null,null,null,null,null,null,null,null,null,null,null,null,null,null,null,null,null,null,null,null,null,null,null,null,null,65,999,"",69,null,33,0,"",30,null,null,null,null,null,null,null,null,null,null,null,null,null,null,null,null,null,null,null,null,null,null,null,35,null,125,85]
[null,102,129,null,22,180,null,102,65,54,11,103,null,null,null,null,null,null,null,null,null,null,null,null,null,null,null,null,null,null,null,null,null,null,null,null,null,null,null,null,null,null,null,null,null,null,null,null,null,null,null,null,null,null,null,null,null,null,null,null,null,null,null,null,null,null,null,null,null,null,null,null,null,null,null,null,null,null,null,"",null,null,null,null,""]
[null,103,129,36,null,52,null,103,65,22,43,39,null,null,null,null,null,null,null,null,null,null,null,null,null,null,null,null,null,null,null,null,null,null,null,null,null,null,null,null,null,null,null,null,null,null,null,null,null,null,null,null,null,null,null,null,null,null,null,null,null,null,null,null,null,null,null,null,null,null,null,null,null,null,null,null,null,129,999,"",188,null,65,52,"E13",99]
[null,104,36,null,null,205,null,104,17,null,null,90,null,null,null,null,null,null,null,null,null,null,null,null,null,null,null,null,null,null,null,null,null,null,null,null,null,null,null,null,null,null,null,null,null,null,null,null,null,null,null,null,null,null,null,null,null,null,null,null,null,null,null,null,null,null,null,null,null,null,null,null,null,null,null,null,null,129,999,"",60,null,65,20,"E45",35,null,null,null,null,null,null,null,null,null,null,null,null,null,null,null,null,null,null,null,null,null,null,null,36,null,66,52]
[null,105,45,null,null,45,null,105,17,null,null,10,null,null,null,null,null,null,null,null,null,null,null,null,null,null,null,null,null,null,null,null,null,null,null,null,null,null,null,null,null,null,null,null,null,null,null,null,null,null,null,null,null,null,null,null,null,null,null,null,null,null,null,null,null,null,null,null,null,null,null,null,null,null,null,null,null,null,null,"",null,null,null,null,""]
[null,106,129,45,null,212,null,106,65,30,35,119,null,null,null,null,null,null,null,null,null,null,null,null,null,null,null,null,null,null,null,null,null,null,null,null,null,null,null,null,null,null,null,null,null,null,null,null,null,null,null,null,null,null,null,null,null,null,null,null,null,null,null,null,null,null,null,null,null,null,null,null,null,null,null,null,null,60,999,"",197,null,17,0,"",94,null,null,null,null,null,null,null,null,null,null,null,null,null,null,null,null,null,null,null,null,null,null,null,null,null,126,86]
[null,107,129,null,6,84,null,107,65,62,3,55,null,null,null,null,null,null,null,null,null,null,null,null,null,null,null,null,null,null,null,null,null,null,null,null,null,null,null,null,null,null,null,null,null,null,null,null,null,null,null,null,null,null,null,null,null,null,null,null,null,null,null,null,null,null,null,null,null,null,null,null,null,null,null,null,null,53,null,"",37,null,17,0,"",14,null,null,null,null,null,null,null,null,null,null,null,null,null,null,null,null,null,null,null,null,null,null,null,37]
[null,108,65,null,null,173,null,108,33,null,null,74,null,null,null,null,null,null,null,null,null,null,null,null,null,null,null,null,null,null,null,null,null,null,null,null,null,null,null,null,null,null,null,null,null,null,null,null,null,null,null,null,null,null,null,null,null,null,null,null,null,null,null,null,null,null,null,null,null,null,null,null,null,null,null,null,null,null,null,"",null,null,null,null,""]
[null,109,65,null,null,109,null,109,33,null,null,23,null,null,null,null,null,null,null,null,null,null,null,null,null,null,null,null,null,null,null,null,null,null,null,null,null,null,null,null,null,null,null,null,null,null,null,null,null,null,null,null,null,null,null,null,null,null,null,null,null,null,null,null,null,null,null,null,null,null,null,null,null,null,null,null,null,129,53,"",220,null,65,28,"E37",115,null,null,null,null,null,null,null,null,null,null,null,null,null,null,null,null,null,null,null,null,null,null,null,null,null,98,50]
[null,110,129,null,12,148,null,110,65,46,19,106,null,null,null,null,null,null,null,null,null,null,null,null,null,null,null,null,null,null,null,null,null,null,null,null,null,null,null,null,null,null,null,null,null,null,null,null,null,null,null,null,null,null,null,null,null,null,null,null,null,null,null,null,null,null,null,null,null,null,null,null,null,null,null,null,null,129,null,"E10",92,null,65,60,"E5",51,null,null,null,null,null,null,null,null,null,null,null,null,null,null,null,null,null,null,null,null,null,null,null,38]
[null,111,129,20,null,20,null,111,65,14,51,42,null,null,null,null,null,null,null,null,null,null,null,null,null,null,null,null,null,null,null,null,null,null,null,null,null,null,null,null,null,null,null,null,null,null,null,null,null,null,null,null,null,null,null,null,null,null,null,null,null,null,null,null,null,null,null,null,null,null,null,null,null,null,null,null,null,null,null,"",null,null,null,null,"",null,null,null,null,null,null,null,null,null,null,null,null,null,null,null,null,null,null,null,null,null,null,null,null,null,null,127,87]
[null,112,20,null,null,237,null,112,9,null,null,87,null,null,null,null,null,null,null,null,null,null,null,null,null,null,null,null,null,null,null,null,null,null,null,null,null,null,null,null,null,null,null,null,null,null,null,null,null,null,null,null,null,null,null,null,null,null,null,null,null,null,null,null,null,null,null,null,null,null,null,null,null,null,null,null,null,65,null,"",165,null,33,0,"",78]
[null,113,29,null,null,29,null,113,9,null,null,82,null,null,null,null,null,null,null,null,null,null,null,null,null,null,null,null,null,null,null,null,null,null,null,null,null,null,null,null,null,null,null,null,null,null,null,null,null,null,null,null,null,null,null,null,null,null,null,null,null,null,null,null,null,null,null,null,null,null,null,null,null,null,null,null,null,65,null,"",101,null,33,0,"",19,null,null,null,null,null,null,null,null,null,null,null,null,null,null,null,null,null,null,null,null,null,null,null,39]
[null,114,129,29,null,228,null,114,65,10,55,47,null,null,null,null,null,null,null,null,null,null,null,null,null,null,null,null,null,null,null,null,null,null,null,null,null,null,null,null,null,null,null,null,null,null,null,null,null,null,null,null,null,null,null,null,null,null,null,null,null,null,null,null,null,null,null,null,null,null,null,null,null,null,null,null,null,null,null,"",null,null,null,null,"",null,null,null,null,null,null,null,null,null,null,null,null,null,null,null,null,null,null,null,null,null,null,null,null,null,null,47,49]
[null,115,129,null,null,100,null,115,65,42,23,111,null,null,null,null,null,null,null,null,null,null,null,null,null,null,null,null,null,null,null,null,null,null,null,null,null,null,null,null,null,null,null,null,null,null,null,null,null,null,null,null,null,null,null,null,null,null,null,null,null,null,null,null,null,null,null,null,null,null,null,null,null,null,null,null,null,129,null,"",156,null,65,44,"E21",110]
[null,116,65,null,null,157,null,116,33,null,null,18,null,null,null,null,null,null,null,null,null,null,null,null,null,null,null,null,null,null,null,null,null,null,null,null,null,null,null,null,null,null,null,null,null,null,null,null,null,null,null,null,null,null,null,null,null,null,null,null,null,null,null,null,null,null,null,null,null,null,null,null,null,null,null,null,null,129,28,"E2",28,null,65,12,"E53",46,null,null,null,null,null,null,null,null,null,null,null,null,null,null,null,null,null,null,null,null,null,null,null,40,null,128,88]
[null,117,65,null,null,93,null,117,33,null,null,79,null,null,null,null,null,null,null,null,null,null,null,null,null,null,null,null,null,null,null,null,null,null,null,null,null,null,null,null,null,null,null,null,null,null,null,null,null,null,null,null,null,null,null,null,null,null,null,null,null,null,null,null,null,null,null,null,null,null,null,null,null,null,null,null,null,null,null,"",null,null,null,null,""]
[null,118,129,null,14,164,null,118,65,58,7,50,null,null,null,null,null,null,null,null,null,null,null,null,null,null,null,null,null,null,null,null,null,null,null,null,null,null,null,null,null,null,null,null,null,null,null,null,null,null,null,null,null,null,null,null,null,null,null,null,null,null,null,null,null,null,null,null,null,null,null,null,null,null,null,null,null,28,null,"",229,null,9,0,"",83]
[null,119,129,52,null,36,null,119,65,26,39,114,null,null,null,null,null,null,null,null,null,null,null,null,null,null,null,null,null,null,null,null,null,null,null,null,null,null,null,null,null,null,null,null,null,null,null,null,null,null,null,null,null,null,null,null,null,null,null,null,null,null,null,null,null,null,null,null,null,null,null,null,null,null,null,null,null,21,null,"",21,null,9,0,"",86,null,null,null,null,null,null,null,null,null,null,null,null,null,null,null,null,null,null,null,null,null,null,null,41,null,91,59]
[null,120,52,null,null,221,null,120,17,null,null,15,null,null,null,null,null,null,null,null,null,null,null,null,null,null,null,null,null,null,null,null,null,null,null,null,null,null,null,null,null,null,null,null,null,null,null,null,null,null,null,null,null,null,null,null,null,null,null,null,null,null,null,null,null,null,null,null,null,null,null,null,null,null,null,null,null,null,null,"",null,null,null,null,""]
[null,121,61,999,null,61,null,121,17,null,null,95,null,null,null,null,null,null,null,null,null,null,null,null,null,null,null,null,null,null,null,null,null,null,null,null,null,null,null,null,null,null,null,null,null,null,null,null,null,null,null,null,null,null,null,null,null,null,null,null,null,null,null,null,null,null,null,null,null,null,null,null,null,null,null,null,null,129,21,"E30",236,null,65,16,"E49",43,null,null,null,null,null,null,null,null,null,null,null,null,null,null,null,null,null,null,null,null,null,null,null,null,null,129,89]
[null,122,129,999,null,196,null,122,65,18,47,34,null,null,null,null,null,null,null,null,null,null,null,null,null,null,null,null,null,null,null,null,null,null,null,null,null,null,null,null,null,null,null,null,null,null,null,null,null,null,null,null,null,null,null,null,null,null,null,null,null,null,null,null,null,null,null,null,null,null,null,null,null,null,null,null,null,129,null,"",108,null,65,48,"E17",107,null,null,null,null,null,null,null,null,null,null,null,null,null,null,null,null,null,null,null,null,null,null,null,42]
[null,123,129,999,null,68,null,123,65,50,15,98,null,null,null,null,null,null,null,null,null,null,null,null,null,null,null,null,null,null,null,null,null,null,null,null,null,null,null,null,null,null,null,null,null,null,null,null,null,null,null,null,null,null,null,null,null,null,null,null,null,null,null,null,null,null,null,null,null,null,null,null,null,null,null,null,null,null,null,"",null,null,null,null,""]
[null,124,65,999,null,189,null,124,33,null,null,31,null,null,null,null,null,null,null,null,null,null,null,null,null,null,null,null,null,null,null,null,null,null,null,null,null,null,null,null,null,null,null,null,null,null,null,null,null,null,null,null,null,null,null,null,null,null,null,null,null,null,null,null,null,null,null,null,null,null,null,null,null,null,null,null,null,65,null,"",149,null,33,0,"",22,null,null,null,null,null,null,null,null,null,null,null,null,null,null,null,null,null,null,null,null,null,null,null,null,null,54,60]
[null,125,65,999,null,125,null,125,33,null,null,66,null,null,null,null,null,null,null,null,null,null,null,null,null,null,null,null,null,null,null,null,null,null,null,null,null,null,null,null,null,null,null,null,null,null,null,null,null,null,null,null,null,null,null,null,null,null,null,null,null,null,null,null,null,null,null,null,null,null,null,null,null,null,null,null,null,65,null,"",85,null,33,0,"",75,null,null,null,null,null,null,null,null,null,null,null,null,null,null,null,null,null,null,null,null,null,null,null,43]
[null,126,129,999,null,132,null,126,65,34,31,63,null,null,null,null,null,null,null,null,null,null,null,null,null,null,null,null,null,null,null,null,null,null,null,null,null,null,null,null,null,null,null,null,null,null,null,null,null,null,null,null,null,null,null,null,null,null,null,null,null,null,null,null,null,null,null,null,null,null,null,null,null,null,null,null,null,null,null,"",null,null,null,null,"",null,null,null,null,null,null,null,null,null,null,null,null,null,null,null,null,null,null,null,null,null,null,null,null,null,null,130,90]
[null,127,129,999,null,253,null,127,65,2,63,127,null,null,null,null,null,null,null,null,null,null,null,null,null,null,null,null,null,null,null,null,null,null,null,null,null,null,null,null,null,null,null,null,null,null,null,null,null,null,null,null,null,null,null,null,null,null,null,null,null,null,null,null,null,null,null,null,null,null,null,null,null,null,null,null,null,129,null,"E16",172,null,65,64,"E1",54]
[null,128,4,null,null,4,null,128,2,null,null,2,null,null,null,null,null,null,null,null,null,null,null,null,null,null,null,null,null,null,null,null,null,null,null,null,null,null,null,null,null,null,null,null,null,null,null,null,null,null,null,null,null,null,null,null,null,null,null,null,null,null,null,null,null,null,null,null,null,null,null,null,null,null,null,null,null,129,44,"",44,null,65,32,"E33",118,null,null,null,null,null,null,null,null,null,null,null,null,null,null,null,null,null,null,null,null,null,null,null,44]
[null,129,3,null,null,3,null,null,null,null,null,null,null,null,null,null,null,null,null,null,null,null,null,null,null,null,null,null,null,null,null,null,null,null,null,null,null,null,null,null,null,null,null,null,null,null,null,null,null,null,null,null,null,null,null,null,null,null,null,null,null,null,null,null,null,null,null,null,null,null,null,null,null,null,null,null,null,null,null,"",null,null,null,null,"",null,null,null,null,null,null,null,null,null,null,null,null,null,null,null,null,null,null,null,null,null,null,null,null,null,null,65,58]
[null,130,129,999,null,254,null,null,null,null,null,null,null,null,null,null,null,null,null,null,null,null,null,null,null,null,null,null,null,null,null,null,null,null,null,null,null,null,null,null,null,null,null,null,null,null,null,null,null,null,null,null,null,null,null,null,null,null,null,null,null,null,null,null,null,null,null,null,null,null,null,null,null,null,null,null,null,44,null,"",213,null,17,0,"",11]
[null,131,129,999,null,126,null,null,null,null,null,null,null,null,null,null,null,null,null,null,null,null,null,null,null,null,null,null,null,null,null,null,null,null,null,null,null,null,null,null,null,null,null,null,null,null,null,null,null,null,null,null,null,null,null,null,null,null,null,null,null,null,null,null,null,null,null,null,null,null,null,null,null,null,null,null,null,37,null,"",53,null,17,0,"",91,null,null,null,null,null,null,null,null,null,null,null,null,null,null,null,null,null,null,null,null,null,null,null,45,null,131,91]
[null,132,65,999,null,131,null,null,null,null,null,null,null,null,null,null,null,null,null,null,null,null,null,null,null,null,null,null,null,null,null,null,null,null,null,null,null,null,null,null,null,null,null,null,null,null,null,null,null,null,null,null,null,null,null,null,null,null,null,null,null,null,null,null,null,null,null,null,null,null,null,null,null,null,null,null,null,null,null,"",null,null,null,null,""]
[null,133,65,999,null,67,null,null,null,null,null,null,null,null,null,null,null,null,null,null,null,null,null,null,null,null,null,null,null,null,null,null,null,null,null,null,null,null,null,null,null,null,null,null,null,null,null,null,null,null,null,null,null,null,null,null,null,null,null,null,null,null,null,null,null,null,null,null,null,null,null,null,null,null,null,null,null,129,37,"",204,null,65,24,"E41",38]
[null,134,129,999,null,190,null,null,null,null,null,null,null,null,null,null,null,null,null,null,null,null,null,null,null,null,null,null,null,null,null,null,null,null,null,null,null,null,null,null,null,null,null,null,null,null,null,null,null,null,null,null,null,null,null,null,null,null,null,null,null,null,null,null,null,null,null,null,null,null,null,null,null,null,null,null,null,129,null,"E18",76,null,65,56,"E9",102,null,null,null,null,null,null,null,null,null,null,null,null,null,null,null,null,null,null,null,null,null,null,null,46,null,76,57]
[null,135,129,999,null,62,null,null,null,null,null,null,null,null,null,null,null,null,null,null,null,null,null,null,null,null,null,null,null,null,null,null,null,null,null,null,null,null,null,null,null,null,null,null,null,null,null,null,null,null,null,null,null,null,null,null,null,null,null,null,null,null,null,null,null,null,null,null,null,null,null,null,null,null,null,null,null,null,null,"",null,null,null,null,""]
[null,136,62,999,null,195,null,null,null,null,null,null,null,null,null,null,null,null,null,null,null,null,null,null,null,null,null,null,null,null,null,null,null,null,null,null,null,null,null,null,null,null,null,null,null,null,null,null,null,null,null,null,null,null,null,null,null,null,null,null,null,null,null,null,null,null,null,null,null,null,null,null,null,null,null,null,null,65,null,"",181,null,33,0,"",27,null,null,null,null,null,null,null,null,null,null,null,null,null,null,null,null,null,null,null,null,null,null,null,null,null,132,92]
[null,137,51,null,null,35,null,null,null,null,null,null,null,null,null,null,null,null,null,null,null,null,null,null,null,null,null,null,null,null,null,null,null,null,null,null,null,null,null,null,null,null,null,null,null,null,null,null,null,null,null,null,null,null,null,null,null,null,null,null,null,null,null,null,null,null,null,null,null,null,null,null,null,null,null,null,null,65,null,"",117,null,33,0,"",70,null,null,null,null,null,null,null,null,null,null,null,null,null,null,null,null,null,null,null,null,null,null,null,47]
[null,138,129,51,null,222,null,null,null,null,null,null,null,null,null,null,null,null,null,null,null,null,null,null,null,null,null,null,null,null,null,null,null,null,null,null,null,null,null,null,null,null,null,null,null,null,null,null,null,null,null,null,null,null,null,null,null,null,null,null,null,null,null,null,null,null,null,null,null,null,null,null,null,null,null,null,null,null,null,"",null,null,null,null,""]
[null,139,129,null,13,94,null,null,null,null,null,null,null,null,null,null,null,null,null,null,null,null,null,null,null,null,null,null,null,null,null,null,null,null,null,null,null,null,null,null,null,null,null,null,null,null,null,null,null,null,null,null,null,null,null,null,null,null,null,null,null,null,null,null,null,null,null,null,null,null,null,null,null,null,null,null,null,129,null,"",140,null,65,40,"E25",59,null,null,null,null,null,null,null,null,null,null,null,null,null,null,null,null,null,null,null,null,null,null,null,null,null,43,62]
[null,140,65,null,null,163,null,null,null,null,null,null,null,null,null,null,null,null,null,null,null,null,null,null,null,null,null,null,null,null,null,null,null,null,null,null,null,null,null,null,null,null,null,null,null,null,null,null,null,null,null,null,null,null,null,null,null,null,null,null,null,null,null,null,null,null,null,null,null,null,null,null,null,null,null,null,null,129,12,"",12,null,65,8,"E57",123,null,null,null,null,null,null,null,null,null,null,null,null,null,null,null,null,null,null,null,null,null,null,null,48]
[null,141,65,null,null,99,null,null,null,null,null,null,null,null,null,null,null,null,null,null,null,null,null,null,null,null,null,null,null,null,null,null,null,null,null,null,null,null,null,null,null,null,null,null,null,null,null,null,null,null,null,null,null,null,null,null,null,null,null,null,null,null,null,null,null,null,null,null,null,null,null,null,null,null,null,null,null,null,null,"",null,null,null,null,"",null,null,null,null,null,null,null,null,null,null,null,null,null,null,null,null,null,null,null,null,null,null,null,null,null,null,133,93]
[null,142,129,null,null,158,null,null,null,null,null,null,null,null,null,null,null,null,null,null,null,null,null,null,null,null,null,null,null,null,null,null,null,null,null,null,null,null,null,null,null,null,null,null,null,null,null,null,null,null,null,null,null,null,null,null,null,null,null,null,null,null,null,null,null,null,null,null,null,null,null,null,null,null,null,null,null,12,null,"",245,null,5,0,"",6]
[null,143,129,30,28,30,null,null,null,null,null,null,null,null,null,null,null,null,null,null,null,null,null,null,null,null,null,null,null,null,null,null,null,null,null,null,null,null,null,null,null,null,null,null,null,null,null,null,null,null,null,null,null,null,null,null,null,null,null,null,null,null,null,null,null,null,null,null,null,null,null,null,null,null,null,null,null,13,null,"",13,null,5,0,"",7,null,null,null,null,null,null,null,null,null,null,null,null,null,null,null,null,null,null,null,null,null,null,null,49]
[null,144,30,null,null,227,null,null,null,null,null,null,null,null,null,null,null,null,null,null,null,null,null,null,null,null,null,null,null,null,null,null,null,null,null,null,null,null,null,null,null,null,null,null,null,null,null,null,null,null,null,null,null,null,null,null,null,null,null,null,null,null,null,null,null,null,null,null,null,null,null,null,null,null,null,null,null,null,null,"",null,null,null,null,"",null,null,null,null,null,null,null,null,null,null,null,null,null,null,null,null,null,null,null,null,null,null,null,null,null,null,60,61]
[null,145,19,null,null,19,null,null,null,null,null,null,null,null,null,null,null,null,null,null,null,null,null,null,null,null,null,null,null,null,null,null,null,null,null,null,null,null,null,null,null,null,null,null,null,null,null,null,null,null,null,null,null,null,null,null,null,null,null,null,null,null,null,null,null,null,null,null,null,null,null,null,null,null,null,null,null,129,13,"",244,null,65,6,"E59",122]
[null,146,129,19,null,238,null,null,null,null,null,null,null,null,null,null,null,null,null,null,null,null,null,null,null,null,null,null,null,null,null,null,null,null,null,null,null,null,null,null,null,null,null,null,null,null,null,null,null,null,null,null,null,null,null,null,null,null,null,null,null,null,null,null,null,null,null,null,null,null,null,null,null,null,null,null,null,129,null,"E27",116,null,65,38,"E27",58,null,null,null,null,null,null,null,null,null,null,null,null,null,null,null,null,null,null,null,null,null,null,null,50,null,134,94]
[null,147,129,null,null,110,null,null,null,null,null,null,null,null,null,null,null,null,null,null,null,null,null,null,null,null,null,null,null,null,null,null,null,null,null,null,null,null,null,null,null,null,null,null,null,null,null,null,null,null,null,null,null,null,null,null,null,null,null,null,null,null,null,null,null,null,null,null,null,null,null,null,null,null,null,null,null,null,null,"",null,null,null,null,""]
[null,148,65,null,null,147,null,null,null,null,null,null,null,null,null,null,null,null,null,null,null,null,null,null,null,null,null,null,null,null,null,null,null,null,null,null,null,null,null,null,null,null,null,null,null,null,null,null,null,null,null,null,null,null,null,null,null,null,null,null,null,null,null,null,null,null,null,null,null,null,null,null,null,null,null,null,null,65,null,"",141,null,33,0,"",71]
[null,149,65,null,null,83,null,null,null,null,null,null,null,null,null,null,null,null,null,null,null,null,null,null,null,null,null,null,null,null,null,null,null,null,null,null,null,null,null,null,null,null,null,null,null,null,null,null,null,null,null,null,null,null,null,null,null,null,null,null,null,null,null,null,null,null,null,null,null,null,null,null,null,null,null,null,null,65,null,"",77,null,33,0,"",26,null,null,null,null,null,null,null,null,null,null,null,null,null,null,null,null,null,null,null,null,null,null,null,51,null,80,63]
[null,150,129,null,5,174,null,null,null,null,null,null,null,null,null,null,null,null,null,null,null,null,null,null,null,null,null,null,null,null,null,null,null,null,null,null,null,null,null,null,null,null,null,null,null,null,null,null,null,null,null,null,null,null,null,null,null,null,null,null,null,null,null,null,null,null,null,null,null,null,null,null,null,null,null,null,null,null,null,"",null,null,null,null,""]
[null,151,129,46,null,46,null,null,null,null,null,null,null,null,null,null,null,null,null,null,null,null,null,null,null,null,null,null,null,null,null,null,null,null,null,null,null,null,null,null,null,null,null,null,null,null,null,null,null,null,null,null,null,null,null,null,null,null,null,null,null,null,null,null,null,null,null,null,null,null,null,null,null,null,null,null,null,129,null,"E22",180,null,65,54,"E11",103,null,null,null,null,null,null,null,null,null,null,null,null,null,null,null,null,null,null,null,null,null,null,null,null,null,135,95]
[null,152,46,null,null,211,null,null,null,null,null,null,null,null,null,null,null,null,null,null,null,null,null,null,null,null,null,null,null,null,null,null,null,null,null,null,null,null,null,null,null,null,null,null,null,null,null,null,null,null,null,null,null,null,null,null,null,null,null,null,null,null,null,null,null,null,null,null,null,null,null,null,null,null,null,null,null,129,36,"",52,null,65,22,"E43",39,null,null,null,null,null,null,null,null,null,null,null,null,null,null,null,null,null,null,null,null,null,null,null,52]
[null,153,35,null,null,51,null,null,null,null,null,null,null,null,null,null,null,null,null,null,null,null,null,null,null,null,null,null,null,null,null,null,null,null,null,null,null,null,null,null,null,null,null,null,null,null,null,null,null,null,null,null,null,null,null,null,null,null,null,null,null,null,null,null,null,null,null,null,null,null,null,null,null,null,null,null,null,null,null,"",null,null,null,null,""]
[null,154,129,35,null,206,null,null,null,null,null,null,null,null,null,null,null,null,null,null,null,null,null,null,null,null,null,null,null,null,null,null,null,null,null,null,null,null,null,null,null,null,null,null,null,null,null,null,null,null,null,null,null,null,null,null,null,null,null,null,null,null,null,null,null,null,null,null,null,null,null,null,null,null,null,null,null,36,null,"",205,null,17,0,"",90,null,null,null,null,null,null,null,null,null,null,null,null,null,null,null,null,null,null,null,null,null,null,null,null,null,97,64]
[null,155,129,null,21,78,null,null,null,null,null,null,null,null,null,null,null,null,null,null,null,null,null,null,null,null,null,null,null,null,null,null,null,null,null,null,null,null,null,null,null,null,null,null,null,null,null,null,null,null,null,null,null,null,null,null,null,null,null,null,null,null,null,null,null,null,null,null,null,null,null,null,null,null,null,null,null,45,null,"",45,null,17,0,"",10,null,null,null,null,null,null,null,null,null,null,null,null,null,null,null,null,null,null,null,null,null,null,null,53]
[null,156,65,null,null,179,null,null,null,null,null,null,null,null,null,null,null,null,null,null,null,null,null,null,null,null,null,null,null,null,null,null,null,null,null,null,null,null,null,null,null,null,null,null,null,null,null,null,null,null,null,null,null,null,null,null,null,null,null,null,null,null,null,null,null,null,null,null,null,null,null,null,null,null,null,null,null,null,null,"",null,null,null,null,"",null,null,null,null,null,null,null,null,null,null,null,null,null,null,null,null,null,null,null,null,null,null,null,null,null,null,136,96]
[null,157,65,null,null,115,null,null,null,null,null,null,null,null,null,null,null,null,null,null,null,null,null,null,null,null,null,null,null,null,null,null,null,null,null,null,null,null,null,null,null,null,null,null,null,null,null,null,null,null,null,null,null,null,null,null,null,null,null,null,null,null,null,null,null,null,null,null,null,null,null,null,null,null,null,null,null,129,45,"",212,null,65,30,"E35",119]
[null,158,129,null,31,142,null,null,null,null,null,null,null,null,null,null,null,null,null,null,null,null,null,null,null,null,null,null,null,null,null,null,null,null,null,null,null,null,null,null,null,null,null,null,null,null,null,null,null,null,null,null,null,null,null,null,null,null,null,null,null,null,null,null,null,null,null,null,null,null,null,null,null,null,null,null,null,129,null,"E6",84,null,65,62,"E3",55,null,null,null,null,null,null,null,null,null,null,null,null,null,null,null,null,null,null,null,null,null,null,null,54]
[null,159,129,14,null,14,null,null,null,null,null,null,null,null,null,null,null,null,null,null,null,null,null,null,null,null,null,null,null,null,null,null,null,null,null,null,null,null,null,null,null,null,null,null,null,null,null,null,null,null,null,null,null,null,null,null,null,null,null,null,null,null,null,null,null,null,null,null,null,null,null,null,null,null,null,null,null,null,null,"",null,null,null,null,"",null,null,null,null,null,null,null,null,null,null,null,null,null,null,null,null,null,null,null,null,null,null,null,null,null,null,102]
[null,160,14,null,null,243,null,null,null,null,null,null,null,null,null,null,null,null,null,null,null,null,null,null,null,null,null,null,null,null,null,null,null,null,null,null,null,null,null,null,null,null,null,null,null,null,null,null,null,null,null,null,null,null,null,null,null,null,null,null,null,null,null,null,null,null,null,null,null,null,null,null,null,null,null,null,null,65,null,"",173,null,33,0,"",74]
[null,161,11,null,null,11,null,null,null,null,null,null,null,null,null,null,null,null,null,null,null,null,null,null,null,null,null,null,null,null,null,null,null,null,null,null,null,null,null,null,null,null,null,null,null,null,null,null,null,null,null,null,null,null,null,null,null,null,null,null,null,null,null,null,null,null,null,null,null,null,null,null,null,null,null,null,null,65,null,"",109,null,33,0,"",23,null,null,null,null,null,null,null,null,null,null,null,null,null,null,null,null,null,null,null,null,null,null,null,55,null,137]
[null,162,129,11,null,246,null,null,null,null,null,null,null,null,null,null,null,null,null,null,null,null,null,null,null,null,null,null,null,null,null,null,null,null,null,null,null,null,null,null,null,null,null,null,null,null,null,null,null,null,null,null,null,null,null,null,null,null,null,null,null,null,null,null,null,null,null,null,null,null,null,null,null,null,null,null,null,null,null,"",null,null,null,null,""]
[null,163,129,null,null,118,null,null,null,null,null,null,null,null,null,null,null,null,null,null,null,null,null,null,null,null,null,null,null,null,null,null,null,null,null,null,null,null,null,null,null,null,null,null,null,null,null,null,null,null,null,null,null,null,null,null,null,null,null,null,null,null,null,null,null,null,null,null,null,null,null,null,null,null,null,null,null,129,null,"E12",148,null,65,46,"E19",106]
[null,164,65,null,null,139,null,null,null,null,null,null,null,null,null,null,null,null,null,null,null,null,null,null,null,null,null,null,null,null,null,null,null,null,null,null,null,null,null,null,null,null,null,null,null,null,null,null,null,null,null,null,null,null,null,null,null,null,null,null,null,null,null,null,null,null,null,null,null,null,null,null,null,null,null,null,null,129,20,"",20,null,65,14,"E51",42,null,null,null,null,null,null,null,null,null,null,null,null,null,null,null,null,null,null,null,null,null,null,null,56,null,64]
[null,165,65,null,null,75,null,null,null,null,null,null,null,null,null,null,null,null,null,null,null,null,null,null,null,null,null,null,null,null,null,null,null,null,null,null,null,null,null,null,null,null,null,null,null,null,null,null,null,null,null,null,null,null,null,null,null,null,null,null,null,null,null,null,null,null,null,null,null,null,null,null,null,null,null,null,null,null,null,"",null,null,null,null,""]
[null,166,129,null,17,182,null,null,null,null,null,null,null,null,null,null,null,null,null,null,null,null,null,null,null,null,null,null,null,null,null,null,null,null,null,null,null,null,null,null,null,null,null,null,null,null,null,null,null,null,null,null,null,null,null,null,null,null,null,null,null,null,null,null,null,null,null,null,null,null,null,null,null,null,null,null,null,20,null,"",237,null,9,0,"",87,null,null,null,null,null,null,null,null,null,null,null,null,null,null,null,null,null,null,null,null,null,null,null,null,null,138]
[null,167,129,38,null,54,null,null,null,null,null,null,null,null,null,null,null,null,null,null,null,null,null,null,null,null,null,null,null,null,null,null,null,null,null,null,null,null,null,null,null,null,null,null,null,null,null,null,null,null,null,null,null,null,null,null,null,null,null,null,null,null,null,null,null,null,null,null,null,null,null,null,null,null,null,null,null,29,null,"",29,null,9,0,"",82,null,null,null,null,null,null,null,null,null,null,null,null,null,null,null,null,null,null,null,null,null,null,null,57]
[null,168,38,null,null,203,null,null,null,null,null,null,null,null,null,null,null,null,null,null,null,null,null,null,null,null,null,null,null,null,null,null,null,null,null,null,null,null,null,null,null,null,null,null,null,null,null,null,null,null,null,null,null,null,null,null,null,null,null,null,null,null,null,null,null,null,null,null,null,null,null,null,null,null,null,null,null,null,null,"",null,null,null,null,""]
[null,169,43,null,null,43,null,null,null,null,null,null,null,null,null,null,null,null,null,null,null,null,null,null,null,null,null,null,null,null,null,null,null,null,null,null,null,null,null,null,null,null,null,null,null,null,null,null,null,null,null,null,null,null,null,null,null,null,null,null,null,null,null,null,null,null,null,null,null,null,null,null,null,null,null,null,null,129,29,"",228,null,65,10,"E55",47,null,null,null,null,null,null,null,null,null,null,null,null,null,null,null,null,null,null,null,null,null,null,null,null,null,59]
[null,170,129,43,null,214,null,null,null,null,null,null,null,null,null,null,null,null,null,null,null,null,null,null,null,null,null,null,null,null,null,null,null,null,null,null,null,null,null,null,null,null,null,null,null,null,null,null,null,null,null,null,null,null,null,null,null,null,null,null,null,null,null,null,null,null,null,null,null,null,null,null,null,null,null,null,null,129,null,"",100,null,65,42,"E23",111,null,null,null,null,null,null,null,null,null,null,null,null,null,null,null,null,null,null,null,null,null,null,null,58]
[null,171,129,null,1,86,null,null,null,null,null,null,null,null,null,null,null,null,null,null,null,null,null,null,null,null,null,null,null,null,null,null,null,null,null,null,null,null,null,null,null,null,null,null,null,null,null,null,null,null,null,null,null,null,null,null,null,null,null,null,null,null,null,null,null,null,null,null,null,null,null,null,null,null,null,null,null,null,null,"",null,null,null,null,"",null,null,null,null,null,null,null,null,null,null,null,null,null,null,null,null,null,null,null,null,null,null,null,null,null,null,139]
[null,172,65,null,null,171,null,null,null,null,null,null,null,null,null,null,null,null,null,null,null,null,null,null,null,null,null,null,null,null,null,null,null,null,null,null,null,null,null,null,null,null,null,null,null,null,null,null,null,null,null,null,null,null,null,null,null,null,null,null,null,null,null,null,null,null,null,null,null,null,null,null,null,null,null,null,null,65,null,"",157,null,33,0,"",18]
[null,173,65,null,null,107,null,null,null,null,null,null,null,null,null,null,null,null,null,null,null,null,null,null,null,null,null,null,null,null,null,null,null,null,null,null,null,null,null,null,null,null,null,null,null,null,null,null,null,null,null,null,null,null,null,null,null,null,null,null,null,null,null,null,null,null,null,null,null,null,null,null,null,null,null,null,null,65,null,"",93,null,33,0,"",79,null,null,null,null,null,null,null,null,null,null,null,null,null,null,null,null,null,null,null,null,null,null,null,59]
[null,174,129,null,null,150,null,null,null,null,null,null,null,null,null,null,null,null,null,null,null,null,null,null,null,null,null,null,null,null,null,null,null,null,null,null,null,null,null,null,null,null,null,null,null,null,null,null,null,null,null,null,null,null,null,null,null,null,null,null,null,null,null,null,null,null,null,null,null,null,null,null,null,null,null,null,null,null,null,"",null,null,null,null,"",null,null,null,null,null,null,null,null,null,null,null,null,null,null,null,null,null,null,null,null,null,null,null,null,null,null,75]
[null,175,129,22,null,22,null,null,null,null,null,null,null,null,null,null,null,null,null,null,null,null,null,null,null,null,null,null,null,null,null,null,null,null,null,null,null,null,null,null,null,null,null,null,null,null,null,null,null,null,null,null,null,null,null,null,null,null,null,null,null,null,null,null,null,null,null,null,null,null,null,null,null,null,null,null,null,129,null,"E14",164,null,65,58,"E7",50]
[null,176,22,null,null,235,null,null,null,null,null,null,null,null,null,null,null,null,null,null,null,null,null,null,null,null,null,null,null,null,null,null,null,null,null,null,null,null,null,null,null,null,null,null,null,null,null,null,null,null,null,null,null,null,null,null,null,null,null,null,null,null,null,null,null,null,null,null,null,null,null,null,null,null,null,null,null,129,52,"",36,null,65,26,"E39",114,null,null,null,null,null,null,null,null,null,null,null,null,null,null,null,null,null,null,null,null,null,null,null,60,null,140]
[null,177,27,null,null,27,null,null,null,null,null,null,null,null,null,null,null,null,null,null,null,null,null,null,null,null,null,null,null,null,null,null,null,null,null,null,null,null,null,null,null,null,null,null,null,null,null,null,null,null,null,null,null,null,null,null,null,null,null,null,null,null,null,null,null,null,null,null,null,null,null,null,null,null,null,null,null,null,null,"",null,null,null,null,""]
[null,178,129,27,null,230,null,null,null,null,null,null,null,null,null,null,null,null,null,null,null,null,null,null,null,null,null,null,null,null,null,null,null,null,null,null,null,null,null,null,null,null,null,null,null,null,null,null,null,null,null,null,null,null,null,null,null,null,null,null,null,null,null,null,null,null,null,null,null,null,null,null,null,null,null,null,null,52,null,"",221,null,17,0,"",15]
[null,179,129,null,null,102,null,null,null,null,null,null,null,null,null,null,null,null,null,null,null,null,null,null,null,null,null,null,null,null,null,null,null,null,null,null,null,null,null,null,null,null,null,null,null,null,null,null,null,null,null,null,null,null,null,null,null,null,null,null,null,null,null,null,null,null,null,null,null,null,null,null,null,null,null,null,null,61,999,"",61,null,17,0,"",95,null,null,null,null,null,null,null,null,null,null,null,null,null,null,null,null,null,null,null,null,null,null,null,61,null,48]
[null,180,65,null,null,155,null,null,null,null,null,null,null,null,null,null,null,null,null,null,null,null,null,null,null,null,null,null,null,null,null,null,null,null,null,null,null,null,null,null,null,null,null,null,null,null,null,null,null,null,null,null,null,null,null,null,null,null,null,null,null,null,null,null,null,null,null,null,null,null,null,null,null,null,null,null,null,null,null,"",null,null,null,null,""]
[null,181,65,null,null,91,null,null,null,null,null,null,null,null,null,null,null,null,null,null,null,null,null,null,null,null,null,null,null,null,null,null,null,null,null,null,null,null,null,null,null,null,null,null,null,null,null,null,null,null,null,null,null,null,null,null,null,null,null,null,null,null,null,null,null,null,null,null,null,null,null,null,null,null,null,null,null,129,999,"",196,null,65,18,"E47",34,null,null,null,null,null,null,null,null,null,null,null,null,null,null,null,null,null,null,null,null,null,null,null,null,null,141]
[null,182,129,null,9,166,null,null,null,null,null,null,null,null,null,null,null,null,null,null,null,null,null,null,null,null,null,null,null,null,null,null,null,null,null,null,null,null,null,null,null,null,null,null,null,null,null,null,null,null,null,null,null,null,null,null,null,null,null,null,null,null,null,null,null,null,null,null,null,null,null,null,null,null,null,null,null,129,999,"",68,null,65,50,"E15",98,null,null,null,null,null,null,null,null,null,null,null,null,null,null,null,null,null,null,null,null,null,null,null,62]
[null,183,129,54,null,38,null,null,null,null,null,null,null,null,null,null,null,null,null,null,null,null,null,null,null,null,null,null,null,null,null,null,null,null,null,null,null,null,null,null,null,null,null,null,null,null,null,null,null,null,null,null,null,null,null,null,null,null,null,null,null,null,null,null,null,null,null,null,null,null,null,null,null,null,null,null,null,null,null,"",null,null,null,null,""]
[null,184,54,null,null,219,null,null,null,null,null,null,null,null,null,null,null,null,null,null,null,null,null,null,null,null,null,null,null,null,null,null,null,null,null,null,null,null,null,null,null,null,null,null,null,null,null,null,null,null,null,null,null,null,null,null,null,null,null,null,null,null,null,null,null,null,null,null,null,null,null,null,null,null,null,null,null,65,999,"",189,null,33,0,"",31,null,null,null,null,null,null,null,null,null,null,null,null,null,null,null,null,null,null,null,null,null,null,null,null,null,49]
[null,185,59,999,null,59,null,null,null,null,null,null,null,null,null,null,null,null,null,null,null,null,null,null,null,null,null,null,null,null,null,null,null,null,null,null,null,null,null,null,null,null,null,null,null,null,null,null,null,null,null,null,null,null,null,null,null,null,null,null,null,null,null,null,null,null,null,null,null,null,null,null,null,null,null,null,null,65,999,"",125,null,33,0,"",66,null,null,null,null,null,null,null,null,null,null,null,null,null,null,null,null,null,null,null,null,null,null,null,63]
[null,186,129,999,null,198,null,null,null,null,null,null,null,null,null,null,null,null,null,null,null,null,null,null,null,null,null,null,null,null,null,null,null,null,null,null,null,null,null,null,null,null,null,null,null,null,null,null,null,null,null,null,null,null,null,null,null,null,null,null,null,null,null,null,null,null,null,null,null,null,null,null,null,null,null,null,null,null,null,"",null,null,null,null,"",null,null,null,null,null,null,null,null,null,null,null,null,null,null,null,null,null,null,null,null,null,null,null,null,null,null,142]
[null,187,129,999,null,70,null,null,null,null,null,null,null,null,null,null,null,null,null,null,null,null,null,null,null,null,null,null,null,null,null,null,null,null,null,null,null,null,null,null,null,null,null,null,null,null,null,null,null,null,null,null,null,null,null,null,null,null,null,null,null,null,null,null,null,null,null,null,null,null,null,null,null,null,null,null,null,129,999,"",132,null,65,34,"E31",63]
[null,188,65,999,null,187,null,null,null,null,null,null,null,null,null,null,null,null,null,null,null,null,null,null,null,null,null,null,null,null,null,null,null,null,null,null,null,null,null,null,null,null,null,null,null,null,null,null,null,null,null,null,null,null,null,null,null,null,null,null,null,null,null,null,null,null,null,null,null,null,null,null,null,null,null,null,null,129,999,"",253,null,65,2,"E63",127,null,null,null,null,null,null,null,null,null,null,null,null,null,null,null,null,null,null,null,null,null,null,null,64]
[null,189,65,999,null,123,null,null,null,null,null,null,null,null,null,null,null,null,null,null,null,null,null,null,null,null,null,null,null,null,null,null,null,null,null,null,null,null,null,null,null,null,null,null,null,null,null,null,null,null,null,null,null,null,null,null,null,null,null,null,null,null,null,null,null,null,null,null,null,null,null,null,null,null,null,null,null,null,null,"",null,null,null,null,null,null,null,null,null,null,null,null,null,null,null,null,null,null,null,null,null,null,null,null,null,null,null,null,null,null,null,53]
[null,190,129,999,null,134,null,null,null,null,null,null,null,null,null,null,null,null,null,null,null,null,null,null,null,null,null,null,null,null,null,null,null,null,null,null,null,null,null,null,null,null,null,null,null,null,null,null,null,null,null,null,null,null,null,null,null,null,null,null,null,null,null,null,null,null,null,null,null,null,null,null,null,null,null,null,null,4,null,"",4,null,2,0,0,2]
[null,191,129,999,null,251,null,null,null,null,null,null,null,null,null,null,null,null,null,null,null,null,null,null,null,null,null,null,null,null,null,null,null,null,null,null,null,null,null,null,null,null,null,null,null,null,null,null,null,null,null,null,null,null,null,null,null,null,null,null,null,null,null,null,null,null,null,null,null,null,null,null,null,null,null,null,null,3,null,"",3,null,null,null,null,null,null,null,null,null,null,null,null,null,null,null,null,null,null,null,null,null,null,null,null,null,null,null,null,null,null,143]
[null,192,6,null,null,6,null,null,null,null,null,null,null,null,null,null,null,null,null,null,null,null,null,null,null,null,null,null,null,null,null,null,null,null,null,null,null,null,null,null,null,null,null,null,null,null,null,null,null,null,null,null,null,null,null,null,null,null,null,null,null,null,null,null,null,null,null,null,null,null,null,null,null,null,null,null,null,null,null,""]
[null,193,7,null,null,7,null,null,null,null,null,null,null,null,null,null,null,null,null,null,null,null,null,null,null,null,null,null,null,null,null,null,null,null,null,null,null,null,null,null,null,null,null,null,null,null,null,null,null,null,null,null,null,null,null,null,null,null,null,null,null,null,null,null,null,null,null,null,null,null,null,null,null,null,null,null,null,129,999,"",254]
[null,194,129,999,null,250,null,null,null,null,null,null,null,null,null,null,null,null,null,null,null,null,null,null,null,null,null,null,null,null,null,null,null,null,null,null,null,null,null,null,null,null,null,null,null,null,null,null,null,null,null,null,null,null,null,null,null,null,null,null,null,null,null,null,null,null,null,null,null,null,null,null,null,null,null,null,null,129,999,"",126,null,null,null,null,null,null,null,null,null,null,null,null,null,null,null,null,null,null,null,null,null,null,null,null,null,null,null,null,null,null,70]
[null,195,129,999,null,122,null,null,null,null,null,null,null,null,null,null,null,null,null,null,null,null,null,null,null,null,null,null,null,null,null,null,null,null,null,null,null,null,null,null,null,null,null,null,null,null,null,null,null,null,null,null,null,null,null,null,null,null,null,null,null,null,null,null,null,null,null,null,null,null,null,null,null,null,null,null,null,null,null,""]
[null,196,65,999,null,135,null,null,null,null,null,null,null,null,null,null,null,null,null,null,null,null,null,null,null,null,null,null,null,null,null,null,null,null,null,null,null,null,null,null,null,null,null,null,null,null,null,null,null,null,null,null,null,null,null,null,null,null,null,null,null,null,null,null,null,null,null,null,null,null,null,null,null,null,null,null,null,65,999,"",131,null,null,null,null,null,null,null,null,null,null,null,null,null,null,null,null,null,null,null,null,null,null,null,null,null,null,null,null,null,null,144]
[null,197,65,999,null,71,null,null,null,null,null,null,null,null,null,null,null,null,null,null,null,null,null,null,null,null,null,null,null,null,null,null,null,null,null,null,null,null,null,null,null,null,null,null,null,null,null,null,null,null,null,null,null,null,null,null,null,null,null,null,null,null,null,null,null,null,null,null,null,null,null,null,null,null,null,null,null,65,999,"",67]
[null,198,129,999,null,186,null,null,null,null,null,null,null,null,null,null,null,null,null,null,null,null,null,null,null,null,null,null,null,null,null,null,null,null,null,null,null,null,null,null,null,null,null,null,null,null,null,null,null,null,null,null,null,null,null,null,null,null,null,null,null,null,null,null,null,null,null,null,null,null,null,null,null,null,null,null,null,null,null,""]
[null,199,129,999,null,58,null,null,null,null,null,null,null,null,null,null,null,null,null,null,null,null,null,null,null,null,null,null,null,null,null,null,null,null,null,null,null,null,null,null,null,null,null,null,null,null,null,null,null,null,null,null,null,null,null,null,null,null,null,null,null,null,null,null,null,null,null,null,null,null,null,null,null,null,null,null,null,129,999,"",190,null,null,null,null,null,null,null,null,null,null,null,null,null,null,null,null,null,null,null,null,null,null,null,null,null,null,null,null,null,null,86]
[null,200,58,999,null,199,null,null,null,null,null,null,null,null,null,null,null,null,null,null,null,null,null,null,null,null,null,null,null,null,null,null,null,null,null,null,null,null,null,null,null,null,null,null,null,null,null,null,null,null,null,null,null,null,null,null,null,null,null,null,null,null,null,null,null,null,null,null,null,null,null,null,null,null,null,null,null,129,999,"",62]
[null,201,55,null,null,39,null,null,null,null,null,null,null,null,null,null,null,null,null,null,null,null,null,null,null,null,null,null,null,null,null,null,null,null,null,null,null,null,null,null,null,null,null,null,null,null,null,null,null,null,null,null,null,null,null,null,null,null,null,null,null,null,null,null,null,null,null,null,null,null,null,null,null,null,null,null,null,null,null,"",null,null,null,null,null,null,null,null,null,null,null,null,null,null,null,null,null,null,null,null,null,null,null,null,null,null,null,null,null,null,null,145]
[null,202,129,55,null,218,null,null,null,null,null,null,null,null,null,null,null,null,null,null,null,null,null,null,null,null,null,null,null,null,null,null,null,null,null,null,null,null,null,null,null,null,null,null,null,null,null,null,null,null,null,null,null,null,null,null,null,null,null,null,null,null,null,null,null,null,null,null,null,null,null,null,null,null,null,null,null,62,999,"",195]
[null,203,129,null,11,90,null,null,null,null,null,null,null,null,null,null,null,null,null,null,null,null,null,null,null,null,null,null,null,null,null,null,null,null,null,null,null,null,null,null,null,null,null,null,null,null,null,null,null,null,null,null,null,null,null,null,null,null,null,null,null,null,null,null,null,null,null,null,null,null,null,null,null,null,null,null,null,51,null,"",35]
[null,204,65,null,null,167,null,null,null,null,null,null,null,null,null,null,null,null,null,null,null,null,null,null,null,null,null,null,null,null,null,null,null,null,null,null,null,null,null,null,null,null,null,null,null,null,null,null,null,null,null,null,null,null,null,null,null,null,null,null,null,null,null,null,null,null,null,null,null,null,null,null,null,null,null,null,null,null,null,"",null,null,null,null,null,null,null,null,null,null,null,null,null,null,null,null,null,null,null,null,null,null,null,null,null,null,null,null,null,null,null,85]
[null,205,65,null,null,103,null,null,null,null,null,null,null,null,null,null,null,null,null,null,null,null,null,null,null,null,null,null,null,null,null,null,null,null,null,null,null,null,null,null,null,null,null,null,null,null,null,null,null,null,null,null,null,null,null,null,null,null,null,null,null,null,null,null,null,null,null,null,null,null,null,null,null,null,null,null,null,129,51,"",222]
[null,206,129,null,25,154,null,null,null,null,null,null,null,null,null,null,null,null,null,null,null,null,null,null,null,null,null,null,null,null,null,null,null,null,null,null,null,null,null,null,null,null,null,null,null,null,null,null,null,null,null,null,null,null,null,null,null,null,null,null,null,null,null,null,null,null,null,null,null,null,null,null,null,null,null,null,null,129,null,"E13",94,null,null,null,null,null,null,null,null,null,null,null,null,null,null,null,null,null,null,null,null,null,null,null,null,null,null,null,null,null,null,146]
[null,207,129,26,null,26,null,null,null,null,null,null,null,null,null,null,null,null,null,null,null,null,null,null,null,null,null,null,null,null,null,null,null,null,null,null,null,null,null,null,null,null,null,null,null,null,null,null,null,null,null,null,null,null,null,null,null,null,null,null,null,null,null,null,null,null,null,null,null,null,null,null,null,null,null,null,null,null,null,""]
[null,208,26,null,null,231,null,null,null,null,null,null,null,null,null,null,null,null,null,null,null,null,null,null,null,null,null,null,null,null,null,null,null,null,null,null,null,null,null,null,null,null,null,null,null,null,null,null,null,null,null,null,null,null,null,null,null,null,null,null,null,null,null,null,null,null,null,null,null,null,null,null,null,null,null,null,null,65,null,"",163]
[null,209,23,null,null,23,null,null,null,null,null,null,null,null,null,null,null,null,null,null,null,null,null,null,null,null,null,null,null,null,null,null,null,null,null,null,null,null,null,null,null,null,null,null,null,null,null,null,null,null,null,null,null,null,null,null,null,null,null,null,null,null,null,null,null,null,null,null,null,null,null,null,null,null,null,null,null,65,null,"",99,null,null,null,null,null,null,null,null,null,null,null,null,null,null,null,null,null,null,null,null,null,null,null,null,null,null,null,null,null,null,96]
[null,210,129,23,null,234,null,null,null,null,null,null,null,null,null,null,null,null,null,null,null,null,null,null,null,null,null,null,null,null,null,null,null,null,null,null,null,null,null,null,null,null,null,null,null,null,null,null,null,null,null,null,null,null,null,null,null,null,null,null,null,null,null,null,null,null,null,null,null,null,null,null,null,null,null,null,null,null,null,""]
[null,211,129,null,null,106,null,null,null,null,null,null,null,null,null,null,null,null,null,null,null,null,null,null,null,null,null,null,null,null,null,null,null,null,null,null,null,null,null,null,null,null,null,null,null,null,null,null,null,null,null,null,null,null,null,null,null,null,null,null,null,null,null,null,null,null,null,null,null,null,null,null,null,null,null,null,null,129,null,"",158,null,null,null,null,null,null,null,null,null,null,null,null,null,null,null,null,null,null,null,null,null,null,null,null,null,null,null,null,null,null,147]
[null,212,65,null,null,151,null,null,null,null,null,null,null,null,null,null,null,null,null,null,null,null,null,null,null,null,null,null,null,null,null,null,null,null,null,null,null,null,null,null,null,null,null,null,null,null,null,null,null,null,null,null,null,null,null,null,null,null,null,null,null,null,null,null,null,null,null,null,null,null,null,null,null,null,null,null,null,129,30,"E28",30]
[null,213,65,null,null,87,null,null,null,null,null,null,null,null,null,null,null,null,null,null,null,null,null,null,null,null,null,null,null,null,null,null,null,null,null,null,null,null,null,null,null,null,null,null,null,null,null,null,null,null,null,null,null,null,null,null,null,null,null,null,null,null,null,null,null,null,null,null,null,null,null,null,null,null,null,null,null,null,null,""]
[null,214,129,null,3,170,null,null,null,null,null,null,null,null,null,null,null,null,null,null,null,null,null,null,null,null,null,null,null,null,null,null,null,null,null,null,null,null,null,null,null,null,null,null,null,null,null,null,null,null,null,null,null,null,null,null,null,null,null,null,null,null,null,null,null,null,null,null,null,null,null,null,null,null,null,null,null,30,null,"",227,null,null,null,null,null,null,null,null,null,null,null,null,null,null,null,null,null,null,null,null,null,null,null,null,null,null,null,null,null,null,92]
[null,215,129,42,null,42,null,null,null,null,null,null,null,null,null,null,null,null,null,null,null,null,null,null,null,null,null,null,null,null,null,null,null,null,null,null,null,null,null,null,null,null,null,null,null,null,null,null,null,null,null,null,null,null,null,null,null,null,null,null,null,null,null,null,null,null,null,null,null,null,null,null,null,null,null,null,null,19,null,"",19]
[null,216,42,null,null,215,null,null,null,null,null,null,null,null,null,null,null,null,null,null,null,null,null,null,null,null,null,null,null,null,null,null,null,null,null,null,null,null,null,null,null,null,null,null,null,null,null,null,null,null,null,null,null,null,null,null,null,null,null,null,null,null,null,null,null,null,null,null,null,null,null,null,null,null,null,null,null,null,null,"",null,null,null,null,null,null,null,null,null,null,null,null,null,null,null,null,null,null,null,null,null,null,null,null,null,null,null,null,null,null,null,148]
[null,217,39,null,null,55,null,null,null,null,null,null,null,null,null,null,null,null,null,null,null,null,null,null,null,null,null,null,null,null,null,null,null,null,null,null,null,null,null,null,null,null,null,null,null,null,null,null,null,null,null,null,null,null,null,null,null,null,null,null,null,null,null,null,null,null,null,null,null,null,null,null,null,null,null,null,null,129,19,"",238]
[null,218,129,39,null,202,null,null,null,null,null,null,null,null,null,null,null,null,null,null,null,null,null,null,null,null,null,null,null,null,null,null,null,null,null,null,null,null,null,null,null,null,null,null,null,null,null,null,null,null,null,null,null,null,null,null,null,null,null,null,null,null,null,null,null,null,null,null,null,null,null,null,null,null,null,null,null,129,null,"",110]
[null,219,129,null,19,74,null,null,null,null,null,null,null,null,null,null,null,null,null,null,null,null,null,null,null,null,null,null,null,null,null,null,null,null,null,null,null,null,null,null,null,null,null,null,null,null,null,null,null,null,null,null,null,null,null,null,null,null,null,null,null,null,null,null,null,null,null,null,null,null,null,null,null,null,null,null,null,null,null,"",null,null,null,null,null,null,null,null,null,null,null,null,null,null,null,null,null,null,null,null,null,null,null,null,null,null,null,null,null,null,null,44]
[null,220,65,null,null,183,null,null,null,null,null,null,null,null,null,null,null,null,null,null,null,null,null,null,null,null,null,null,null,null,null,null,null,null,null,null,null,null,null,null,null,null,null,null,null,null,null,null,null,null,null,null,null,null,null,null,null,null,null,null,null,null,null,null,null,null,null,null,null,null,null,null,null,null,null,null,null,65,null,"",147]
[null,221,65,null,null,119,null,null,null,null,null,null,null,null,null,null,null,null,null,null,null,null,null,null,null,null,null,null,null,null,null,null,null,null,null,null,null,null,null,null,null,null,null,null,null,null,null,null,null,null,null,null,null,null,null,null,null,null,null,null,null,null,null,null,null,null,null,null,null,null,null,null,null,null,null,null,null,65,null,"",83,null,null,null,null,null,null,null,null,null,null,null,null,null,null,null,null,null,null,null,null,null,null,null,null,null,null,null,null,null,null,149]
[null,222,129,null,null,138,null,null,null,null,null,null,null,null,null,null,null,null,null,null,null,null,null,null,null,null,null,null,null,null,null,null,null,null,null,null,null,null,null,null,null,null,null,null,null,null,null,null,null,null,null,null,null,null,null,null,null,null,null,null,null,null,null,null,null,null,null,null,null,null,null,null,null,null,null,null,null,null,null,""]
[null,223,129,10,null,10,null,null,null,null,null,null,null,null,null,null,null,null,null,null,null,null,null,null,null,null,null,null,null,null,null,null,null,null,null,null,null,null,null,null,null,null,null,null,null,null,null,null,null,null,null,null,null,null,null,null,null,null,null,null,null,null,null,null,null,null,null,null,null,null,null,null,null,null,null,null,null,129,null,"E5",174]
[null,224,10,null,null,247,null,null,null,null,null,null,null,null,null,null,null,null,null,null,null,null,null,null,null,null,null,null,null,null,null,null,null,null,null,null,null,null,null,null,null,null,null,null,null,null,null,null,null,null,null,null,null,null,null,null,null,null,null,null,null,null,null,null,null,null,null,null,null,null,null,null,null,null,null,null,null,129,46,"",46,null,null,null,null,null,null,null,null,null,null,null,null,null,null,null,null,null,null,null,null,null,null,null,null,null,null,null,null,null,null,69]
[null,225,15,null,null,15,null,null,null,null,null,null,null,null,null,null,null,null,null,null,null,null,null,null,null,null,null,null,null,null,null,null,null,null,null,null,null,null,null,null,null,null,null,null,null,null,null,null,null,null,null,null,null,null,null,null,null,null,null,null,null,null,null,null,null,null,null,null,null,null,null,null,null,null,null,null,null,null,null,""]
[null,226,129,15,null,242,null,null,null,null,null,null,null,null,null,null,null,null,null,null,null,null,null,null,null,null,null,null,null,null,null,null,null,null,null,null,null,null,null,null,null,null,null,null,null,null,null,null,null,null,null,null,null,null,null,null,null,null,null,null,null,null,null,null,null,null,null,null,null,null,null,null,null,null,null,null,null,46,null,"",211,null,null,null,null,null,null,null,null,null,null,null,null,null,null,null,null,null,null,null,null,null,null,null,null,null,null,null,null,null,null,150]
[null,227,129,null,32,114,null,null,null,null,null,null,null,null,null,null,null,null,null,null,null,null,null,null,null,null,null,null,null,null,null,null,null,null,null,null,null,null,null,null,null,null,null,null,null,null,null,null,null,null,null,null,null,null,null,null,null,null,null,null,null,null,null,null,null,null,null,null,null,null,null,null,null,null,null,null,null,35,null,"",51]
[null,228,65,null,null,143,null,null,null,null,null,null,null,null,null,null,null,null,null,null,null,null,null,null,null,null,null,null,null,null,null,null,null,null,null,null,null,null,null,null,null,null,null,null,null,null,null,null,null,null,null,null,null,null,null,null,null,null,null,null,null,null,null,null,null,null,null,null,null,null,null,null,null,null,null,null,null,null,null,""]
[null,229,65,null,null,79,null,null,null,null,null,null,null,null,null,null,null,null,null,null,null,null,null,null,null,null,null,null,null,null,null,null,null,null,null,null,null,null,null,null,null,null,null,null,null,null,null,null,null,null,null,null,null,null,null,null,null,null,null,null,null,null,null,null,null,null,null,null,null,null,null,null,null,null,null,null,null,129,35,"",206,null,null,null,null,null,null,null,null,null,null,null,null,null,null,null,null,null,null,null,null,null,null,null,null,null,null,null,null,null,null,101]
[null,230,129,null,23,178,null,null,null,null,null,null,null,null,null,null,null,null,null,null,null,null,null,null,null,null,null,null,null,null,null,null,null,null,null,null,null,null,null,null,null,null,null,null,null,null,null,null,null,null,null,null,null,null,null,null,null,null,null,null,null,null,null,null,null,null,null,null,null,null,null,null,null,null,null,null,null,129,null,"E21",78]
[null,231,129,34,null,50,null,null,null,null,null,null,null,null,null,null,null,null,null,null,null,null,null,null,null,null,null,null,null,null,null,null,null,null,null,null,null,null,null,null,null,null,null,null,null,null,null,null,null,null,null,null,null,null,null,null,null,null,null,null,null,null,null,null,null,null,null,null,null,null,null,null,null,null,null,null,null,null,null,"",null,null,null,null,null,null,null,null,null,null,null,null,null,null,null,null,null,null,null,null,null,null,null,null,null,null,null,null,null,null,null,151]
[null,232,34,null,null,207,null,null,null,null,null,null,null,null,null,null,null,null,null,null,null,null,null,null,null,null,null,null,null,null,null,null,null,null,null,null,null,null,null,null,null,null,null,null,null,null,null,null,null,null,null,null,null,null,null,null,null,null,null,null,null,null,null,null,null,null,null,null,null,null,null,null,null,null,null,null,null,65,null,"",179]
[null,233,47,null,null,47,null,null,null,null,null,null,null,null,null,null,null,null,null,null,null,null,null,null,null,null,null,null,null,null,null,null,null,null,null,null,null,null,null,null,null,null,null,null,null,null,null,null,null,null,null,null,null,null,null,null,null,null,null,null,null,null,null,null,null,null,null,null,null,null,null,null,null,null,null,null,null,65,null,"",115]
[null,234,129,47,null,210,null,null,null,null,null,null,null,null,null,null,null,null,null,null,null,null,null,null,null,null,null,null,null,null,null,null,null,null,null,null,null,null,null,null,null,null,null,null,null,null,null,null,null,null,null,null,null,null,null,null,null,null,null,null,null,null,null,null,null,null,null,null,null,null,null,null,null,null,null,null,null,null,null,"",null,null,null,null,null,null,null,null,null,null,null,null,null,null,null,null,null,null,null,null,null,null,null,null,null,null,null,null,null,null,null,81]
[null,235,129,null,7,82,null,null,null,null,null,null,null,null,null,null,null,null,null,null,null,null,null,null,null,null,null,null,null,null,null,null,null,null,null,null,null,null,null,null,null,null,null,null,null,null,null,null,null,null,null,null,null,null,null,null,null,null,null,null,null,null,null,null,null,null,null,null,null,null,null,null,null,null,null,null,null,129,null,"E31",142]
[null,236,65,null,null,175,null,null,null,null,null,null,null,null,null,null,null,null,null,null,null,null,null,null,null,null,null,null,null,null,null,null,null,null,null,null,null,null,null,null,null,null,null,null,null,null,null,null,null,null,null,null,null,null,null,null,null,null,null,null,null,null,null,null,null,null,null,null,null,null,null,null,null,null,null,null,null,129,14,"",14,null,null,null,null,null,null,null,null,null,null,null,null,null,null,null,null,null,null,null,null,null,null,null,null,null,null,null,null,null,null,152]
[null,237,65,null,null,111,null,null,null,null,null,null,null,null,null,null,null,null,null,null,null,null,null,null,null,null,null,null,null,null,null,null,null,null,null,null,null,null,null,null,null,null,null,null,null,null,null,null,null,null,null,null,null,null,null,null,null,null,null,null,null,null,null,null,null,null,null,null,null,null,null,null,null,null,null,null,null,null,null,""]
[null,238,129,null,null,146,null,null,null,null,null,null,null,null,null,null,null,null,null,null,null,null,null,null,null,null,null,null,null,null,null,null,null,null,null,null,null,null,null,null,null,null,null,null,null,null,null,null,null,null,null,null,null,null,null,null,null,null,null,null,null,null,null,null,null,null,null,null,null,null,null,null,null,null,null,null,null,14,null,"",243]
[null,239,129,18,null,18,null,null,null,null,null,null,null,null,null,null,null,null,null,null,null,null,null,null,null,null,null,null,null,null,null,null,null,null,null,null,null,null,null,null,null,null,null,null,null,null,null,null,null,null,null,null,null,null,null,null,null,null,null,null,null,null,null,null,null,null,null,null,null,null,null,null,null,null,null,null,null,11,null,"",11,null,null,null,null,null,null,null,null,null,null,null,null,null,null,null,null,null,null,null,null,null,null,null,null,null,null,null,null,null,null,41]
[null,240,18,null,null,239,null,null,null,null,null,null,null,null,null,null,null,null,null,null,null,null,null,null,null,null,null,null,null,null,null,null,null,null,null,null,null,null,null,null,null,null,null,null,null,null,null,null,null,null,null,null,null,null,null,null,null,null,null,null,null,null,null,null,null,null,null,null,null,null,null,null,null,null,null,null,null,null,null,""]
[null,241,31,null,null,31,null,null,null,null,null,null,null,null,null,null,null,null,null,null,null,null,null,null,null,null,null,null,null,null,null,null,null,null,null,null,null,null,null,null,null,null,null,null,null,null,null,null,null,null,null,null,null,null,null,null,null,null,null,null,null,null,null,null,null,null,null,null,null,null,null,null,null,null,null,null,null,129,11,"",246,null,null,null,null,null,null,null,null,null,null,null,null,null,null,null,null,null,null,null,null,null,null,null,null,null,null,null,null,null,null,153]
[null,242,129,31,null,226,null,null,null,null,null,null,null,null,null,null,null,null,null,null,null,null,null,null,null,null,null,null,null,null,null,null,null,null,null,null,null,null,null,null,null,null,null,null,null,null,null,null,null,null,null,null,null,null,null,null,null,null,null,null,null,null,null,null,null,null,null,null,null,null,null,null,null,null,null,null,null,129,null,"",118]
[null,243,129,null,null,98,null,null,null,null,null,null,null,null,null,null,null,null,null,null,null,null,null,null,null,null,null,null,null,null,null,null,null,null,null,null,null,null,null,null,null,null,null,null,null,null,null,null,null,null,null,null,null,null,null,null,null,null,null,null,null,null,null,null,null,null,null,null,null,null,null,null,null,null,null,null,null,null,null,""]
[null,244,65,null,null,159,null,null,null,null,null,null,null,null,null,null,null,null,null,null,null,null,null,null,null,null,null,null,null,null,null,null,null,null,null,null,null,null,null,null,null,null,null,null,null,null,null,null,null,null,null,null,null,null,null,null,null,null,null,null,null,null,null,null,null,null,null,null,null,null,null,null,null,null,null,null,null,65,null,"",139,null,null,null,null,null,null,null,null,null,null,null,null,null,null,null,null,null,null,null,null,null,null,null,null,null,null,null,null,null,null,99]
[null,245,65,null,null,95,null,null,null,null,null,null,null,null,null,null,null,null,null,null,null,null,null,null,null,null,null,null,null,null,null,null,null,null,null,null,null,null,null,null,null,null,null,null,null,null,null,null,null,null,null,null,null,null,null,null,null,null,null,null,null,null,null,null,null,null,null,null,null,null,null,null,null,null,null,null,null,65,null,"",75]
[null,246,129,null,15,162,null,null,null,null,null,null,null,null,null,null,null,null,null,null,null,null,null,null,null,null,null,null,null,null,null,null,null,null,null,null,null,null,null,null,null,null,null,null,null,null,null,null,null,null,null,null,null,null,null,null,null,null,null,null,null,null,null,null,null,null,null,null,null,null,null,null,null,null,null,null,null,null,null,"",null,null,null,null,null,null,null,null,null,null,null,null,null,null,null,null,null,null,null,null,null,null,null,null,null,null,null,null,null,null,null,154]
[null,247,129,50,null,34,null,null,null,null,null,null,null,null,null,null,null,null,null,null,null,null,null,null,null,null,null,null,null,null,null,null,null,null,null,null,null,null,null,null,null,null,null,null,null,null,null,null,null,null,null,null,null,null,null,null,null,null,null,null,null,null,null,null,null,null,null,null,null,null,null,null,null,null,null,null,null,129,null,"E17",182]
[null,248,50,null,null,223,null,null,null,null,null,null,null,null,null,null,null,null,null,null,null,null,null,null,null,null,null,null,null,null,null,null,null,null,null,null,null,null,null,null,null,null,null,null,null,null,null,null,null,null,null,null,null,null,null,null,null,null,null,null,null,null,null,null,null,null,null,null,null,null,null,null,null,null,null,null,null,129,38,"",54]
[null,249,63,999,null,63,null,null,null,null,null,null,null,null,null,null,null,null,null,null,null,null,null,null,null,null,null,null,null,null,null,null,null,null,null,null,null,null,null,null,null,null,null,null,null,null,null,null,null,null,null,null,null,null,null,null,null,null,null,null,null,null,null,null,null,null,null,null,null,null,null,null,null,null,null,null,null,null,null,"",null,null,null,null,null,null,null,null,null,null,null,null,null,null,null,null,null,null,null,null,null,null,null,null,null,null,null,null,null,null,null,78]
[null,250,129,999,null,194,null,null,null,null,null,null,null,null,null,null,null,null,null,null,null,null,null,null,null,null,null,null,null,null,null,null,null,null,null,null,null,null,null,null,null,null,null,null,null,null,null,null,null,null,null,null,null,null,null,null,null,null,null,null,null,null,null,null,null,null,null,null,null,null,null,null,null,null,null,null,null,38,null,"",203]
[null,251,129,999,null,66,null,null,null,null,null,null,null,null,null,null,null,null,null,null,null,null,null,null,null,null,null,null,null,null,null,null,null,null,null,null,null,null,null,null,null,null,null,null,null,null,null,null,null,null,null,null,null,null,null,null,null,null,null,null,null,null,null,null,null,null,null,null,null,null,null,null,null,null,null,null,null,43,null,"",43,null,null,null,null,null,null,null,null,null,null,null,null,null,null,null,null,null,null,null,null,null,null,null,null,null,null,null,null,null,null,155]
[null,252,65,999,null,191,null,null,null,null,null,null,null,null,null,null,null,null,null,null,null,null,null,null,null,null,null,null,null,null,null,null,null,null,null,null,null,null,null,null,null,null,null,null,null,null,null,null,null,null,null,null,null,null,null,null,null,null,null,null,null,null,null,null,null,null,null,null,null,null,null,null,null,null,null,null,null,null,null,""]
[null,253,65,999,null,127,null,null,null,null,null,null,null,null,null,null,null,null,null,null,null,null,null,null,null,null,null,null,null,null,null,null,null,null,null,null,null,null,null,null,null,null,null,null,null,null,null,null,null,null,null,null,null,null,null,null,null,null,null,null,null,null,null,null,null,null,null,null,null,null,null,null,null,null,null,null,null,129,43,"",214]
[null,254,129,999,null,130,null,null,null,null,null,null,null,null,null,null,null,null,null,null,null,null,null,null,null,null,null,null,null,null,null,null,null,null,null,null,null,null,null,null,null,null,null,null,null,null,null,null,null,null,null,null,null,null,null,null,null,null,null,null,null,null,null,null,null,null,null,null,null,null,null,null,null,null,null,null,null,129,null,"E1",86,null,null,null,null,null,null,null,null,null,null,null,null,null,null,null,null,null,null,null,null,null,null,null,null,null,null,null,null,null,null,57]
[null,255,129,999,null,255,null,null,null,null,null,null,null,null,null,null,null,null,null,null,null,null,null,null,null,null,null,null,null,null,null,null,null,null,null,null,null,null,null,null,null,null,null,null,null,null,null,null,null,null,null,null,null,null,null,null,null,null,null,null,null,null,null,null,null,null,null,null,null,null,null,null,null,null,null,null,null,null,null,""]
[null,256,2,null,null,2,null,null,null,null,null,null,null,null,null,null,null,null,null,null,null,null,null,null,null,null,null,null,null,null,null,null,null,null,null,null,null,null,null,null,null,null,null,null,null,null,null,null,null,null,null,null,null,null,null,null,null,null,null,null,null,null,null,null,null,null,null,null,null,null,null,null,null,null,null,null,null,65,null,"",171,null,null,null,null,null,null,null,null,null,null,null,null,null,null,null,null,null,null,null,null,null,null,null,null,null,null,null,null,null,null,156]
[null,null,null,null,null,null,null,null,null,null,null,null,null,null,null,null,null,null,null,null,null,null,null,null,null,null,null,null,null,null,null,null,null,null,null,null,null,null,null,null,null,null,null,null,null,null,null,null,null,null,null,null,null,null,null,null,null,null,null,null,null,null,null,null,null,null,null,null,null,null,null,null,null,null,null,null,null,65,null,"",107]
[null,null,null,null,null,null,null,null,null,null,null,null,null,null,null,null,null,null,null,null,null,null,null,null,null,null,null,null,null,null,null,null,null,null,null,null,null,null,null,null,null,null,null,null,null,null,null,null,null,null,null,null,null,null,null,null,null,null,null,null,null,null,null,null,null,null,null,null,null,null,null,null,null,null,null,null,null,null,null,""]
[null,null,null,null,null,null,null,null,null,null,null,null,null,null,null,null,null,null,null,null,null,null,null,null,null,null,null,null,null,null,null,null,null,null,null,null,null,null,null,null,null,null,null,null,null,null,null,null,null,null,null,null,null,null,null,null,null,null,null,null,null,null,null,null,null,null,null,null,null,null,null,null,null,null,null,null,null,129,null,"",150,null,null,null,null,null,null,null,null,null,null,null,null,null,null,null,null,null,null,null,null,null,null,null,null,null,null,null,null,null,null,73]
[null,null,null,null,null,null,null,null,null,null,null,null,null,null,null,null,null,null,null,null,null,null,null,null,null,null,null,null,null,null,null,null,null,null,null,null,null,null,null,null,null,null,null,null,null,null,null,null,null,null,null,null,null,null,null,null,null,null,null,null,null,null,null,null,null,null,null,null,null,null,null,null,null,null,null,null,null,129,22,"",22]
[null,null,null,null,null,null,null,null,null,null,null,null,null,null,null,null,null,null,null,null,null,null,null,null,null,null,null,null,null,null,null,null,null,null,null,null,null,null,null,null,null,null,null,null,null,null,null,null,null,null,null,null,null,null,null,null,null,null,null,null,null,null,null,null,null,null,null,null,null,null,null,null,null,null,null,null,null,null,null,"",null,null,null,null,null,null,null,null,null,null,null,null,null,null,null,null,null,null,null,null,null,null,null,null,null,null,null,null,null,null,null,157]
[null,null,null,null,null,null,null,null,null,null,null,null,null,null,null,null,null,null,null,null,null,null,null,null,null,null,null,null,null,null,null,null,null,null,null,null,null,null,null,null,null,null,null,null,null,null,null,null,null,null,null,null,null,null,null,null,null,null,null,null,null,null,null,null,null,null,null,null,null,null,null,null,null,null,null,null,null,22,null,"",235]
[null,null,null,null,null,null,null,null,null,null,null,null,null,null,null,null,null,null,null,null,null,null,null,null,null,null,null,null,null,null,null,null,null,null,null,null,null,null,null,null,null,null,null,null,null,null,null,null,null,null,null,null,null,null,null,null,null,null,null,null,null,null,null,null,null,null,null,null,null,null,null,null,null,null,null,null,null,27,null,"",27]
[null,null,null,null,null,null,null,null,null,null,null,null,null,null,null,null,null,null,null,null,null,null,null,null,null,null,null,null,null,null,null,null,null,null,null,null,null,null,null,null,null,null,null,null,null,null,null,null,null,null,null,null,null,null,null,null,null,null,null,null,null,null,null,null,null,null,null,null,null,null,null,null,null,null,null,null,null,null,null,"",null,null,null,null,null,null,null,null,null,null,null,null,null,null,null,null,null,null,null,null,null,null,null,null,null,null,null,null,null,null,null,37]
[null,null,null,null,null,null,null,null,null,null,null,null,null,null,null,null,null,null,null,null,null,null,null,null,null,null,null,null,null,null,null,null,null,null,null,null,null,null,null,null,null,null,null,null,null,null,null,null,null,null,null,null,null,null,null,null,null,null,null,null,null,null,null,null,null,null,null,null,null,null,null,null,null,null,null,null,null,129,27,"",230]
[null,null,null,null,null,null,null,null,null,null,null,null,null,null,null,null,null,null,null,null,null,null,null,null,null,null,null,null,null,null,null,null,null,null,null,null,null,null,null,null,null,null,null,null,null,null,null,null,null,null,null,null,null,null,null,null,null,null,null,null,null,null,null,null,null,null,null,null,null,null,null,null,null,null,null,null,null,129,null,"",102,null,null,null,null,null,null,null,null,null,null,null,null,null,null,null,null,null,null,null,null,null,null,null,null,null,null,null,null,null,null,158]
[null,null,null,null,null,null,null,null,null,null,null,null,null,null,null,null,null,null,null,null,null,null,null,null,null,null,null,null,null,null,null,null,null,null,null,null,null,null,null,null,null,null,null,null,null,null,null,null,null,null,null,null,null,null,null,null,null,null,null,null,null,null,null,null,null,null,null,null,null,null,null,null,null,null,null,null,null,null,null,""]
[null,null,null,null,null,null,null,null,null,null,null,null,null,null,null,null,null,null,null,null,null,null,null,null,null,null,null,null,null,null,null,null,null,null,null,null,null,null,null,null,null,null,null,null,null,null,null,null,null,null,null,null,null,null,null,null,null,null,null,null,null,null,null,null,null,null,null,null,null,null,null,null,null,null,null,null,null,65,null,"",155]
[null,null,null,null,null,null,null,null,null,null,null,null,null,null,null,null,null,null,null,null,null,null,null,null,null,null,null,null,null,null,null,null,null,null,null,null,null,null,null,null,null,null,null,null,null,null,null,null,null,null,null,null,null,null,null,null,null,null,null,null,null,null,null,null,null,null,null,null,null,null,null,null,null,null,null,null,null,65,null,"",91,null,null,null,null,null,null,null,null,null,null,null,null,null,null,null,null,null,null,null,null,null,null,null,null,null,null,null,null,null,null,51]
[null,null,null,null,null,null,null,null,null,null,null,null,null,null,null,null,null,null,null,null,null,null,null,null,null,null,null,null,null,null,null,null,null,null,null,null,null,null,null,null,null,null,null,null,null,null,null,null,null,null,null,null,null,null,null,null,null,null,null,null,null,null,null,null,null,null,null,null,null,null,null,null,null,null,null,null,null,null,null,""]
[null,null,null,null,null,null,null,null,null,null,null,null,null,null,null,null,null,null,null,null,null,null,null,null,null,null,null,null,null,null,null,null,null,null,null,null,null,null,null,null,null,null,null,null,null,null,null,null,null,null,null,null,null,null,null,null,null,null,null,null,null,null,null,null,null,null,null,null,null,null,null,null,null,null,null,null,null,129,null,"E9",166,null,null,null,null,null,null,null,null,null,null,null,null,null,null,null,null,null,null,null,null,null,null,null,null,null,null,null,null,null,null,159]
[null,null,null,null,null,null,null,null,null,null,null,null,null,null,null,null,null,null,null,null,null,null,null,null,null,null,null,null,null,null,null,null,null,null,null,null,null,null,null,null,null,null,null,null,null,null,null,null,null,null,null,null,null,null,null,null,null,null,null,null,null,null,null,null,null,null,null,null,null,null,null,null,null,null,null,null,null,129,54,"",38]
[null,null,null,null,null,null,null,null,null,null,null,null,null,null,null,null,null,null,null,null,null,null,null,null,null,null,null,null,null,null,null,null,null,null,null,null,null,null,null,null,null,null,null,null,null,null,null,null,null,null,null,null,null,null,null,null,null,null,null,null,null,null,null,null,null,null,null,null,null,null,null,null,null,null,null,null,null,null,null,""]
[null,null,null,null,null,null,null,null,null,null,null,null,null,null,null,null,null,null,null,null,null,null,null,null,null,null,null,null,null,null,null,null,null,null,null,null,null,null,null,null,null,null,null,null,null,null,null,null,null,null,null,null,null,null,null,null,null,null,null,null,null,null,null,null,null,null,null,null,null,null,null,null,null,null,null,null,null,54,null,"",219,null,null,null,null,null,null,null,null,null,null,null,null,null,null,null,null,null,null,null,null,null,null,null,null,null,null,null,null,null,null,56]
[null,null,null,null,null,null,null,null,null,null,null,null,null,null,null,null,null,null,null,null,null,null,null,null,null,null,null,null,null,null,null,null,null,null,null,null,null,null,null,null,null,null,null,null,null,null,null,null,null,null,null,null,null,null,null,null,null,null,null,null,null,null,null,null,null,null,null,null,null,null,null,null,null,null,null,null,null,59,999,"",59]
[null,null,null,null,null,null,null,null,null,null,null,null,null,null,null,null,null,null,null,null,null,null,null,null,null,null,null,null,null,null,null,null,null,null,null,null,null,null,null,null,null,null,null,null,null,null,null,null,null,null,null,null,null,null,null,null,null,null,null,null,null,null,null,null,null,null,null,null,null,null,null,null,null,null,null,null,null,null,null,"",null,null,null,null,null,null,null,null,null,null,null,null,null,null,null,null,null,null,null,null,null,null,null,null,null,null,null,null,null,null,null,160]
[null,null,null,null,null,null,null,null,null,null,null,null,null,null,null,null,null,null,null,null,null,null,null,null,null,null,null,null,null,null,null,null,null,null,null,null,null,null,null,null,null,null,null,null,null,null,null,null,null,null,null,null,null,null,null,null,null,null,null,null,null,null,null,null,null,null,null,null,null,null,null,null,null,null,null,null,null,129,999,"",198]
[null,null,null,null,null,null,null,null,null,null,null,null,null,null,null,null,null,null,null,null,null,null,null,null,null,null,null,null,null,null,null,null,null,null,null,null,null,null,null,null,null,null,null,null,null,null,null,null,null,null,null,null,null,null,null,null,null,null,null,null,null,null,null,null,null,null,null,null,null,null,null,null,null,null,null,null,null,129,999,"",70]
[null,null,null,null,null,null,null,null,null,null,null,null,null,null,null,null,null,null,null,null,null,null,null,null,null,null,null,null,null,null,null,null,null,null,null,null,null,null,null,null,null,null,null,null,null,null,null,null,null,null,null,null,null,null,null,null,null,null,null,null,null,null,null,null,null,null,null,null,null,null,null,null,null,null,null,null,null,null,null,"",null,null,null,null,null,null,null,null,null,null,null,null,null,null,null,null,null,null,null,null,null,null,null,null,null,null,null,null,null,null,null,88]
[null,null,null,null,null,null,null,null,null,null,null,null,null,null,null,null,null,null,null,null,null,null,null,null,null,null,null,null,null,null,null,null,null,null,null,null,null,null,null,null,null,null,null,null,null,null,null,null,null,null,null,null,null,null,null,null,null,null,null,null,null,null,null,null,null,null,null,null,null,null,null,null,null,null,null,null,null,65,999,"",187]
[null,null,null,null,null,null,null,null,null,null,null,null,null,null,null,null,null,null,null,null,null,null,null,null,null,null,null,null,null,null,null,null,null,null,null,null,null,null,null,null,null,null,null,null,null,null,null,null,null,null,null,null,null,null,null,null,null,null,null,null,null,null,null,null,null,null,null,null,null,null,null,null,null,null,null,null,null,65,999,"",123,null,null,null,null,null,null,null,null,null,null,null,null,null,null,null,null,null,null,null,null,null,null,null,null,null,null,null,null,null,null,161]
[null,null,null,null,null,null,null,null,null,null,null,null,null,null,null,null,null,null,null,null,null,null,null,null,null,null,null,null,null,null,null,null,null,null,null,null,null,null,null,null,null,null,null,null,null,null,null,null,null,null,null,null,null,null,null,null,null,null,null,null,null,null,null,null,null,null,null,null,null,null,null,null,null,null,null,null,null,null,null,""]
[null,null,null,null,null,null,null,null,null,null,null,null,null,null,null,null,null,null,null,null,null,null,null,null,null,null,null,null,null,null,null,null,null,null,null,null,null,null,null,null,null,null,null,null,null,null,null,null,null,null,null,null,null,null,null,null,null,null,null,null,null,null,null,null,null,null,null,null,null,null,null,null,null,null,null,null,null,129,999,"",134]
[null,null,null,null,null,null,null,null,null,null,null,null,null,null,null,null,null,null,null,null,null,null,null,null,null,null,null,null,null,null,null,null,null,null,null,null,null,null,null,null,null,null,null,null,null,null,null,null,null,null,null,null,null,null,null,null,null,null,null,null,null,null,null,null,null,null,null,null,null,null,null,null,null,null,null,null,null,129,999,"",251,null,null,null,null,null,null,null,null,null,null,null,null,null,null,null,null,null,null,null,null,null,null,null,null,null,null,null,null,null,null,38]
[null,null,null,null,null,null,null,null,null,null,null,null,null,null,null,null,null,null,null,null,null,null,null,null,null,null,null,null,null,null,null,null,null,null,null,null,null,null,null,null,null,null,null,null,null,null,null,null,null,null,null,null,null,null,null,null,null,null,null,null,null,null,null,null,null,null,null,null,null,null,null,null,null,null,null,null,null,null,null,""]
[null,null,null,null,null,null,null,null,null,null,null,null,null,null,null,null,null,null,null,null,null,null,null,null,null,null,null,null,null,null,null,null,null,null,null,null,null,null,null,null,null,null,null,null,null,null,null,null,null,null,null,null,null,null,null,null,null,null,null,null,null,null,null,null,null,null,null,null,null,null,null,null,null,null,null,null,null,6,null,"",6,null,null,null,null,null,null,null,null,null,null,null,null,null,null,null,null,null,null,null,null,null,null,null,null,null,null,null,null,null,null,162]
[null,null,null,null,null,null,null,null,null,null,null,null,null,null,null,null,null,null,null,null,null,null,null,null,null,null,null,null,null,null,null,null,null,null,null,null,null,null,null,null,null,null,null,null,null,null,null,null,null,null,null,null,null,null,null,null,null,null,null,null,null,null,null,null,null,null,null,null,null,null,null,null,null,null,null,null,null,7,null,"",7]
[null,null,null,null,null,null,null,null,null,null,null,null,null,null,null,null,null,null,null,null,null,null,null,null,null,null,null,null,null,null,null,null,null,null,null,null,null,null,null,null,null,null,null,null,null,null,null,null,null,null,null,null,null,null,null,null,null,null,null,null,null,null,null,null,null,null,null,null,null,null,null,null,null,null,null,null,null,null,null,""]
[null,null,null,null,null,null,null,null,null,null,null,null,null,null,null,null,null,null,null,null,null,null,null,null,null,null,null,null,null,null,null,null,null,null,null,null,null,null,null,null,null,null,null,null,null,null,null,null,null,null,null,null,null,null,null,null,null,null,null,null,null,null,null,null,null,null,null,null,null,null,null,null,null,null,null,null,null,129,999,"",250,null,null,null,null,null,null,null,null,null,null,null,null,null,null,null,null,null,null,null,null,null,null,null,null,null,null,null,null,null,null,62]
[null,null,null,null,null,null,null,null,null,null,null,null,null,null,null,null,null,null,null,null,null,null,null,null,null,null,null,null,null,null,null,null,null,null,null,null,null,null,null,null,null,null,null,null,null,null,null,null,null,null,null,null,null,null,null,null,null,null,null,null,null,null,null,null,null,null,null,null,null,null,null,null,null,null,null,null,null,129,999,"",122]
[null,null,null,null,null,null,null,null,null,null,null,null,null,null,null,null,null,null,null,null,null,null,null,null,null,null,null,null,null,null,null,null,null,null,null,null,null,null,null,null,null,null,null,null,null,null,null,null,null,null,null,null,null,null,null,null,null,null,null,null,null,null,null,null,null,null,null,null,null,null,null,null,null,null,null,null,null,null,null,"",null,null,null,null,null,null,null,null,null,null,null,null,null,null,null,null,null,null,null,null,null,null,null,null,null,null,null,null,null,null,null,163]
[null,null,null,null,null,null,null,null,null,null,null,null,null,null,null,null,null,null,null,null,null,null,null,null,null,null,null,null,null,null,null,null,null,null,null,null,null,null,null,null,null,null,null,null,null,null,null,null,null,null,null,null,null,null,null,null,null,null,null,null,null,null,null,null,null,null,null,null,null,null,null,null,null,null,null,null,null,65,999,"",135]
[null,null,null,null,null,null,null,null,null,null,null,null,null,null,null,null,null,null,null,null,null,null,null,null,null,null,null,null,null,null,null,null,null,null,null,null,null,null,null,null,null,null,null,null,null,null,null,null,null,null,null,null,null,null,null,null,null,null,null,null,null,null,null,null,null,null,null,null,null,null,null,null,null,null,null,null,null,65,999,"",71]
[null,null,null,null,null,null,null,null,null,null,null,null,null,null,null,null,null,null,null,null,null,null,null,null,null,null,null,null,null,null,null,null,null,null,null,null,null,null,null,null,null,null,null,null,null,null,null,null,null,null,null,null,null,null,null,null,null,null,null,null,null,null,null,null,null,null,null,null,null,null,null,null,null,null,null,null,null,null,null,"",null,null,null,null,null,null,null,null,null,null,null,null,null,null,null,null,null,null,null,null,null,null,null,null,null,null,null,null,null,null,null,89]
[null,null,null,null,null,null,null,null,null,null,null,null,null,null,null,null,null,null,null,null,null,null,null,null,null,null,null,null,null,null,null,null,null,null,null,null,null,null,null,null,null,null,null,null,null,null,null,null,null,null,null,null,null,null,null,null,null,null,null,null,null,null,null,null,null,null,null,null,null,null,null,null,null,null,null,null,null,129,999,"",186]
[null,null,null,null,null,null,null,null,null,null,null,null,null,null,null,null,null,null,null,null,null,null,null,null,null,null,null,null,null,null,null,null,null,null,null,null,null,null,null,null,null,null,null,null,null,null,null,null,null,null,null,null,null,null,null,null,null,null,null,null,null,null,null,null,null,null,null,null,null,null,null,null,null,null,null,null,null,129,999,"",58,null,null,null,null,null,null,null,null,null,null,null,null,null,null,null,null,null,null,null,null,null,null,null,null,null,null,null,null,null,null,164]
[null,null,null,null,null,null,null,null,null,null,null,null,null,null,null,null,null,null,null,null,null,null,null,null,null,null,null,null,null,null,null,null,null,null,null,null,null,null,null,null,null,null,null,null,null,null,null,null,null,null,null,null,null,null,null,null,null,null,null,null,null,null,null,null,null,null,null,null,null,null,null,null,null,null,null,null,null,null,null,""]
[null,null,null,null,null,null,null,null,null,null,null,null,null,null,null,null,null,null,null,null,null,null,null,null,null,null,null,null,null,null,null,null,null,null,null,null,null,null,null,null,null,null,null,null,null,null,null,null,null,null,null,null,null,null,null,null,null,null,null,null,null,null,null,null,null,null,null,null,null,null,null,null,null,null,null,null,null,58,999,"",199]
[null,null,null,null,null,null,null,null,null,null,null,null,null,null,null,null,null,null,null,null,null,null,null,null,null,null,null,null,null,null,null,null,null,null,null,null,null,null,null,null,null,null,null,null,null,null,null,null,null,null,null,null,null,null,null,null,null,null,null,null,null,null,null,null,null,null,null,null,null,null,null,null,null,null,null,null,null,55,null,"",39,null,null,null,null,null,null,null,null,null,null,null,null,null,null,null,null,null,null,null,null,null,null,null,null,null,null,null,null,null,null,35]
[null,null,null,null,null,null,null,null,null,null,null,null,null,null,null,null,null,null,null,null,null,null,null,null,null,null,null,null,null,null,null,null,null,null,null,null,null,null,null,null,null,null,null,null,null,null,null,null,null,null,null,null,null,null,null,null,null,null,null,null,null,null,null,null,null,null,null,null,null,null,null,null,null,null,null,null,null,null,null,""]
[null,null,null,null,null,null,null,null,null,null,null,null,null,null,null,null,null,null,null,null,null,null,null,null,null,null,null,null,null,null,null,null,null,null,null,null,null,null,null,null,null,null,null,null,null,null,null,null,null,null,null,null,null,null,null,null,null,null,null,null,null,null,null,null,null,null,null,null,null,null,null,null,null,null,null,null,null,129,55,"",218,null,null,null,null,null,null,null,null,null,null,null,null,null,null,null,null,null,null,null,null,null,null,null,null,null,null,null,null,null,null,165]
[null,null,null,null,null,null,null,null,null,null,null,null,null,null,null,null,null,null,null,null,null,null,null,null,null,null,null,null,null,null,null,null,null,null,null,null,null,null,null,null,null,null,null,null,null,null,null,null,null,null,null,null,null,null,null,null,null,null,null,null,null,null,null,null,null,null,null,null,null,null,null,null,null,null,null,null,null,129,null,"E11",90]
[null,null,null,null,null,null,null,null,null,null,null,null,null,null,null,null,null,null,null,null,null,null,null,null,null,null,null,null,null,null,null,null,null,null,null,null,null,null,null,null,null,null,null,null,null,null,null,null,null,null,null,null,null,null,null,null,null,null,null,null,null,null,null,null,null,null,null,null,null,null,null,null,null,null,null,null,null,null,null,""]
[null,null,null,null,null,null,null,null,null,null,null,null,null,null,null,null,null,null,null,null,null,null,null,null,null,null,null,null,null,null,null,null,null,null,null,null,null,null,null,null,null,null,null,null,null,null,null,null,null,null,null,null,null,null,null,null,null,null,null,null,null,null,null,null,null,null,null,null,null,null,null,null,null,null,null,null,null,65,null,"",167,null,null,null,null,null,null,null,null,null,null,null,null,null,null,null,null,null,null,null,null,null,null,null,null,null,null,null,null,null,null,39]
[null,null,null,null,null,null,null,null,null,null,null,null,null,null,null,null,null,null,null,null,null,null,null,null,null,null,null,null,null,null,null,null,null,null,null,null,null,null,null,null,null,null,null,null,null,null,null,null,null,null,null,null,null,null,null,null,null,null,null,null,null,null,null,null,null,null,null,null,null,null,null,null,null,null,null,null,null,65,null,"",103]
[null,null,null,null,null,null,null,null,null,null,null,null,null,null,null,null,null,null,null,null,null,null,null,null,null,null,null,null,null,null,null,null,null,null,null,null,null,null,null,null,null,null,null,null,null,null,null,null,null,null,null,null,null,null,null,null,null,null,null,null,null,null,null,null,null,null,null,null,null,null,null,null,null,null,null,null,null,null,null,"",null,null,null,null,null,null,null,null,null,null,null,null,null,null,null,null,null,null,null,null,null,null,null,null,null,null,null,null,null,null,null,166]
[null,null,null,null,null,null,null,null,null,null,null,null,null,null,null,null,null,null,null,null,null,null,null,null,null,null,null,null,null,null,null,null,null,null,null,null,null,null,null,null,null,null,null,null,null,null,null,null,null,null,null,null,null,null,null,null,null,null,null,null,null,null,null,null,null,null,null,null,null,null,null,null,null,null,null,null,null,129,null,"E25",154]
[null,null,null,null,null,null,null,null,null,null,null,null,null,null,null,null,null,null,null,null,null,null,null,null,null,null,null,null,null,null,null,null,null,null,null,null,null,null,null,null,null,null,null,null,null,null,null,null,null,null,null,null,null,null,null,null,null,null,null,null,null,null,null,null,null,null,null,null,null,null,null,null,null,null,null,null,null,129,26,"",26]
[null,null,null,null,null,null,null,null,null,null,null,null,null,null,null,null,null,null,null,null,null,null,null,null,null,null,null,null,null,null,null,null,null,null,null,null,null,null,null,null,null,null,null,null,null,null,null,null,null,null,null,null,null,null,null,null,null,null,null,null,null,null,null,null,null,null,null,null,null,null,null,null,null,null,null,null,null,null,null,"",null,null,null,null,null,null,null,null,null,null,null,null,null,null,null,null,null,null,null,null,null,null,null,null,null,null,null,null,null,null,null,83]
[null,null,null,null,null,null,null,null,null,null,null,null,null,null,null,null,null,null,null,null,null,null,null,null,null,null,null,null,null,null,null,null,null,null,null,null,null,null,null,null,null,null,null,null,null,null,null,null,null,null,null,null,null,null,null,null,null,null,null,null,null,null,null,null,null,null,null,null,null,null,null,null,null,null,null,null,null,26,null,"",231]
[null,null,null,null,null,null,null,null,null,null,null,null,null,null,null,null,null,null,null,null,null,null,null,null,null,null,null,null,null,null,null,null,null,null,null,null,null,null,null,null,null,null,null,null,null,null,null,null,null,null,null,null,null,null,null,null,null,null,null,null,null,null,null,null,null,null,null,null,null,null,null,null,null,null,null,null,null,23,null,"",23,null,null,null,null,null,null,null,null,null,null,null,null,null,null,null,null,null,null,null,null,null,null,null,null,null,null,null,null,null,null,167]
[null,null,null,null,null,null,null,null,null,null,null,null,null,null,null,null,null,null,null,null,null,null,null,null,null,null,null,null,null,null,null,null,null,null,null,null,null,null,null,null,null,null,null,null,null,null,null,null,null,null,null,null,null,null,null,null,null,null,null,null,null,null,null,null,null,null,null,null,null,null,null,null,null,null,null,null,null,null,null,""]
[null,null,null,null,null,null,null,null,null,null,null,null,null,null,null,null,null,null,null,null,null,null,null,null,null,null,null,null,null,null,null,null,null,null,null,null,null,null,null,null,null,null,null,null,null,null,null,null,null,null,null,null,null,null,null,null,null,null,null,null,null,null,null,null,null,null,null,null,null,null,null,null,null,null,null,null,null,129,23,"",234]
[null,null,null,null,null,null,null,null,null,null,null,null,null,null,null,null,null,null,null,null,null,null,null,null,null,null,null,null,null,null,null,null,null,null,null,null,null,null,null,null,null,null,null,null,null,null,null,null,null,null,null,null,null,null,null,null,null,null,null,null,null,null,null,null,null,null,null,null,null,null,null,null,null,null,null,null,null,129,null,"",106,null,null,null,null,null,null,null,null,null,null,null,null,null,null,null,null,null,null,null,null,null,null,null,null,null,null,null,null,null,null,72]
[null,null,null,null,null,null,null,null,null,null,null,null,null,null,null,null,null,null,null,null,null,null,null,null,null,null,null,null,null,null,null,null,null,null,null,null,null,null,null,null,null,null,null,null,null,null,null,null,null,null,null,null,null,null,null,null,null,null,null,null,null,null,null,null,null,null,null,null,null,null,null,null,null,null,null,null,null,null,null,""]
[null,null,null,null,null,null,null,null,null,null,null,null,null,null,null,null,null,null,null,null,null,null,null,null,null,null,null,null,null,null,null,null,null,null,null,null,null,null,null,null,null,null,null,null,null,null,null,null,null,null,null,null,null,null,null,null,null,null,null,null,null,null,null,null,null,null,null,null,null,null,null,null,null,null,null,null,null,65,null,"",151,null,null,null,null,null,null,null,null,null,null,null,null,null,null,null,null,null,null,null,null,null,null,null,null,null,null,null,null,null,null,168]
[null,null,null,null,null,null,null,null,null,null,null,null,null,null,null,null,null,null,null,null,null,null,null,null,null,null,null,null,null,null,null,null,null,null,null,null,null,null,null,null,null,null,null,null,null,null,null,null,null,null,null,null,null,null,null,null,null,null,null,null,null,null,null,null,null,null,null,null,null,null,null,null,null,null,null,null,null,65,null,"",87]
[null,null,null,null,null,null,null,null,null,null,null,null,null,null,null,null,null,null,null,null,null,null,null,null,null,null,null,null,null,null,null,null,null,null,null,null,null,null,null,null,null,null,null,null,null,null,null,null,null,null,null,null,null,null,null,null,null,null,null,null,null,null,null,null,null,null,null,null,null,null,null,null,null,null,null,null,null,null,null,""]
[null,null,null,null,null,null,null,null,null,null,null,null,null,null,null,null,null,null,null,null,null,null,null,null,null,null,null,null,null,null,null,null,null,null,null,null,null,null,null,null,null,null,null,null,null,null,null,null,null,null,null,null,null,null,null,null,null,null,null,null,null,null,null,null,null,null,null,null,null,null,null,null,null,null,null,null,null,129,null,"E3",170]
[null,null,null,null,null,null,null,null,null,null,null,null,null,null,null,null,null,null,null,null,null,null,null,null,null,null,null,null,null,null,null,null,null,null,null,null,null,null,null,null,null,null,null,null,null,null,null,null,null,null,null,null,null,null,null,null,null,null,null,null,null,null,null,null,null,null,null,null,null,null,null,null,null,null,null,null,null,129,42,"",42]
[null,null,null,null,null,null,null,null,null,null,null,null,null,null,null,null,null,null,null,null,null,null,null,null,null,null,null,null,null,null,null,null,null,null,null,null,null,null,null,null,null,null,null,null,null,null,null,null,null,null,null,null,null,null,null,null,null,null,null,null,null,null,null,null,null,null,null,null,null,null,null,null,null,null,null,null,null,null,null,""]
[null,null,null,null,null,null,null,null,null,null,null,null,null,null,null,null,null,null,null,null,null,null,null,null,null,null,null,null,null,null,null,null,null,null,null,null,null,null,null,null,null,null,null,null,null,null,null,null,null,null,null,null,null,null,null,null,null,null,null,null,null,null,null,null,null,null,null,null,null,null,null,null,null,null,null,null,null,42,null,"",215]
[null,null,null,null,null,null,null,null,null,null,null,null,null,null,null,null,null,null,null,null,null,null,null,null,null,null,null,null,null,null,null,null,null,null,null,null,null,null,null,null,null,null,null,null,null,null,null,null,null,null,null,null,null,null,null,null,null,null,null,null,null,null,null,null,null,null,null,null,null,null,null,null,null,null,null,null,null,39,null,"",55]
[null,null,null,null,null,null,null,null,null,null,null,null,null,null,null,null,null,null,null,null,null,null,null,null,null,null,null,null,null,null,null,null,null,null,null,null,null,null,null,null,null,null,null,null,null,null,null,null,null,null,null,null,null,null,null,null,null,null,null,null,null,null,null,null,null,null,null,null,null,null,null,null,null,null,null,null,null,null,null,""]
[null,null,null,null,null,null,null,null,null,null,null,null,null,null,null,null,null,null,null,null,null,null,null,null,null,null,null,null,null,null,null,null,null,null,null,null,null,null,null,null,null,null,null,null,null,null,null,null,null,null,null,null,null,null,null,null,null,null,null,null,null,null,null,null,null,null,null,null,null,null,null,null,null,null,null,null,null,129,39,"",202]
[null,null,null,null,null,null,null,null,null,null,null,null,null,null,null,null,null,null,null,null,null,null,null,null,null,null,null,null,null,null,null,null,null,null,null,null,null,null,null,null,null,null,null,null,null,null,null,null,null,null,null,null,null,null,null,null,null,null,null,null,null,null,null,null,null,null,null,null,null,null,null,null,null,null,null,null,null,129,null,"E19",74]
[null,null,null,null,null,null,null,null,null,null,null,null,null,null,null,null,null,null,null,null,null,null,null,null,null,null,null,null,null,null,null,null,null,null,null,null,null,null,null,null,null,null,null,null,null,null,null,null,null,null,null,null,null,null,null,null,null,null,null,null,null,null,null,null,null,null,null,null,null,null,null,null,null,null,null,null,null,null,null,""]
[null,null,null,null,null,null,null,null,null,null,null,null,null,null,null,null,null,null,null,null,null,null,null,null,null,null,null,null,null,null,null,null,null,null,null,null,null,null,null,null,null,null,null,null,null,null,null,null,null,null,null,null,null,null,null,null,null,null,null,null,null,null,null,null,null,null,null,null,null,null,null,null,null,null,null,null,null,65,null,"",183]
[null,null,null,null,null,null,null,null,null,null,null,null,null,null,null,null,null,null,null,null,null,null,null,null,null,null,null,null,null,null,null,null,null,null,null,null,null,null,null,null,null,null,null,null,null,null,null,null,null,null,null,null,null,null,null,null,null,null,null,null,null,null,null,null,null,null,null,null,null,null,null,null,null,null,null,null,null,65,null,"",119]
[null,null,null,null,null,null,null,null,null,null,null,null,null,null,null,null,null,null,null,null,null,null,null,null,null,null,null,null,null,null,null,null,null,null,null,null,null,null,null,null,null,null,null,null,null,null,null,null,null,null,null,null,null,null,null,null,null,null,null,null,null,null,null,null,null,null,null,null,null,null,null,null,null,null,null,null,null,null,null,""]
[null,null,null,null,null,null,null,null,null,null,null,null,null,null,null,null,null,null,null,null,null,null,null,null,null,null,null,null,null,null,null,null,null,null,null,null,null,null,null,null,null,null,null,null,null,null,null,null,null,null,null,null,null,null,null,null,null,null,null,null,null,null,null,null,null,null,null,null,null,null,null,null,null,null,null,null,null,129,null,"",138]
[null,null,null,null,null,null,null,null,null,null,null,null,null,null,null,null,null,null,null,null,null,null,null,null,null,null,null,null,null,null,null,null,null,null,null,null,null,null,null,null,null,null,null,null,null,null,null,null,null,null,null,null,null,null,null,null,null,null,null,null,null,null,null,null,null,null,null,null,null,null,null,null,null,null,null,null,null,129,10,"",10]
[null,null,null,null,null,null,null,null,null,null,null,null,null,null,null,null,null,null,null,null,null,null,null,null,null,null,null,null,null,null,null,null,null,null,null,null,null,null,null,null,null,null,null,null,null,null,null,null,null,null,null,null,null,null,null,null,null,null,null,null,null,null,null,null,null,null,null,null,null,null,null,null,null,null,null,null,null,null,null,""]
[null,null,null,null,null,null,null,null,null,null,null,null,null,null,null,null,null,null,null,null,null,null,null,null,null,null,null,null,null,null,null,null,null,null,null,null,null,null,null,null,null,null,null,null,null,null,null,null,null,null,null,null,null,null,null,null,null,null,null,null,null,null,null,null,null,null,null,null,null,null,null,null,null,null,null,null,null,10,null,"",247]
[null,null,null,null,null,null,null,null,null,null,null,null,null,null,null,null,null,null,null,null,null,null,null,null,null,null,null,null,null,null,null,null,null,null,null,null,null,null,null,null,null,null,null,null,null,null,null,null,null,null,null,null,null,null,null,null,null,null,null,null,null,null,null,null,null,null,null,null,null,null,null,null,null,null,null,null,null,15,null,"",15]
[null,null,null,null,null,null,null,null,null,null,null,null,null,null,null,null,null,null,null,null,null,null,null,null,null,null,null,null,null,null,null,null,null,null,null,null,null,null,null,null,null,null,null,null,null,null,null,null,null,null,null,null,null,null,null,null,null,null,null,null,null,null,null,null,null,null,null,null,null,null,null,null,null,null,null,null,null,null,null,""]
[null,null,null,null,null,null,null,null,null,null,null,null,null,null,null,null,null,null,null,null,null,null,null,null,null,null,null,null,null,null,null,null,null,null,null,null,null,null,null,null,null,null,null,null,null,null,null,null,null,null,null,null,null,null,null,null,null,null,null,null,null,null,null,null,null,null,null,null,null,null,null,null,null,null,null,null,null,129,15,"",242]
[null,null,null,null,null,null,null,null,null,null,null,null,null,null,null,null,null,null,null,null,null,null,null,null,null,null,null,null,null,null,null,null,null,null,null,null,null,null,null,null,null,null,null,null,null,null,null,null,null,null,null,null,null,null,null,null,null,null,null,null,null,null,null,null,null,null,null,null,null,null,null,null,null,null,null,null,null,129,null,"E32",114]
[null,null,null,null,null,null,null,null,null,null,null,null,null,null,null,null,null,null,null,null,null,null,null,null,null,null,null,null,null,null,null,null,null,null,null,null,null,null,null,null,null,null,null,null,null,null,null,null,null,null,null,null,null,null,null,null,null,null,null,null,null,null,null,null,null,null,null,null,null,null,null,null,null,null,null,null,null,null,null,""]
[null,null,null,null,null,null,null,null,null,null,null,null,null,null,null,null,null,null,null,null,null,null,null,null,null,null,null,null,null,null,null,null,null,null,null,null,null,null,null,null,null,null,null,null,null,null,null,null,null,null,null,null,null,null,null,null,null,null,null,null,null,null,null,null,null,null,null,null,null,null,null,null,null,null,null,null,null,65,null,"",143]
[null,null,null,null,null,null,null,null,null,null,null,null,null,null,null,null,null,null,null,null,null,null,null,null,null,null,null,null,null,null,null,null,null,null,null,null,null,null,null,null,null,null,null,null,null,null,null,null,null,null,null,null,null,null,null,null,null,null,null,null,null,null,null,null,null,null,null,null,null,null,null,null,null,null,null,null,null,65,null,"",79]
[null,null,null,null,null,null,null,null,null,null,null,null,null,null,null,null,null,null,null,null,null,null,null,null,null,null,null,null,null,null,null,null,null,null,null,null,null,null,null,null,null,null,null,null,null,null,null,null,null,null,null,null,null,null,null,null,null,null,null,null,null,null,null,null,null,null,null,null,null,null,null,null,null,null,null,null,null,null,null,""]
[null,null,null,null,null,null,null,null,null,null,null,null,null,null,null,null,null,null,null,null,null,null,null,null,null,null,null,null,null,null,null,null,null,null,null,null,null,null,null,null,null,null,null,null,null,null,null,null,null,null,null,null,null,null,null,null,null,null,null,null,null,null,null,null,null,null,null,null,null,null,null,null,null,null,null,null,null,129,null,"E23",178]
[null,null,null,null,null,null,null,null,null,null,null,null,null,null,null,null,null,null,null,null,null,null,null,null,null,null,null,null,null,null,null,null,null,null,null,null,null,null,null,null,null,null,null,null,null,null,null,null,null,null,null,null,null,null,null,null,null,null,null,null,null,null,null,null,null,null,null,null,null,null,null,null,null,null,null,null,null,129,34,"",50]
[null,null,null,null,null,null,null,null,null,null,null,null,null,null,null,null,null,null,null,null,null,null,null,null,null,null,null,null,null,null,null,null,null,null,null,null,null,null,null,null,null,null,null,null,null,null,null,null,null,null,null,null,null,null,null,null,null,null,null,null,null,null,null,null,null,null,null,null,null,null,null,null,null,null,null,null,null,null,null,""]
[null,null,null,null,null,null,null,null,null,null,null,null,null,null,null,null,null,null,null,null,null,null,null,null,null,null,null,null,null,null,null,null,null,null,null,null,null,null,null,null,null,null,null,null,null,null,null,null,null,null,null,null,null,null,null,null,null,null,null,null,null,null,null,null,null,null,null,null,null,null,null,null,null,null,null,null,null,34,null,"",207]
[null,null,null,null,null,null,null,null,null,null,null,null,null,null,null,null,null,null,null,null,null,null,null,null,null,null,null,null,null,null,null,null,null,null,null,null,null,null,null,null,null,null,null,null,null,null,null,null,null,null,null,null,null,null,null,null,null,null,null,null,null,null,null,null,null,null,null,null,null,null,null,null,null,null,null,null,null,47,null,"",47]
[null,null,null,null,null,null,null,null,null,null,null,null,null,null,null,null,null,null,null,null,null,null,null,null,null,null,null,null,null,null,null,null,null,null,null,null,null,null,null,null,null,null,null,null,null,null,null,null,null,null,null,null,null,null,null,null,null,null,null,null,null,null,null,null,null,null,null,null,null,null,null,null,null,null,null,null,null,null,null,""]
[null,null,null,null,null,null,null,null,null,null,null,null,null,null,null,null,null,null,null,null,null,null,null,null,null,null,null,null,null,null,null,null,null,null,null,null,null,null,null,null,null,null,null,null,null,null,null,null,null,null,null,null,null,null,null,null,null,null,null,null,null,null,null,null,null,null,null,null,null,null,null,null,null,null,null,null,null,129,47,"",210]
[null,null,null,null,null,null,null,null,null,null,null,null,null,null,null,null,null,null,null,null,null,null,null,null,null,null,null,null,null,null,null,null,null,null,null,null,null,null,null,null,null,null,null,null,null,null,null,null,null,null,null,null,null,null,null,null,null,null,null,null,null,null,null,null,null,null,null,null,null,null,null,null,null,null,null,null,null,129,null,"E7",82]
[null,null,null,null,null,null,null,null,null,null,null,null,null,null,null,null,null,null,null,null,null,null,null,null,null,null,null,null,null,null,null,null,null,null,null,null,null,null,null,null,null,null,null,null,null,null,null,null,null,null,null,null,null,null,null,null,null,null,null,null,null,null,null,null,null,null,null,null,null,null,null,null,null,null,null,null,null,null,null,""]
[null,null,null,null,null,null,null,null,null,null,null,null,null,null,null,null,null,null,null,null,null,null,null,null,null,null,null,null,null,null,null,null,null,null,null,null,null,null,null,null,null,null,null,null,null,null,null,null,null,null,null,null,null,null,null,null,null,null,null,null,null,null,null,null,null,null,null,null,null,null,null,null,null,null,null,null,null,65,null,"",175]
[null,null,null,null,null,null,null,null,null,null,null,null,null,null,null,null,null,null,null,null,null,null,null,null,null,null,null,null,null,null,null,null,null,null,null,null,null,null,null,null,null,null,null,null,null,null,null,null,null,null,null,null,null,null,null,null,null,null,null,null,null,null,null,null,null,null,null,null,null,null,null,null,null,null,null,null,null,65,null,"",111]
[null,null,null,null,null,null,null,null,null,null,null,null,null,null,null,null,null,null,null,null,null,null,null,null,null,null,null,null,null,null,null,null,null,null,null,null,null,null,null,null,null,null,null,null,null,null,null,null,null,null,null,null,null,null,null,null,null,null,null,null,null,null,null,null,null,null,null,null,null,null,null,null,null,null,null,null,null,null,null,""]
[null,null,null,null,null,null,null,null,null,null,null,null,null,null,null,null,null,null,null,null,null,null,null,null,null,null,null,null,null,null,null,null,null,null,null,null,null,null,null,null,null,null,null,null,null,null,null,null,null,null,null,null,null,null,null,null,null,null,null,null,null,null,null,null,null,null,null,null,null,null,null,null,null,null,null,null,null,129,null,"",146]
[null,null,null,null,null,null,null,null,null,null,null,null,null,null,null,null,null,null,null,null,null,null,null,null,null,null,null,null,null,null,null,null,null,null,null,null,null,null,null,null,null,null,null,null,null,null,null,null,null,null,null,null,null,null,null,null,null,null,null,null,null,null,null,null,null,null,null,null,null,null,null,null,null,null,null,null,null,129,18,"",18]
[null,null,null,null,null,null,null,null,null,null,null,null,null,null,null,null,null,null,null,null,null,null,null,null,null,null,null,null,null,null,null,null,null,null,null,null,null,null,null,null,null,null,null,null,null,null,null,null,null,null,null,null,null,null,null,null,null,null,null,null,null,null,null,null,null,null,null,null,null,null,null,null,null,null,null,null,null,null,null,""]
[null,null,null,null,null,null,null,null,null,null,null,null,null,null,null,null,null,null,null,null,null,null,null,null,null,null,null,null,null,null,null,null,null,null,null,null,null,null,null,null,null,null,null,null,null,null,null,null,null,null,null,null,null,null,null,null,null,null,null,null,null,null,null,null,null,null,null,null,null,null,null,null,null,null,null,null,null,18,null,"",239]
[null,null,null,null,null,null,null,null,null,null,null,null,null,null,null,null,null,null,null,null,null,null,null,null,null,null,null,null,null,null,null,null,null,null,null,null,null,null,null,null,null,null,null,null,null,null,null,null,null,null,null,null,null,null,null,null,null,null,null,null,null,null,null,null,null,null,null,null,null,null,null,null,null,null,null,null,null,31,null,"",31]
[null,null,null,null,null,null,null,null,null,null,null,null,null,null,null,null,null,null,null,null,null,null,null,null,null,null,null,null,null,null,null,null,null,null,null,null,null,null,null,null,null,null,null,null,null,null,null,null,null,null,null,null,null,null,null,null,null,null,null,null,null,null,null,null,null,null,null,null,null,null,null,null,null,null,null,null,null,null,null,""]
[null,null,null,null,null,null,null,null,null,null,null,null,null,null,null,null,null,null,null,null,null,null,null,null,null,null,null,null,null,null,null,null,null,null,null,null,null,null,null,null,null,null,null,null,null,null,null,null,null,null,null,null,null,null,null,null,null,null,null,null,null,null,null,null,null,null,null,null,null,null,null,null,null,null,null,null,null,129,31,"",226]
[null,null,null,null,null,null,null,null,null,null,null,null,null,null,null,null,null,null,null,null,null,null,null,null,null,null,null,null,null,null,null,null,null,null,null,null,null,null,null,null,null,null,null,null,null,null,null,null,null,null,null,null,null,null,null,null,null,null,null,null,null,null,null,null,null,null,null,null,null,null,null,null,null,null,null,null,null,129,null,"",98]
[null,null,null,null,null,null,null,null,null,null,null,null,null,null,null,null,null,null,null,null,null,null,null,null,null,null,null,null,null,null,null,null,null,null,null,null,null,null,null,null,null,null,null,null,null,null,null,null,null,null,null,null,null,null,null,null,null,null,null,null,null,null,null,null,null,null,null,null,null,null,null,null,null,null,null,null,null,null,null,""]
[null,null,null,null,null,null,null,null,null,null,null,null,null,null,null,null,null,null,null,null,null,null,null,null,null,null,null,null,null,null,null,null,null,null,null,null,null,null,null,null,null,null,null,null,null,null,null,null,null,null,null,null,null,null,null,null,null,null,null,null,null,null,null,null,null,null,null,null,null,null,null,null,null,null,null,null,null,65,null,"",159]
[null,null,null,null,null,null,null,null,null,null,null,null,null,null,null,null,null,null,null,null,null,null,null,null,null,null,null,null,null,null,null,null,null,null,null,null,null,null,null,null,null,null,null,null,null,null,null,null,null,null,null,null,null,null,null,null,null,null,null,null,null,null,null,null,null,null,null,null,null,null,null,null,null,null,null,null,null,65,null,"",95]
[null,null,null,null,null,null,null,null,null,null,null,null,null,null,null,null,null,null,null,null,null,null,null,null,null,null,null,null,null,null,null,null,null,null,null,null,null,null,null,null,null,null,null,null,null,null,null,null,null,null,null,null,null,null,null,null,null,null,null,null,null,null,null,null,null,null,null,null,null,null,null,null,null,null,null,null,null,null,null,""]
[null,null,null,null,null,null,null,null,null,null,null,null,null,null,null,null,null,null,null,null,null,null,null,null,null,null,null,null,null,null,null,null,null,null,null,null,null,null,null,null,null,null,null,null,null,null,null,null,null,null,null,null,null,null,null,null,null,null,null,null,null,null,null,null,null,null,null,null,null,null,null,null,null,null,null,null,null,129,null,"E15",162]
[null,null,null,null,null,null,null,null,null,null,null,null,null,null,null,null,null,null,null,null,null,null,null,null,null,null,null,null,null,null,null,null,null,null,null,null,null,null,null,null,null,null,null,null,null,null,null,null,null,null,null,null,null,null,null,null,null,null,null,null,null,null,null,null,null,null,null,null,null,null,null,null,null,null,null,null,null,129,50,"",34]
[null,null,null,null,null,null,null,null,null,null,null,null,null,null,null,null,null,null,null,null,null,null,null,null,null,null,null,null,null,null,null,null,null,null,null,null,null,null,null,null,null,null,null,null,null,null,null,null,null,null,null,null,null,null,null,null,null,null,null,null,null,null,null,null,null,null,null,null,null,null,null,null,null,null,null,null,null,null,null,""]
[null,null,null,null,null,null,null,null,null,null,null,null,null,null,null,null,null,null,null,null,null,null,null,null,null,null,null,null,null,null,null,null,null,null,null,null,null,null,null,null,null,null,null,null,null,null,null,null,null,null,null,null,null,null,null,null,null,null,null,null,null,null,null,null,null,null,null,null,null,null,null,null,null,null,null,null,null,50,null,"",223]
[null,null,null,null,null,null,null,null,null,null,null,null,null,null,null,null,null,null,null,null,null,null,null,null,null,null,null,null,null,null,null,null,null,null,null,null,null,null,null,null,null,null,null,null,null,null,null,null,null,null,null,null,null,null,null,null,null,null,null,null,null,null,null,null,null,null,null,null,null,null,null,null,null,null,null,null,null,63,999,"",63]
[null,null,null,null,null,null,null,null,null,null,null,null,null,null,null,null,null,null,null,null,null,null,null,null,null,null,null,null,null,null,null,null,null,null,null,null,null,null,null,null,null,null,null,null,null,null,null,null,null,null,null,null,null,null,null,null,null,null,null,null,null,null,null,null,null,null,null,null,null,null,null,null,null,null,null,null,null,null,null,""]
[null,null,null,null,null,null,null,null,null,null,null,null,null,null,null,null,null,null,null,null,null,null,null,null,null,null,null,null,null,null,null,null,null,null,null,null,null,null,null,null,null,null,null,null,null,null,null,null,null,null,null,null,null,null,null,null,null,null,null,null,null,null,null,null,null,null,null,null,null,null,null,null,null,null,null,null,null,129,999,"",194]
[null,null,null,null,null,null,null,null,null,null,null,null,null,null,null,null,null,null,null,null,null,null,null,null,null,null,null,null,null,null,null,null,null,null,null,null,null,null,null,null,null,null,null,null,null,null,null,null,null,null,null,null,null,null,null,null,null,null,null,null,null,null,null,null,null,null,null,null,null,null,null,null,null,null,null,null,null,129,999,"",66]
[null,null,null,null,null,null,null,null,null,null,null,null,null,null,null,null,null,null,null,null,null,null,null,null,null,null,null,null,null,null,null,null,null,null,null,null,null,null,null,null,null,null,null,null,null,null,null,null,null,null,null,null,null,null,null,null,null,null,null,null,null,null,null,null,null,null,null,null,null,null,null,null,null,null,null,null,null,null,null,""]
[null,null,null,null,null,null,null,null,null,null,null,null,null,null,null,null,null,null,null,null,null,null,null,null,null,null,null,null,null,null,null,null,null,null,null,null,null,null,null,null,null,null,null,null,null,null,null,null,null,null,null,null,null,null,null,null,null,null,null,null,null,null,null,null,null,null,null,null,null,null,null,null,null,null,null,null,null,65,999,"",191]
[null,null,null,null,null,null,null,null,null,null,null,null,null,null,null,null,null,null,null,null,null,null,null,null,null,null,null,null,null,null,null,null,null,null,null,null,null,null,null,null,null,null,null,null,null,null,null,null,null,null,null,null,null,null,null,null,null,null,null,null,null,null,null,null,null,null,null,null,null,null,null,null,null,null,null,null,null,65,999,"",127]
[null,null,null,null,null,null,null,null,null,null,null,null,null,null,null,null,null,null,null,null,null,null,null,null,null,null,null,null,null,null,null,null,null,null,null,null,null,null,null,null,null,null,null,null,null,null,null,null,null,null,null,null,null,null,null,null,null,null,null,null,null,null,null,null,null,null,null,null,null,null,null,null,null,null,null,null,null,null,null,""]
[null,null,null,null,null,null,null,null,null,null,null,null,null,null,null,null,null,null,null,null,null,null,null,null,null,null,null,null,null,null,null,null,null,null,null,null,null,null,null,null,null,null,null,null,null,null,null,null,null,null,null,null,null,null,null,null,null,null,null,null,null,null,null,null,null,null,null,null,null,null,null,null,null,null,null,null,null,129,999,"",130]
[null,null,null,null,null,null,null,null,null,null,null,null,null,null,null,null,null,null,null,null,null,null,null,null,null,null,null,null,null,null,null,null,null,null,null,null,null,null,null,null,null,null,null,null,null,null,null,null,null,null,null,null,null,null,null,null,null,null,null,null,null,null,null,null,null,null,null,null,null,null,null,null,null,null,null,null,null,129,999,"",255]
[null,null,null,null,null,null,null,null,null,null,null,null,null,null,null,null,null,null,null,null,null,null,null,null,null,null,null,null,null,null,null,null,null,null,null,null,null,null,null,null,null,null,null,null,null,null,null,null,null,null,null,null,null,null,null,null,null,null,null,null,null,null,null,null,null,null,null,null,null,null,null,null,null,null,null,null,null,null,null,""]
[null,null,null,null,null,null,null,null,null,null,null,null,null,null,null,null,null,null,null,null,null,null,null,null,null,null,null,null,null,null,null,null,null,null,null,null,null,null,null,null,null,null,null,null,null,null,null,null,null,null,null,null,null,null,null,null,null,null,null,null,null,null,null,null,null,null,null,null,null,null,null,null,null,null,null,null,null,2,null,"",2]

{"sheet":"Katılım","index":1,"n_rows":203,"n_cols":32,"rows_kept":203,"cut":false,"hidden":false,"merged":[[1,34,2,35],[0,0,0,10],[1,0,1,10]]}
["TÜRKİYE MASA TENİSİ FEDERASYONU                                                                                                                                                                                                                                                                                   İsmail Eren ALICI Küçükler Ferdi-Takım Türkiye Şampiyonası",null,null,null,null,null,null,null,null,null,null,null,null,null,null,null,null,null,null,null,null,null,null,null,null,null,null,"Ferdi","TÜRKİYE MASA TENİSİ FEDERASYONU                                                                                                                                                                                                                                                                                   İsmail Eren ALICI Küçükler Ferdi-Takım Türkiye Şampiyonası"]
["KARMA [ 09-13 Nisan 2025 ÇORUM ]",null,null,null,null,null,null,null,null,null,null,null,null,null,null,null,null,null,null,null,null,null,null,null,null,null,null,"Grup","KARMA [ 09-13 Nisan 2025 ÇORUM ]"]
["No",null,"Total\nPuan","1. Oyuncu","2. Oyuncu","1.Ply İl","2.Ply İl","1.Puan","2.Puan",null,"Total Puan",null,null,null,null,null,null,null,null,null,null,null,null,null,null,null,null,1,"[ Ön Eleme ]","[ Eleme ]","[ Ana Tablo ]","[ Grup ]"]
[1,null,550,"ARAS AYDIN","ARMİN AYDIN","İST","İST",null,null,548,null,null,null,null,null,null,null,null,null,null,null,null,null,null,null,"ARAS AYDIN (İST)","ARMİN AYDIN (İST)"]
[2,0.7090378999710083,548,"BERAT ÖZDEMİR","BELİNAY DAVUŞ","ÇRM","KST",null,null,545,null,null,null,null,null,null,null,null,null,null,null,null,null,null,null,"BERAT ÖZDEMİR (ÇRM)","BELİNAY DAVUŞ (KST)"]
[3,0.81449002027511597,542,"AHMET BERK TÜKENMEZ","ZEYNEP DURAN","İST","İST",null,null,529,null,null,null,null,null,null,null,null,null,null,null,null,null,null,null,"AHMET BERK TÜKENMEZ (İST)","ZEYNEP DURAN (İST)"]
[4,5.6236863136291504E-2,541,"AHMET YİĞİT GÜLENLER","MEDİNE İREM TÜRKAN","GZT","BTM",null,null,523,null,null,null,null,null,null,null,null,null,null,null,null,null,null,null,"AHMET YİĞİT GÜLENLER (GZT)","MEDİNE İREM TÜRKAN (BTM)"]
[5,0.87144583463668823,535,"AKİF EMRE BUCAK","AYBİGE FERİDE ÜSTÜNDAĞ","İST","MĞL",null,null,489,null,null,null,null,null,null,null,null,null,null,null,null,null,null,null,"AKİF EMRE BUCAK (İST)","AYBİGE FERİDE ÜSTÜNDAĞ (MĞL)"]
[6,0.82460212707519531,531,"YİĞİT HÜSEYİN SUBAŞI","ELİF DURU BECER","ÇRM","ÇRM",null,null,476,null,null,null,null,null,null,null,null,null,null,null,null,null,null,null,"YİĞİT HÜSEYİN SUBAŞI (ÇRM)","ELİF DURU BECER (ÇRM)"]
[7,0.82980161905288696,521,"TAYİP YUSUF","ŞEVVAL ALAŞ","BTM","BTM",null,null,467,null,null,null,null,null,null,null,null,null,null,null,null,null,null,null,"TAYİP YUSUF (BTM)","ŞEVVAL ALAŞ (BTM)"]
[8,0.468700110912323,500,"MUHAMMED EMRE KANTİK","DERİN MÜLAZIM","ÇRM","ÇRM",null,null,461,null,null,null,null,null,null,null,null,null,null,null,null,null,null,null,"MUHAMMED EMRE KANTİK (ÇRM)","DERİN MÜLAZIM (ÇRM)"]
[9,0.7090378999710083,495,"ALİ ENES SEREN","ASİYE TUĞÇE KENAR","KNY","KNY",null,null,458,null,null,null,null,null,null,null,null,null,null,null,null,null,null,null,"ALİ ENES SEREN (KNY)","ASİYE TUĞÇE KENAR (KNY)"]
[10,8.0714643001556396E-2,494,"AHMET ÇELİK","HAFSA YURTERİ","ÇRM","İZM",null,null,379,null,null,null,null,null,null,null,null,null,null,null,null,null,null,null,"AHMET ÇELİK (ÇRM)","HAFSA YURTERİ (İZM)"]
[12,4.5352756977081299E-2,490,"MUHAMMED EMİN KABADAYI","EMİNE AYDINAY","BRS","BRS",null,null,274,null,null,null,null,null,null,null,null,null,null,null,null,null,null,null,"MUHAMMED EMİN KABADAYI (BRS)","EMİNE AYDINAY (BRS)"]
[11,0.4140326976776123,490,"CEMAL AYAZ KARTAL","DURU BERİL TOK","YLV","YLV",null,null,232,null,null,null,null,null,null,null,null,null,null,null,null,null,null,null,"CEMAL AYAZ KARTAL (YLV)","DURU BERİL TOK (YLV)"]
[13,null,474,"MUSTAFA YILDIRIM","FEYZA KOÇER","İST","KYS",null,null,224,null,null,null,null,null,null,null,null,null,null,null,null,null,null,null,"MUSTAFA YILDIRIM (İST)","FEYZA KOÇER (KYS)"]
[14,null,453,"DURSUN AYAZ NARMAN","ZEYNEP KALKAN","KRK","HTY",null,null,219,null,null,null,null,null,null,null,null,null,null,null,null,null,null,null,"DURSUN AYAZ NARMAN (KRK)","ZEYNEP KALKAN (HTY)"]
[15,5.3504526615142822E-2,434,"ALİ SAİD AKDOĞAN","ESMA SULTAN SARI","ÇRM","SKR",null,null,218,null,null,null,null,null,null,null,null,null,null,null,null,null,null,null,"ALİ SAİD AKDOĞAN (ÇRM)","ESMA SULTAN SARI (SKR)"]
[17,0.83481717109680176,428,"BEYAZIT BERK DEMİR","ESMA KAMER SÜT","AMS","KYS",null,null,216,null,null,null,null,null,null,null,null,null,null,null,null,null,null,null,"BEYAZIT BERK DEMİR (AMS)","ESMA KAMER SÜT (KYS)"]
[16,0.91371756792068481,421,"AHMET EFE YILMAZ","AYŞE NAR ALPTEKİN","İST","İST",null,null,216,null,null,null,null,null,null,null,null,null,null,null,null,null,null,null,"AHMET EFE YILMAZ (İST)","AYŞE NAR ALPTEKİN (İST)"]
[18,0.27934205532073975,417,"MUSTAFA KAYRA TURAN","CEYDA DÖKMECİ","KNY","KNY",null,null,216,null,null,null,null,null,null,null,null,null,null,null,null,null,null,null,"MUSTAFA KAYRA TURAN (KNY)","CEYDA DÖKMECİ (KNY)"]
[19,0.82980161905288696,367,"CANBERK SEVİNDİK","ELİF NUR KOÇ","ÇRM","ÇRM",null,null,216,null,null,null,null,null,null,null,null,null,null,null,null,null,null,null,"CANBERK SEVİNDİK (ÇRM)","ELİF NUR KOÇ (ÇRM)"]
[20,0.91937708854675293,332,"ALİ BERKE GÜMÜŞ","BURCU AL","KNY","KNY",null,null,208,null,null,null,null,null,null,null,null,null,null,null,null,null,null,null,"ALİ BERKE GÜMÜŞ (KNY)","BURCU AL (KNY)"]
[21,8.0714643001556396E-2,328,"ENSAR AYDIN","İPEK UĞUR","İST","İST",null,null,208,null,null,null,null,null,null,null,null,null,null,null,null,null,null,null,"ENSAR AYDIN (İST)","İPEK UĞUR (İST)"]
[22,0.18601351976394653,325,"KEREM KÖSE","BERRA BAHTİYAR","İST","SKR",null,null,208,null,null,null,null,null,null,null,null,null,null,null,null,null,null,null,"KEREM KÖSE (İST)","BERRA BAHTİYAR (SKR)"]
[23,0.20756113529205322,259,"HÜSEYİN UTKU KIRBAÇ ","BUĞLEM SENA ÇALIŞKAN","İST","SKR",null,null,162,null,null,null,null,null,null,null,null,null,null,null,null,null,null,null,"HÜSEYİN UTKU KIRBAÇ  (İST)","BUĞLEM SENA ÇALIŞKAN (SKR)"]
[24,0.32620620727539063,232,"TOLGAHAN PEKMEZ","ZÜMRA KALKAN","AMS","AMS",null,null,138,null,null,null,null,null,null,null,null,null,null,null,null,null,null,null,"TOLGAHAN PEKMEZ (AMS)","ZÜMRA KALKAN (AMS)"]
[27,0.39047145843505859,230,"KERİM ESAT ODACI","ELA TOPRAK TOKATLI","KNY","KNY",null,null,116,null,null,null,null,null,null,null,null,null,null,null,null,null,null,null,"KERİM ESAT ODACI (KNY)","ELA TOPRAK TOKATLI (KNY)"]
[26,0.50608736276626587,225,"YİĞİT BOLAT","ATİYE ÖZER","ADN","ADN",null,null,116,null,null,null,null,null,null,null,null,null,null,null,null,null,null,null,"YİĞİT BOLAT (ADN)","ATİYE ÖZER (ADN)"]
[28,0.65449941158294678,224,"METEHAN ŞAHİN","ASMİN YAĞMAHAN","GZT","BTM",null,null,108,null,null,null,null,null,null,null,null,null,null,null,null,null,null,null,"METEHAN ŞAHİN (GZT)","ASMİN YAĞMAHAN (BTM)"]
[25,0.93854516744613647,219,"MUHAMMED BELLO","NİSA ÜZÜMCÜ","MRS","BTM",null,null,108,null,null,null,null,null,null,null,null,null,null,null,null,null,null,null,"MUHAMMED BELLO (MRS)","NİSA ÜZÜMCÜ (BTM)"]
[29,0.71273046731948853,218,"MUHAMMED BARIŞ KALKAN","ZEYNEP POLAT","GZT","GZT",null,null,108,null,null,null,null,null,null,null,null,null,null,null,null,null,null,null,"MUHAMMED BARIŞ KALKAN (GZT)","ZEYNEP POLAT (GZT)"]
[31,2.4121999740600586E-4,217,"AKİF EFE ASLANPAY","ZEYNEP ÇAM","MĞL","MĞL",null,null,24,null,null,null,null,null,null,null,null,null,null,null,null,null,null,null,"AKİF EFE ASLANPAY (MĞL)","ZEYNEP ÇAM (MĞL)"]
[30,0.22686600685119629,216,"AKİF EYMEN TURAN","EDA MORAL","İST","İST",null,null,23,null,null,null,null,null,null,null,null,null,null,null,null,null,null,null,"AKİF EYMEN TURAN (İST)","EDA MORAL (İST)"]
[33,0.58916300535202026,216,"KAYA ARSLAN","IRMAK PİŞKİNOĞLU","İST","KRL",null,null,18,null,null,null,null,null,null,null,null,null,null,null,null,null,null,null,"KAYA ARSLAN (İST)","IRMAK PİŞKİNOĞLU (KRL)"]
[35,0.91096431016921997,216,"BERK TURAN","FİRDEVS NUR BİNGÖL","YLV","YLV",null,null,16,null,null,null,null,null,null,null,null,null,null,null,null,null,null,null,"BERK TURAN (YLV)","FİRDEVS NUR BİNGÖL (YLV)"]
[32,0.98609316349029541,216,"FURKAN KONYALI","BURCU ASEL TUNCER","ÇRM","ÇRM",null,null,16,null,null,null,null,null,null,null,null,null,null,null,null,null,null,null,"FURKAN KONYALI (ÇRM)","BURCU ASEL TUNCER (ÇRM)"]
[34,8.0714643001556396E-2,208,"KEREM GÜLLER","ADA MORAL","İST","İST",null,null,"",null,null,null,null,null,null,null,null,null,null,null,null,null,null,null,"KEREM GÜLLER (İST)","ADA MORAL (İST)"]
[37,0.18601351976394653,208,"EYMEN YERDELEN","DEFNE ANIK","SNP","SNP",null,null,"",null,null,null,null,null,null,null,null,null,null,null,null,null,null,null,"EYMEN YERDELEN (SNP)","DEFNE ANIK (SNP)"]
[42,0.2613682746887207,208,"EMİR SARIDOĞAN","GİZEM ÇİĞİL","ADN","ADN",null,null,"",null,null,null,null,null,null,null,null,null,null,null,null,null,null,null,"EMİR SARIDOĞAN (ADN)","GİZEM ÇİĞİL (ADN)"]
[38,0.45797145366668701,208,"AHMET EMİR KALKAN","ECRİN ATASEVER","GZT","MRD",null,null,"",null,null,null,null,null,null,null,null,null,null,null,null,null,null,null,"AHMET EMİR KALKAN (GZT)","ECRİN ATASEVER (MRD)"]
[36,0.5833590030670166,208,"MEHMET TATAR","NİHAN BERA KOÇER","VAN       ","NVŞ",null,null,"",null,null,null,null,null,null,null,null,null,null,null,null,null,null,null,"MEHMET TATAR (VAN       )","NİHAN BERA KOÇER (NVŞ)"]
[39,0.90572983026504517,208,"M. BİLAL ARTUKOĞLU","ŞEVVAL ÖZDEMİR","MRD","İST",null,null,"",null,null,null,null,null,null,null,null,null,null,null,null,null,null,null,"M. BİLAL ARTUKOĞLU (MRD)","ŞEVVAL ÖZDEMİR (İST)"]
[41,0.92295455932617188,171,"İSMAİL TARHAN","HAVİN MUTLU","MRD","MRD",null,null,"",null,null,null,null,null,null,null,null,null,null,null,null,null,null,null,"İSMAİL TARHAN (MRD)","HAVİN MUTLU (MRD)"]
[40,0.99677139520645142,170,"MEHMET FATİH GEZER","CEMRE İPEK YÜTÜK","İST","İST",null,null,"",null,null,null,null,null,null,null,null,null,null,null,null,null,null,null,"MEHMET FATİH GEZER (İST)","CEMRE İPEK YÜTÜK (İST)"]
[43,0.90920412540435791,162,"ATA URAZ BAHADIR","İLKİM EYLÜL YEKREK","MĞL","MĞL",null,null,"",null,null,null,null,null,null,null,null,null,null,null,null,null,null,null,"ATA URAZ BAHADIR (MĞL)","İLKİM EYLÜL YEKREK (MĞL)"]
[44,0.96536445617675781,135,"AHMET URAZ KİRAZ",null,"MĞL",null,null,null,"",null,null,null,null,null,null,null,null,null,null,null,null,null,null,null,"AHMET URAZ KİRAZ (MĞL)",0]
[45,8.1893563270568848E-2,124,"ŞEYHMUS KAPLAN","ZEYNEP ELA ÇELİK","ÇRM","ÇRM",null,null,"",null,null,null,null,null,null,null,null,null,null,null,null,null,null,null,"ŞEYHMUS KAPLAN (ÇRM)","ZEYNEP ELA ÇELİK (ÇRM)"]
[46,8.9641392230987549E-2,121,"MEHMET AKİF TORU","DENİZ BERRA BAYRAM","AMS","KYS",null,null,"",null,null,null,null,null,null,null,null,null,null,null,null,null,null,null,"MEHMET AKİF TORU (AMS)","DENİZ BERRA BAYRAM (KYS)"]
[47,9.5429062843322754E-2,118,"EGE BOLAT","CEREN BUDAK","ADN","ADN",null,null,"",null,null,null,null,null,null,null,null,null,null,null,null,null,null,null,"EGE BOLAT (ADN)","CEREN BUDAK (ADN)"]
[51,2.2629201412200928E-2,116,"KUDRET GÜLMEZLER","FERİDE MELİKE HAMAL","DNZ","DNZ",null,null,"",null,null,null,null,null,null,null,null,null,null,null,null,null,null,null,"KUDRET GÜLMEZLER (DNZ)","FERİDE MELİKE HAMAL (DNZ)"]
[49,0.43026113510131836,116,"EYMEN SAVCI","BEREN BOZKURT","ADN","ADN",null,null,"",null,null,null,null,null,null,null,null,null,null,null,null,null,null,null,"EYMEN SAVCI (ADN)","BEREN BOZKURT (ADN)"]
[48,0.54336059093475342,116,"TAHA DERELİ","BERRA DEMİR","İST","İST",null,null,"",null,null,null,null,null,null,null,null,null,null,null,null,null,null,null,"TAHA DERELİ (İST)","BERRA DEMİR (İST)"]
[50,0.91616398096084595,116,"AHMET İLKER AY","HAFSA TORBALI","KNY","KNY",null,null,"",null,null,null,null,null,null,null,null,null,null,null,null,null,null,null,"AHMET İLKER AY (KNY)","HAFSA TORBALI (KNY)"]
[54,0.45964080095291138,108,"CAFER ASAF ÖZ","ZEYNEP ELİF ÜNSAL","KRK","AMS",null,null,"",null,null,null,null,null,null,null,null,null,null,null,null,null,null,null,"CAFER ASAF ÖZ (KRK)","ZEYNEP ELİF ÜNSAL (AMS)"]
[52,0.59609454870223999,108,"AKİF ÇİĞİL","AYÇA SU DÖŞ","ADN","ADN",null,null,"",null,null,null,null,null,null,null,null,null,null,null,null,null,null,null,"AKİF ÇİĞİL (ADN)","AYÇA SU DÖŞ (ADN)"]
[53,0.75368809700012207,108,"AHMET ERDEM AYDIN","ZEYNEP ÖZÇELİK","KNY","İST",null,null,"",null,null,null,null,null,null,null,null,null,null,null,null,null,null,null,"AHMET ERDEM AYDIN (KNY)","ZEYNEP ÖZÇELİK (İST)"]
[55,0.78399527072906494,108,"ÖMER MUSAB TOY","IRMAK BURAKMAK","BTM","DYB",null,null,"",null,null,null,null,null,null,null,null,null,null,null,null,null,null,null,"ÖMER MUSAB TOY (BTM)","IRMAK BURAKMAK (DYB)"]
[56,0.83273017406463623,108,"ALİ UYGAR YILDIRICI","UMAY ŞAHİN","İST","İST",null,null,"",null,null,null,null,null,null,null,null,null,null,null,null,null,null,null,"ALİ UYGAR YILDIRICI (İST)","UMAY ŞAHİN (İST)"]
[57,null,44,"EYMEN SELİM YILMAZ","EYLÜL ECE BECER","KNY","ÇRM",null,null,"",null,null,null,null,null,null,null,null,null,null,null,null,null,null,null,"EYMEN SELİM YILMAZ (KNY)","EYLÜL ECE BECER (ÇRM)"]
[58,null,27,"CAN ÖZTÜRK","MASAL ÇAYIR","SNP","SNP",null,null,"",null,null,null,null,null,null,null,null,null,null,null,null,null,null,null,"CAN ÖZTÜRK (SNP)","MASAL ÇAYIR (SNP)"]
[59,0.54401397705078125,24,"HÜSEYİN EREN YILMAZ","İPEK ÖZTÜRK","ÇRM","ÇRM",null,null,null,null,null,null,null,null,null,null,null,null,null,null,null,null,null,null,"HÜSEYİN EREN YILMAZ (ÇRM)","İPEK ÖZTÜRK (ÇRM)"]
[60,0.65705496072769165,24,"TUNAY DENİZ SAKINÇ","BEREN SU ZER","ÇRM","ÇRM",null,null,null,null,null,null,null,null,null,null,null,null,null,null,null,null,null,null,"TUNAY DENİZ SAKINÇ (ÇRM)","BEREN SU ZER (ÇRM)"]
[61,0.14998108148574829,23,"AHMET AZİZ YETİM","ÖZÜM ÖZEL","ÇRM","KKTC",null,null,null,null,null,null,null,null,null,null,null,null,null,null,null,null,null,null,"AHMET AZİZ YETİM (ÇRM)","ÖZÜM ÖZEL (KKTC)"]
[62,0.70439577102661133,23,"ÇINAR AYDINLIK","ECE MASAL KAYA","ADN","ADN",null,null,null,null,null,null,null,null,null,null,null,null,null,null,null,null,null,null,"ÇINAR AYDINLIK (ADN)","ECE MASAL KAYA (ADN)"]
[63,null,20,"HAMZA ÖZBEK","GÜLCE DEĞİŞLİ","KNY","KNY",null,null,null,null,null,null,null,null,null,null,null,null,null,null,null,null,null,null,"HAMZA ÖZBEK (KNY)","GÜLCE DEĞİŞLİ (KNY)"]
[65,0.25460189580917358,16,"MUHAMMED EYMEN SOLAK","LİVA ÇEVİK","ÇRM","KKTC",null,null,null,null,null,null,null,null,null,null,null,null,null,null,null,null,null,null,"MUHAMMED EYMEN SOLAK (ÇRM)","LİVA ÇEVİK (KKTC)"]
[64,0.34060657024383545,16,"GOKTUĞ BİÇER","ÖYKÜ DENİZ ERKOÇ","ÇRM","ÇRM",null,null,null,null,null,null,null,null,null,null,null,null,null,null,null,null,null,null,"GOKTUĞ BİÇER (ÇRM)","ÖYKÜ DENİZ ERKOÇ (ÇRM)"]
[67,0.41003668308258057,8,"KEREM URHAN","EZGİ TÜŞEK","ÇRM","DYB",null,null,null,null,null,null,null,null,null,null,null,null,null,null,null,null,null,null,"KEREM URHAN (ÇRM)","EZGİ TÜŞEK (DYB)"]
[66,0.63437193632125854,8,"HASAN ÖZTEKİN","HÜMEYRA ULUÇ","BTM","BTM",null,null,null,null,null,null,null,null,null,null,null,null,null,null,null,null,null,null,"HASAN ÖZTEKİN (BTM)","HÜMEYRA ULUÇ (BTM)"]
[91,1.6988694667816162E-2,"","MUSTAFA YAĞIZ ÖZÇELİK","ASLI ATEŞ","ÇRM","DYB",null,null,null,null,null,null,null,null,null,null,null,null,null,null,null,null,null,null,"MUSTAFA YAĞIZ ÖZÇELİK (ÇRM)","ASLI ATEŞ (DYB)"]
[75,5.0045013427734375E-2,"","TOPRAK ÇALAKOĞLU","SİDELYA YILDIRIM","MĞL","MUĞ",null,null,null,null,null,null,null,null,null,null,null,null,null,null,null,null,null,null,"TOPRAK ÇALAKOĞLU (MĞL)","SİDELYA YILDIRIM (MUĞ)"]
[92,0.10973852872848511,"","EREN GÖKDEMİR","ÖZÜM MİRAY ÖZ","KRK","KRK",null,null,null,null,null,null,null,null,null,null,null,null,null,null,null,null,null,null,"EREN GÖKDEMİR (KRK)","ÖZÜM MİRAY ÖZ (KRK)"]
[97,0.11038684844970703,"","AHMET TALHA ALSANCAK","AYŞE YAREN KAŞKA","KRK","AMS",null,null,null,null,null,null,null,null,null,null,null,null,null,null,null,null,null,null,"AHMET TALHA ALSANCAK (KRK)","AYŞE YAREN KAŞKA (AMS)"]
[107,0.17448407411575317,"","ABDULLAH EYMEN KARMİL","ELİF İKRA ÇAKIR","ORD","ORD",null,null,null,null,null,null,null,null,null,null,null,null,null,null,null,null,null,null,"ABDULLAH EYMEN KARMİL (ORD)","ELİF İKRA ÇAKIR (ORD)"]
[105,0.2035822868347168,null,"ALP TUĞRA DURUKAN","ELİF ALAGÖZ","ORD","ORD",null,null,null,null,null,null,null,null,null,null,null,null,null,null,null,null,null,null,"ALP TUĞRA DURUKAN (ORD)","ELİF ALAGÖZ (ORD)"]
[99,0.20648539066314697,null,"DEMİR YÖNÜ","ECE NAZ AÇIKGÖZ","İST","KRL",null,null,null,null,null,null,null,null,null,null,null,null,null,null,null,null,null,null,"DEMİR YÖNÜ (İST)","ECE NAZ AÇIKGÖZ (KRL)"]
[74,0.20759361982345581,null,"SARP ÇOLAK","ZEHRA NİL DEMİRCAN","TRB","İST",null,null,null,null,null,null,null,null,null,null,null,null,null,null,null,null,null,null,"SARP ÇOLAK (TRB)","ZEHRA NİL DEMİRCAN (İST)"]
[102,0.25844204425811768,null,"EYMEN YAZGAN","ECRİN FİDAN","BRS","BRS",null,null,null,null,null,null,null,null,null,null,null,null,null,null,null,null,null,null,"EYMEN YAZGAN (BRS)","ECRİN FİDAN (BRS)"]
[94,0.29057753086090088,null,"YİĞİT ALİ BALLAROĞLU","ZEHRA ÖZBİLGİ","BYB","BYB",null,null,null,null,null,null,null,null,null,null,null,null,null,null,null,null,null,null,"YİĞİT ALİ BALLAROĞLU (BYB)","ZEHRA ÖZBİLGİ (BYB)"]
[103,0.29558074474334717,null,"HALİM SANCAR","ZEYNEP AKYÜZ","BYB","BYB",null,null,null,null,null,null,null,null,null,null,null,null,null,null,null,null,null,null,"HALİM SANCAR (BYB)","ZEYNEP AKYÜZ (BYB)"]
[77,0.30961751937866211,null,"DEMİR DEMİRCİ","ÖMÜR GÜVEN","SNP","BRS",null,null,null,null,null,null,null,null,null,null,null,null,null,null,null,null,null,null,"DEMİR DEMİRCİ (SNP)","ÖMÜR GÜVEN (BRS)"]
[72,0.31095165014266968,null,"ALİ KESKİN","SEDEF YILDIRIM","YLV","YLV",null,null,null,null,null,null,null,null,null,null,null,null,null,null,null,null,null,null,"ALİ KESKİN (YLV)","SEDEF YILDIRIM (YLV)"]
[109,0.33909070491790771,null,"DEMİR SERT","AZRA USTA","YLV","YLV",null,null,null,null,null,null,null,null,null,null,null,null,null,null,null,null,null,null,"DEMİR SERT (YLV)","AZRA USTA (YLV)"]
[104,0.34418082237243652,null,"MUHAMMED EMİR ÖZEN","NİSA GÜN","AMS","AMS",null,null,null,null,null,null,null,null,null,null,null,null,null,null,null,null,null,null,"MUHAMMED EMİR ÖZEN (AMS)","NİSA GÜN (AMS)"]
[90,0.36468803882598877,null,"YUSUF DURSUN KOCA","SÜEDA SİVAS","AMS","AMS",null,null,null,null,null,null,null,null,null,null,null,null,null,null,null,null,null,null,"YUSUF DURSUN KOCA (AMS)","SÜEDA SİVAS (AMS)"]
[86,0.37581604719161987,null,"MUHAMMED YASİR TORU","ESLEM ÇAVŞAK","AMS","AMS",null,null,null,null,null,null,null,null,null,null,null,null,null,null,null,null,null,null,"MUHAMMED YASİR TORU (AMS)","ESLEM ÇAVŞAK (AMS)"]
[100,0.39887839555740356,null,"BERA AKİF KALKAN","EBRAR TOZLU","AMS","AMS",null,null,null,null,null,null,null,null,null,null,null,null,null,null,null,null,null,null,"BERA AKİF KALKAN (AMS)","EBRAR TOZLU (AMS)"]
[106,0.40103638172149658,null,"BARIŞ ÇAKIR","ÖYKÜ KUBİLAY","KRL","KRL",null,null,null,null,null,null,null,null,null,null,null,null,null,null,null,null,null,null,"BARIŞ ÇAKIR (KRL)","ÖYKÜ KUBİLAY (KRL)"]
[79,0.40638166666030884,null,"ÖMER MALKUŞ","ARNİSA ŞEKER","KRL","ÇRM",null,null,null,null,null,null,null,null,null,null,null,null,null,null,null,null,null,null,"ÖMER MALKUŞ (KRL)","ARNİSA ŞEKER (ÇRM)"]
[110,0.40932327508926392,null,"DEVRİM ÖZTEKİN","TALİA VURAL","KRL","KRL",null,null,null,null,null,null,null,null,null,null,null,null,null,null,null,null,null,null,"DEVRİM ÖZTEKİN (KRL)","TALİA VURAL (KRL)"]
[85,0.40959715843200684,null,"ARMANÇ RODİN ORAKÇI","ZELAL ÖZER","HKR","HKR",null,null,null,null,null,null,null,null,null,null,null,null,null,null,null,null,null,null,"ARMANÇ RODİN ORAKÇI (HKR)","ZELAL ÖZER (HKR)"]
[108,0.42548501491546631,null,"SALİH BOZKIR","BERİTAN ERSÖZ","HKR","HKR",null,null,null,null,null,null,null,null,null,null,null,null,null,null,null,null,null,null,"SALİH BOZKIR (HKR)","BERİTAN ERSÖZ (HKR)"]
[69,0.52822965383529663,null,"YUSUF İSLAM ÇİFTÇİ","GÜLCE KARABIYIK","HKR","İZM",null,null,null,null,null,null,null,null,null,null,null,null,null,null,null,null,null,null,"YUSUF İSLAM ÇİFTÇİ (HKR)","GÜLCE KARABIYIK (İZM)"]
[88,0.54759997129440308,null,"OĞUZHAN ER",null,"HKR",null,null,null,null,null,null,null,null,null,null,null,null,null,null,null,null,null,null,null,"OĞUZHAN ER (HKR)",0]
[93,0.55511325597763062,null,"ZEKİ CİHAN KONUŞUM","SELENNAZ EKER","ADN","ADN",null,null,null,null,null,null,null,null,null,null,null,null,null,null,null,null,null,null,"ZEKİ CİHAN KONUŞUM (ADN)","SELENNAZ EKER (ADN)"]
[101,0.55902218818664551,null,"MUHAMMET SAİD OĞUZ","ECRİN KAHRAMAN","KNY","KYS",null,null,null,null,null,null,null,null,null,null,null,null,null,null,null,null,null,null,"MUHAMMET SAİD OĞUZ (KNY)","ECRİN KAHRAMAN (KYS)"]
[98,0.56398922204971313,null,"ZAHİD EMİR TEMEL","DEFNE ZEYNEP KELES","KNY","AMS",null,null,null,null,null,null,null,null,null,null,null,null,null,null,null,null,null,null,"ZAHİD EMİR TEMEL (KNY)","DEFNE ZEYNEP KELES (AMS)"]
[82,0.57301336526870728,null,"TAHİR EFE ŞAHİN","ASYA BOLAT","KNY","AMS",null,null,null,null,null,null,null,null,null,null,null,null,null,null,null,null,null,null,"TAHİR EFE ŞAHİN (KNY)","ASYA BOLAT (AMS)"]
[73,0.57351952791213989,null,"MUHAMMED EMİN KARAKURT","ADA GARİP","KNY","İST",null,null,null,null,null,null,null,null,null,null,null,null,null,null,null,null,null,null,"MUHAMMED EMİN KARAKURT (KNY)","ADA GARİP (İST)"]
[71,0.65876328945159912,null,"YUNUS BURAK SULAK","ELİF ASYA TAVAN","KNY","KNY",null,null,null,null,null,null,null,null,null,null,null,null,null,null,null,null,null,null,"YUNUS BURAK SULAK (KNY)","ELİF ASYA TAVAN (KNY)"]
[95,0.69254785776138306,null,"MUHAMMED YUSUF ÖZTEKİN","MERVE TUŞEK","BTM","DYB",null,null,null,null,null,null,null,null,null,null,null,null,null,null,null,null,null,null,"MUHAMMED YUSUF ÖZTEKİN (BTM)","MERVE TUŞEK (DYB)"]
[78,0.69460749626159668,null,"ALİ DUMAN","MELİSA ALPAR","BTM","BTM",null,null,null,null,null,null,null,null,null,null,null,null,null,null,null,null,null,null,"ALİ DUMAN (BTM)","MELİSA ALPAR (BTM)"]
[87,0.72455877065658569,null,"BARAN ERDEM","YAĞMUR ALPAR","BTM","BTM",null,null,null,null,null,null,null,null,null,null,null,null,null,null,null,null,null,null,"BARAN ERDEM (BTM)","YAĞMUR ALPAR (BTM)"]
[89,0.80333030223846436,null,"BERAT DAĞTEKİN","EDA ALAŞ","GZT","BTM",null,null,null,null,null,null,null,null,null,null,null,null,null,null,null,null,null,null,"BERAT DAĞTEKİN (GZT)","EDA ALAŞ (BTM)"]
[83,0.80527544021606445,null,"MEHMET KARAVELİOĞLU","ARMİN ŞEKER","ÇRM","ÇRM",null,null,null,null,null,null,null,null,null,null,null,null,null,null,null,null,null,null,"MEHMET KARAVELİOĞLU (ÇRM)","ARMİN ŞEKER (ÇRM)"]
[70,0.8079410195350647,null,"KAYA TEMİR","ELİF SU ERKOÇAK","ÇRM","ÇRM",null,null,null,null,null,null,null,null,null,null,null,null,null,null,null,null,null,null,"KAYA TEMİR (ÇRM)","ELİF SU ERKOÇAK (ÇRM)"]
[81,0.83958613872528076,null,"MERT EMİR YİĞİT","ESLEM BAYKUT","SMS","SMS",null,null,null,null,null,null,null,null,null,null,null,null,null,null,null,null,null,null,"MERT EMİR YİĞİT (SMS)","ESLEM BAYKUT (SMS)"]
[96,0.84142762422561646,null,"SEBAHATTİN SİRAÇ DURMUŞ","BEREN NAZ ERGENÇ","SMS","SMS",null,null,null,null,null,null,null,null,null,null,null,null,null,null,null,null,null,null,"SEBAHATTİN SİRAÇ DURMUŞ (SMS)","BEREN NAZ ERGENÇ (SMS)"]
[76,0.93305230140686035,null,"ENSAR ERFİDAN","ELİF FATIMA DEMİRCİ","VAN       ","NVŞ",null,null,null,null,null,null,null,null,null,null,null,null,null,null,null,null,null,null,"ENSAR ERFİDAN (VAN       )","ELİF FATIMA DEMİRCİ (NVŞ)"]
[68,0.96267825365066528,null,"İSHAK TARHAN","LEYLANUR ATASEVER","MRD","MRD",null,null,null,null,null,null,null,null,null,null,null,null,null,null,null,null,null,null,"İSHAK TARHAN (MRD)","LEYLANUR ATASEVER (MRD)"]
[84,0.98942822217941284,null,"SUHEYB DOĞAN","SARA AĞILDAY","MRD","MRD",null,null,null,null,null,null,null,null,null,null,null,null,null,null,null,null,null,null,"SUHEYB DOĞAN (MRD)","SARA AĞILDAY (MRD)"]
[80,0.99257224798202515,null,"YUSUF EFE GÜL ","ELİS ŞAHAN","İST","İST",null,null,null,null,null,null,null,null,null,null,null,null,null,null,null,null,null,null,"YUSUF EFE GÜL  (İST)","ELİS ŞAHAN (İST)"]
[111,null,null,null,null,null,null,null,null,null,null,null,null,null,null,null,null,null,null,null,null,null,null,null,null,0,0]
[112,null,null,null,null,null,null,null,null,null,null,null,null,null,null,null,null,null,null,null,null,null,null,null,null,0,0]
[113,null,null,null,null,null,null,null,null,null,null,null,null,null,null,null,null,null,null,null,null,null,null,null,null,0,0]
[114,null,null,null,null,null,null,null,null,null,null,null,null,null,null,null,null,null,null,null,null,null,null,null,null,0,0]
[115,null,null,null,null,null,null,null,null,null,null,null,null,null,null,null,null,null,null,null,null,null,null,null,null,0,0]
[116,null,null,null,null,null,null,null,null,null,null,null,null,null,null,null,null,null,null,null,null,null,null,null,null,0,0]
[117,null,null,null,null,null,null,null,null,null,null,null,null,null,null,null,null,null,null,null,null,null,null,null,null,0,0]
[118,null,null,null,null,null,null,null,null,null,null,null,null,null,null,null,null,null,null,null,null,null,null,null,null,0,0]
[119,null,null,null,null,null,null,null,null,null,null,null,null,null,null,null,null,null,null,null,null,null,null,null,null,0,0]
[120,null,null,null,null,null,null,null,null,null,null,null,null,null,null,null,null,null,null,null,null,null,null,null,null,0,0]
[121,null,null,null,null,null,null,null,null,null,null,null,null,null,null,null,null,null,null,null,null,null,null,null,null,0,0]
[122,null,null,null,null,null,null,null,null,null,null,null,null,null,null,null,null,null,null,null,null,null,null,null,null,0,0]
[123,null,null,null,null,null,null,null,null,null,null,null,null,null,null,null,null,null,null,null,null,null,null,null,null,0,0]
[124,null,null,null,null,null,null,null,null,null,null,null,null,null,null,null,null,null,null,null,null,null,null,null,null,0,0]
[125,null,null,null,null,null,null,null,null,null,null,null,null,null,null,null,null,null,null,null,null,null,null,null,null,0,0]
[126,null,null,null,null,null,null,null,null,null,null,null,null,null,null,null,null,null,null,null,null,null,null,null,null,0,0]
[127,null,null,null,null,null,null,null,null,null,null,null,null,null,null,null,null,null,null,null,null,null,null,null,null,0,0]
[128,null,null,null,null,null,null,null,null,null,null,null,null,null,null,null,null,null,null,null,null,null,null,null,null,0,0]
[129,null,null,null,null,null,null,null,null,null,null,null,null,null,null,null,null,null,null,null,null,null,null,null,null,0,0]
[130,null,null,null,null,null,null,null,null,null,null,null,null,null,null,null,null,null,null,null,null,null,null,null,null,0,0]
[131,null,null,null,null,null,null,null,null,null,null,null,null,null,null,null,null,null,null,null,null,null,null,null,null,0,0]
[132,null,null,null,null,null,null,null,null,null,null,null,null,null,null,null,null,null,null,null,null,null,null,null,null,0,0]
[133,null,null,null,null,null,null,null,null,null,null,null,null,null,null,null,null,null,null,null,null,null,null,null,null,0,0]
[134,null,null,null,null,null,null,null,null,null,null,null,null,null,null,null,null,null,null,null,null,null,null,null,null,0,0]
[135,null,null,null,null,null,null,null,null,null,null,null,null,null,null,null,null,null,null,null,null,null,null,null,null,0,0]
[136,null,null,null,null,null,null,null,null,null,null,null,null,null,null,null,null,null,null,null,null,null,null,null,null,0,0]
[137,null,null,null,null,null,null,null,null,null,null,null,null,null,null,null,null,null,null,null,null,null,null,null,null,0,0]
[138,null,null,null,null,null,null,null,null,null,null,null,null,null,null,null,null,null,null,null,null,null,null,null,null,0,0]
[139,null,null,null,null,null,null,null,null,null,null,null,null,null,null,null,null,null,null,null,null,null,null,null,null,0,0]
[140,null,null,null,null,null,null,null,null,null,null,null,null,null,null,null,null,null,null,null,null,null,null,null,null,0,0]
[141,null,null,null,null,null,null,null,null,null,null,null,null,null,null,null,null,null,null,null,null,null,null,null,null,0,0]
[142,null,null,null,null,null,null,null,null,null,null,null,null,null,null,null,null,null,null,null,null,null,null,null,null,0,0]
[143,null,null,null,null,null,null,null,null,null,null,null,null,null,null,null,null,null,null,null,null,null,null,null,null,0,0]
[144,null,null,null,null,null,null,null,null,null,null,null,null,null,null,null,null,null,null,null,null,null,null,null,null,0,0]
[145,null,null,null,null,null,null,null,null,null,null,null,null,null,null,null,null,null,null,null,null,null,null,null,null,0,0]
[146,null,null,null,null,null,null,null,null,null,null,null,null,null,null,null,null,null,null,null,null,null,null,null,null,0,0]
[147,null,null,null,null,null,null,null,null,null,null,null,null,null,null,null,null,null,null,null,null,null,null,null,null,0,0]
[148,null,null,null,null,null,null,null,null,null,null,null,null,null,null,null,null,null,null,null,null,null,null,null,null,0,0]
[149,null,null,null,null,null,null,null,null,null,null,null,null,null,null,null,null,null,null,null,null,null,null,null,null,0,0]
[150,null,null,null,null,null,null,null,null,null,null,null,null,null,null,null,null,null,null,null,null,null,null,null,null,0,0]
[151,null,null,null,null,null,null,null,null,null,null,null,null,null,null,null,null,null,null,null,null,null,null,null,null,0,0]
[152,null,null,null,null,null,null,null,null,null,null,null,null,null,null,null,null,null,null,null,null,null,null,null,null,0,0]
[153,null,null,null,null,null,null,null,null,null,null,null,null,null,null,null,null,null,null,null,null,null,null,null,null,0,0]
[154,null,null,null,null,null,null,null,null,null,null,null,null,null,null,null,null,null,null,null,null,null,null,null,null,0,0]
[155,null,null,null,null,null,null,null,null,null,null,null,null,null,null,null,null,null,null,null,null,null,null,null,null,0,0]
[156,null,null,null,null,null,null,null,null,null,null,null,null,null,null,null,null,null,null,null,null,null,null,null,null,0,0]
[157,null,null,null,null,null,null,null,null,null,null,null,null,null,null,null,null,null,null,null,null,null,null,null,null,0,0]
[158,null,null,null,null,null,null,null,null,null,null,null,null,null,null,null,null,null,null,null,null,null,null,null,null,0,0]
[159,null,null,null,null,null,null,null,null,null,null,null,null,null,null,null,null,null,null,null,null,null,null,null,null,0,0]
[160,null,null,null,null,null,null,null,null,null,null,null,null,null,null,null,null,null,null,null,null,null,null,null,null,0,0]
[161,null,null,null,null,null,null,null,null,null,null,null,null,null,null,null,null,null,null,null,null,null,null,null,null,0,0]
[162,null,null,null,null,null,null,null,null,null,null,null,null,null,null,null,null,null,null,null,null,null,null,null,null,0,0]
[163,null,null,null,null,null,null,null,null,null,null,null,null,null,null,null,null,null,null,null,null,null,null,null,null,0,0]
[164,null,null,null,null,null,null,null,null,null,null,null,null,null,null,null,null,null,null,null,null,null,null,null,null,0,0]
[165,null,null,null,null,null,null,null,null,null,null,null,null,null,null,null,null,null,null,null,null,null,null,null,null,0,0]
[166,null,null,null,null,null,null,null,null,null,null,null,null,null,null,null,null,null,null,null,null,null,null,null,null,0,0]
[167,null,null,null,null,null,null,null,null,null,null,null,null,null,null,null,null,null,null,null,null,null,null,null,null,0,0]
[168,null,null,null,null,null,null,null,null,null,null,null,null,null,null,null,null,null,null,null,null,null,null,null,null,0,0]
[169,null,null,null,null,null,null,null,null,null,null,null,null,null,null,null,null,null,null,null,null,null,null,null,null,0,0]
[170,null,null,null,null,null,null,null,null,null,null,null,null,null,null,null,null,null,null,null,null,null,null,null,null,0,0]
[171,null,null,null,null,null,null,null,null,null,null,null,null,null,null,null,null,null,null,null,null,null,null,null,null,0,0]
[172,null,null,null,null,null,null,null,null,null,null,null,null,null,null,null,null,null,null,null,null,null,null,null,null,0,0]
[173,null,null,null,null,null,null,null,null,null,null,null,null,null,null,null,null,null,null,null,null,null,null,null,null,0,0]
[174,null,null,null,null,null,null,null,null,null,null,null,null,null,null,null,null,null,null,null,null,null,null,null,null,0,0]
[175,null,null,null,null,null,null,null,null,null,null,null,null,null,null,null,null,null,null,null,null,null,null,null,null,0,0]
[176,null,null,null,null,null,null,null,null,null,null,null,null,null,null,null,null,null,null,null,null,null,null,null,null,0,0]
[177,null,null,null,null,null,null,null,null,null,null,null,null,null,null,null,null,null,null,null,null,null,null,null,null,0,0]
[178,null,null,null,null,null,null,null,null,null,null,null,null,null,null,null,null,null,null,null,null,null,null,null,null,0,0]
[179,null,null,null,null,null,null,null,null,null,null,null,null,null,null,null,null,null,null,null,null,null,null,null,null,0,0]
[180,null,null,null,null,null,null,null,null,null,null,null,null,null,null,null,null,null,null,null,null,null,null,null,null,0,0]
[181,null,null,null,null,null,null,null,null,null,null,null,null,null,null,null,null,null,null,null,null,null,null,null,null,0,0]
[182,null,null,null,null,null,null,null,null,null,null,null,null,null,null,null,null,null,null,null,null,null,null,null,null,0,0]
[183,null,null,null,null,null,null,null,null,null,null,null,null,null,null,null,null,null,null,null,null,null,null,null,null,0,0]
[184,null,null,null,null,null,null,null,null,null,null,null,null,null,null,null,null,null,null,null,null,null,null,null,null,0,0]
[185,null,null,null,null,null,null,null,null,null,null,null,null,null,null,null,null,null,null,null,null,null,null,null,null,0,0]
[186,null,null,null,null,null,null,null,null,null,null,null,null,null,null,null,null,null,null,null,null,null,null,null,null,0,0]
[187,null,null,null,null,null,null,null,null,null,null,null,null,null,null,null,null,null,null,null,null,null,null,null,null,0,0]
[188,null,null,null,null,null,null,null,null,null,null,null,null,null,null,null,null,null,null,null,null,null,null,null,null,0,0]
[189,null,null,null,null,null,null,null,null,null,null,null,null,null,null,null,null,null,null,null,null,null,null,null,null,0,0]
[190,null,null,null,null,null,null,null,null,null,null,null,null,null,null,null,null,null,null,null,null,null,null,null,null,0,0]
[191,null,null,null,null,null,null,null,null,null,null,null,null,null,null,null,null,null,null,null,null,null,null,null,null,0,0]
[192,null,null,null,null,null,null,null,null,null,null,null,null,null,null,null,null,null,null,null,null,null,null,null,null,0,0]
[193,null,null,null,null,null,null,null,null,null,null,null,null,null,null,null,null,null,null,null,null,null,null,null,null,0,0]
[194,null,null,null,null,null,null,null,null,null,null,null,null,null,null,null,null,null,null,null,null,null,null,null,null,0,0]
[195,null,null,null,null,null,null,null,null,null,null,null,null,null,null,null,null,null,null,null,null,null,null,null,null,0,0]
[196,null,null,null,null,null,null,null,null,null,null,null,null,null,null,null,null,null,null,null,null,null,null,null,null,0,0]
[197,null,null,null,null,null,null,null,null,null,null,null,null,null,null,null,null,null,null,null,null,null,null,null,null,0,0]
[198,null,null,null,null,null,null,null,null,null,null,null,null,null,null,null,null,null,null,null,null,null,null,null,null,0,0]
[199,null,null,null,null,null,null,null,null,null,null,null,null,null,null,null,null,null,null,null,null,null,null,null,null,0,0]
[200,null,null,null,null,null,null,null,null,null,null,null,null,null,null,null,null,null,null,null,null,null,null,null,null,0,0]

{"sheet":"On_Eleme","index":2,"n_rows":324,"n_cols":54,"rows_kept":324,"cut":false,"hidden":false,"merged":[[0,4,1,7],[2,4,2,7],[3,47,3,48],[3,49,3,50],[3,51,3,52],[3,41,3,42],[3,43,3,44],[3,45,3,46]]}
[null,null,null,null,{"$f":"Katılım!AC1","v":"TÜRKİYE MASA TENİSİ FEDERASYONU                                                                                                                                                                                                                                                                                   İsmail Eren ALICI Küçükler Ferdi-Takım Türkiye Şampiyonası"},null,null,null,null,null,null,null,null,null,null,null,null,null,null,null,null,null,null,null,null,null,null,null,null,null,null,null,null,null,null,null,null,null,null,{"$f":"COUNTIF(BB5:BB70,\">3\")","v":64}]
[]
[null,null,null,null,{"$f":"Katılım!A2&\" \"&Katılım!AC3","v":"KARMA [ 09-13 Nisan 2025 ÇORUM ] [ Ön Eleme ]"}]
[null,null,null,null,"Sporcu","Skor","Galip",null,"Külüp Adı",null,null,"Eleme tablosu ilk turda denk gelip gelmediğinin kontrolü yapılır",null,null,null,null,null,null,null,null,null,null,null,null,null,null,null,null,null,null,null,null,null,null,"#","Date","Time","Table","Competition","Player-A","Player-B","Set1",null,"Set2",null,"Set3",null,"Set4",null,"Set5",null,"Result"]
[null,null,null,null,{"$f":"IFERROR(VLOOKUP(C6,Katılım!$A$4:$AA$301,26,0),0)","v":"SUHEYB DOĞAN (MRD)"},null,null,null,null,null,null,null,null,null,null,null,null,null,null,null,null,null,null,null,null,null,null,null,null,null,null,null,null,null,1,"2025-04-11",null,null,null,{"$f":"E5&\"-\"&E6","v":"SUHEYB DOĞAN (MRD)-SARA AĞILDAY (MRD)"},{"$f":"E8&\"-\"&E9","v":"ALP TUĞRA DURUKAN (ORD)-ELİF ALAGÖZ (ORD)"},null,null,null,null,null,null,null,null,null,null,0,3,{"$f":"LEN(AN5)","v":37}]
[1,"E1",84,null,{"$f":"IFERROR(VLOOKUP(C6,Katılım!$A$4:$AA$301,27,0),0)","v":"SARA AĞILDAY (MRD)"},{"$f":"AZ5","v":0},{"$f":"IF(AND(F6=0,F8=0),\"\",IF(F6>F8,E5,E8))","v":"ALP TUĞRA DURUKAN (ORD)"},null,{"$f":"IFERROR(VLOOKUP(C6,Katılım!$A$4:$H$301,6,0),0)","v":"MRD"},null,null,"E1",1,{"$f":"OFFSET(Sablon!$DN$1,M6,#REF!)","v":{"$error":"#REF!"}},{"$f":"IFERROR(VLOOKUP(N6,Katılım!$A$4:$Z$301,26,0),0)","v":0},{"$f":"IFERROR(VLOOKUP(N6,Katılım!$A$4:$H$301,6,0),0)","v":0},null,null,null,null,null,null,null,null,null,null,null,null,null,null,null,null,null,null,2,"2025-04-11",null,null,null,{"$f":"E10&\"-\"&E11","v":"AHMET AZİZ YETİM (ÇRM)-ÖZÜM ÖZEL (KKTC)"},{"$f":"E13&\"-\"&E14","v":"BARIŞ ÇAKIR (KRL)-ÖYKÜ KUBİLAY (KRL)"},null,null,null,null,null,null,null,null,null,null,3,0,39]
[null,null,null,null,null,null,{"$f":"IF(AND(F6=0,F8=0),\"\",IF(F6>F8,E6,E9))","v":"ELİF ALAGÖZ (ORD)"},null,null,null,null,null,null,null,null,null,null,null,null,null,null,null,null,null,null,null,null,null,null,null,null,null,null,null,3,"2025-04-11",null,null,null,{"$f":"E15&\"-\"&E16","v":"ZEKİ CİHAN KONUŞUM (ADN)-SELENNAZ EKER (ADN)"},{"$f":"E18&\"-\"&E19","v":"ABDULLAH EYMEN KARMİL (ORD)-ELİF İKRA ÇAKIR (ORD)"},null,null,null,null,null,null,null,null,null,null,0,3,44]
["1.1",null,105,null,{"$f":"IFERROR(VLOOKUP(C8,Katılım!$A$4:$AA$301,26,0),0)","v":"ALP TUĞRA DURUKAN (ORD)"},{"$f":"BA5","v":3},null,null,{"$f":"IFERROR(VLOOKUP(C8,Katılım!$A$4:$H$301,6,0),0)","v":"ORD"},null,null,null,null,null,null,null,null,null,null,null,null,null,null,null,null,null,null,null,null,null,null,null,null,null,4,"2025-04-11",null,null,null,{"$f":"E20&\"-\"&E21","v":"AKİF ÇİĞİL (ADN)-AYÇA SU DÖŞ (ADN)"},{"$f":"E23&\"-\"&E24","v":"SALİH BOZKIR (HKR)-BERİTAN ERSÖZ (HKR)"},null,null,null,null,null,null,null,null,null,null,0,3,34]
[null,null,null,null,{"$f":"IFERROR(VLOOKUP(C8,Katılım!$A$4:$AA$301,27,0),0)","v":"ELİF ALAGÖZ (ORD)"},null,null,null,null,null,null,null,null,null,null,null,null,null,null,null,null,null,null,null,null,null,null,null,null,null,null,null,null,null,5,"2025-04-11",null,null,null,{"$f":"E25&\"-\"&E26","v":"DEMİR DEMİRCİ (SNP)-ÖMÜR GÜVEN (BRS)"},{"$f":"E28&\"-\"&E29","v":"DEMİR SERT (YLV)-AZRA USTA (YLV)"},null,null,null,null,null,null,null,null,null,null,0,3,36]
[null,null,null,null,{"$f":"IFERROR(VLOOKUP(C11,Katılım!$A$4:$AA$301,26,0),0)","v":"AHMET AZİZ YETİM (ÇRM)"},null,null,null,null,null,null,null,null,null,null,null,null,null,null,null,null,null,null,null,null,null,null,null,null,null,null,null,null,null,6,"2025-04-11",null,null,null,{"$f":"E30&\"-\"&E31","v":"İSHAK TARHAN (MRD)-LEYLANUR ATASEVER (MRD)"},{"$f":"E33&\"-\"&E34","v":"DEVRİM ÖZTEKİN (KRL)-TALİA VURAL (KRL)"},null,null,null,null,null,null,null,null,null,null,0,3,42]
[2,"E2",61,null,{"$f":"IFERROR(VLOOKUP(C11,Katılım!$A$4:$AA$301,27,0),0)","v":"ÖZÜM ÖZEL (KKTC)"},{"$f":"AZ6","v":3},{"$f":"IF(AND(F11=0,F13=0),\"\",IF(F11>F13,E10,E13))","v":"AHMET AZİZ YETİM (ÇRM)"},null,{"$f":"IFERROR(VLOOKUP(C11,Katılım!$A$4:$H$301,6,0),0)","v":"ÇRM"},null,null,"E2",2,{"$f":"OFFSET(Sablon!$DN$1,M11,#REF!)","v":{"$error":"#REF!"}},{"$f":"IFERROR(VLOOKUP(N11,Katılım!$A$4:$Z$301,26,0),0)","v":0},{"$f":"IFERROR(VLOOKUP(N11,Katılım!$A$4:$H$301,6,0),0)","v":0},null,null,null,null,null,null,null,null,null,null,null,null,null,null,null,null,null,null,7,null,null,null,null,{"$f":"E35&\"-\"&E36","v":"BERA AKİF KALKAN (AMS)-EBRAR TOZLU (AMS)"},{"$f":"E38&\"-\"&E39","v":"0-0"},null,null,null,null,null,null,null,null,null,null,null,null,40]
[null,null,null,null,null,null,{"$f":"IF(AND(F11=0,F13=0),\"\",IF(F11>F13,E11,E14))","v":"ÖZÜM ÖZEL (KKTC)"},null,null,null,null,null,null,null,null,null,null,null,null,null,null,null,null,null,null,null,null,null,null,null,null,null,null,null,8,null,null,null,null,{"$f":"E40&\"-\"&E41","v":"ŞEYHMUS KAPLAN (ÇRM)-ZEYNEP ELA ÇELİK (ÇRM)"},{"$f":"E43&\"-\"&E44","v":"0-0"},null,null,null,null,null,null,null,null,null,null,null,null,43]
["2.2",null,106,null,{"$f":"IFERROR(VLOOKUP(C13,Katılım!$A$4:$AA$301,26,0),0)","v":"BARIŞ ÇAKIR (KRL)"},{"$f":"BA6","v":0},null,null,{"$f":"IFERROR(VLOOKUP(C13,Katılım!$A$4:$H$301,6,0),0)","v":"KRL"},null,null,null,null,null,null,null,null,null,null,null,null,null,null,null,null,null,null,null,null,null,null,null,null,null,9,null,null,null,null,{"$f":"E45&\"-\"&E46","v":"BARAN ERDEM (BTM)-YAĞMUR ALPAR (BTM)"},{"$f":"E48&\"-\"&E49","v":"0-0"},null,null,null,null,null,null,null,null,null,null,null,null,36]
[null,null,null,null,{"$f":"IFERROR(VLOOKUP(C13,Katılım!$A$4:$AA$301,27,0),0)","v":"ÖYKÜ KUBİLAY (KRL)"},null,null,null,null,null,null,null,null,null,null,null,null,null,null,null,null,null,null,null,null,null,null,null,null,null,null,null,null,null,10,null,null,null,null,{"$f":"E50&\"-\"&E51","v":"CAN ÖZTÜRK (SNP)-MASAL ÇAYIR (SNP)"},{"$f":"E53&\"-\"&E54","v":"0-0"},null,null,null,null,null,null,null,null,null,null,null,null,34]
[null,null,null,null,{"$f":"IFERROR(VLOOKUP(C16,Katılım!$A$4:$AA$301,26,0),0)","v":"ZEKİ CİHAN KONUŞUM (ADN)"},null,null,null,null,null,null,null,null,null,null,null,null,null,null,null,null,null,null,null,null,null,null,null,null,null,null,null,null,null,11,null,null,null,null,{"$f":"E55&\"-\"&E56","v":"YUSUF DURSUN KOCA (AMS)-SÜEDA SİVAS (AMS)"},{"$f":"E58&\"-\"&E59","v":"0-0"},null,null,null,null,null,null,null,null,null,null,null,null,41]
[3,"E3",93,null,{"$f":"IFERROR(VLOOKUP(C16,Katılım!$A$4:$AA$301,27,0),0)","v":"SELENNAZ EKER (ADN)"},{"$f":"AZ7","v":0},{"$f":"IF(AND(F16=0,F18=0),\"\",IF(F16>F18,E15,E18))","v":"ABDULLAH EYMEN KARMİL (ORD)"},null,{"$f":"IFERROR(VLOOKUP(C16,Katılım!$A$4:$H$301,6,0),0)","v":"ADN"},null,null,"E3",3,{"$f":"OFFSET(Sablon!$DN$1,M16,#REF!)","v":{"$error":"#REF!"}},{"$f":"IFERROR(VLOOKUP(N16,Katılım!$A$4:$Z$301,26,0),0)","v":0},{"$f":"IFERROR(VLOOKUP(N16,Katılım!$A$4:$H$301,6,0),0)","v":0},null,null,null,null,null,null,null,null,null,null,null,null,null,null,null,null,null,null,12,null,null,null,null,{"$f":"E60&\"-\"&E61","v":"ÖMER MUSAB TOY (BTM)-IRMAK BURAKMAK (DYB)"},{"$f":"E63&\"-\"&E64","v":"0-0"},null,null,null,null,null,null,null,null,null,null,null,null,41]
[null,null,null,null,null,null,{"$f":"IF(AND(F16=0,F18=0),\"\",IF(F16>F18,E16,E19))","v":"ELİF İKRA ÇAKIR (ORD)"},null,null,null,null,null,null,null,null,null,null,null,null,null,null,null,null,null,null,null,null,null,null,null,null,null,null,null,13,null,null,null,null,{"$f":"E65&\"-\"&E66","v":"SARP ÇOLAK (TRB)-ZEHRA NİL DEMİRCAN (İST)"},{"$f":"E68&\"-\"&E69","v":"0-0"},null,null,null,null,null,null,null,null,null,null,null,null,41]
["3.3",null,107,null,{"$f":"IFERROR(VLOOKUP(C18,Katılım!$A$4:$AA$301,26,0),0)","v":"ABDULLAH EYMEN KARMİL (ORD)"},{"$f":"BA7","v":3},null,null,{"$f":"IFERROR(VLOOKUP(C18,Katılım!$A$4:$H$301,6,0),0)","v":"ORD"},null,null,null,null,null,null,null,null,null,null,null,null,null,null,null,null,null,null,null,null,null,null,null,null,null,14,null,null,null,null,{"$f":"E70&\"-\"&E71","v":"YUNUS BURAK SULAK (KNY)-ELİF ASYA TAVAN (KNY)"},{"$f":"E73&\"-\"&E74","v":"0-0"},null,null,null,null,null,null,null,null,null,null,null,null,45]
[null,null,null,null,{"$f":"IFERROR(VLOOKUP(C18,Katılım!$A$4:$AA$301,27,0),0)","v":"ELİF İKRA ÇAKIR (ORD)"},null,null,null,null,null,null,null,null,null,null,null,null,null,null,null,null,null,null,null,null,null,null,null,null,null,null,null,null,null,15,null,null,null,null,{"$f":"E75&\"-\"&E76","v":"HALİM SANCAR (BYB)-ZEYNEP AKYÜZ (BYB)"},{"$f":"E78&\"-\"&E79","v":"0-0"},null,null,null,null,null,null,null,null,null,null,null,null,37]
[null,null,null,null,{"$f":"IFERROR(VLOOKUP(C21,Katılım!$A$4:$AA$301,26,0),0)","v":"AKİF ÇİĞİL (ADN)"},null,null,null,null,null,null,null,null,null,null,null,null,null,null,null,null,null,null,null,null,null,null,null,null,null,null,null,null,null,16,null,null,null,null,{"$f":"E80&\"-\"&E81","v":"EMİR SARIDOĞAN (ADN)-GİZEM ÇİĞİL (ADN)"},{"$f":"E83&\"-\"&E84","v":"0-0"},null,null,null,null,null,null,null,null,null,null,null,null,38]
[4,"E4",52,null,{"$f":"IFERROR(VLOOKUP(C21,Katılım!$A$4:$AA$301,27,0),0)","v":"AYÇA SU DÖŞ (ADN)"},{"$f":"AZ8","v":0},{"$f":"IF(AND(F21=0,F23=0),\"\",IF(F21>F23,E20,E23))","v":"SALİH BOZKIR (HKR)"},null,{"$f":"IFERROR(VLOOKUP(C21,Katılım!$A$4:$H$301,6,0),0)","v":"ADN"},null,null,"E4",4,{"$f":"OFFSET(Sablon!$DN$1,M21,#REF!)","v":{"$error":"#REF!"}},{"$f":"IFERROR(VLOOKUP(N21,Katılım!$A$4:$Z$301,26,0),0)","v":0},{"$f":"IFERROR(VLOOKUP(N21,Katılım!$A$4:$H$301,6,0),0)","v":0},null,null,null,null,null,null,null,null,null,null,null,null,null,null,null,null,null,null,17,null,null,null,null,{"$f":"E85&\"-\"&E86","v":"TAHİR EFE ŞAHİN (KNY)-ASYA BOLAT (AMS)"},{"$f":"E88&\"-\"&E89","v":"0-0"},null,null,null,null,null,null,null,null,null,null,null,null,38]
[null,null,null,null,null,null,{"$f":"IF(AND(F21=0,F23=0),\"\",IF(F21>F23,E21,E24))","v":"BERİTAN ERSÖZ (HKR)"},null,null,null,null,null,null,null,null,null,null,null,null,null,null,null,null,null,null,null,null,null,null,null,null,null,null,null,18,null,null,null,null,{"$f":"E90&\"-\"&E91","v":"HAMZA ÖZBEK (KNY)-GÜLCE DEĞİŞLİ (KNY)"},{"$f":"E93&\"-\"&E94","v":"0-0"},null,null,null,null,null,null,null,null,null,null,null,null,37]
["4.4",null,108,null,{"$f":"IFERROR(VLOOKUP(C23,Katılım!$A$4:$AA$301,26,0),0)","v":"SALİH BOZKIR (HKR)"},{"$f":"BA8","v":3},null,null,{"$f":"IFERROR(VLOOKUP(C23,Katılım!$A$4:$H$301,6,0),0)","v":"HKR"},null,null,null,null,null,null,null,null,null,null,null,null,null,null,null,null,null,null,null,null,null,null,null,null,null,19,null,null,null,null,{"$f":"E95&\"-\"&E96","v":"MUHAMMED YUSUF ÖZTEKİN (BTM)-MERVE TUŞEK (DYB)"},{"$f":"E98&\"-\"&E99","v":"0-0"},null,null,null,null,null,null,null,null,null,null,null,null,46]
[null,null,null,null,{"$f":"IFERROR(VLOOKUP(C23,Katılım!$A$4:$AA$301,27,0),0)","v":"BERİTAN ERSÖZ (HKR)"},null,null,null,null,null,null,null,null,null,null,null,null,null,null,null,null,null,null,null,null,null,null,null,null,null,null,null,null,null,20,null,null,null,null,{"$f":"E100&\"-\"&E101","v":"AHMET İLKER AY (KNY)-HAFSA TORBALI (KNY)"},{"$f":"E103&\"-\"&E104","v":"0-0"},null,null,null,null,null,null,null,null,null,null,null,null,40]
[null,null,null,null,{"$f":"IFERROR(VLOOKUP(C26,Katılım!$A$4:$AA$301,26,0),0)","v":"DEMİR DEMİRCİ (SNP)"},null,null,null,null,null,null,null,null,null,null,null,null,null,null,null,null,null,null,null,null,null,null,null,null,null,null,null,null,null,21,null,null,null,null,{"$f":"E105&\"-\"&E106","v":"ÖMER MALKUŞ (KRL)-ARNİSA ŞEKER (ÇRM)"},{"$f":"E108&\"-\"&E109","v":"0-0"},null,null,null,null,null,null,null,null,null,null,null,null,36]
[5,"E5",77,null,{"$f":"IFERROR(VLOOKUP(C26,Katılım!$A$4:$AA$301,27,0),0)","v":"ÖMÜR GÜVEN (BRS)"},{"$f":"AZ9","v":0},{"$f":"IF(AND(F26=0,F28=0),\"\",IF(F26>F28,E25,E28))","v":"DEMİR SERT (YLV)"},null,{"$f":"IFERROR(VLOOKUP(C26,Katılım!$A$4:$H$301,6,0),0)","v":"SNP"},null,null,"E5",5,{"$f":"OFFSET(Sablon!$DN$1,M26,#REF!)","v":{"$error":"#REF!"}},{"$f":"IFERROR(VLOOKUP(N26,Katılım!$A$4:$Z$301,26,0),0)","v":0},{"$f":"IFERROR(VLOOKUP(N26,Katılım!$A$4:$H$301,6,0),0)","v":0},null,null,null,null,null,null,null,null,null,null,null,null,null,null,null,null,null,null,22,null,null,null,null,{"$f":"E110&\"-\"&E111","v":"HASAN ÖZTEKİN (BTM)-HÜMEYRA ULUÇ (BTM)"},{"$f":"E113&\"-\"&E114","v":"0-0"},null,null,null,null,null,null,null,null,null,null,null,null,38]
[null,null,null,null,null,null,{"$f":"IF(AND(F26=0,F28=0),\"\",IF(F26>F28,E26,E29))","v":"AZRA USTA (YLV)"},null,null,null,null,null,null,null,null,null,null,null,null,null,null,null,null,null,null,null,null,null,null,null,null,null,null,null,23,null,null,null,null,{"$f":"E115&\"-\"&E116","v":"ZAHİD EMİR TEMEL (KNY)-DEFNE ZEYNEP KELES (AMS)"},{"$f":"E118&\"-\"&E119","v":"0-0"},null,null,null,null,null,null,null,null,null,null,null,null,47]
["5.5",null,109,null,{"$f":"IFERROR(VLOOKUP(C28,Katılım!$A$4:$AA$301,26,0),0)","v":"DEMİR SERT (YLV)"},{"$f":"BA9","v":3},null,null,{"$f":"IFERROR(VLOOKUP(C28,Katılım!$A$4:$H$301,6,0),0)","v":"YLV"},null,null,null,null,null,null,null,null,null,null,null,null,null,null,null,null,null,null,null,null,null,null,null,null,null,24,null,null,null,null,{"$f":"E120&\"-\"&E121","v":"EGE BOLAT (ADN)-CEREN BUDAK (ADN)"},{"$f":"E123&\"-\"&E124","v":"0-0"},null,null,null,null,null,null,null,null,null,null,null,null,33]
[null,null,null,null,{"$f":"IFERROR(VLOOKUP(C28,Katılım!$A$4:$AA$301,27,0),0)","v":"AZRA USTA (YLV)"},null,null,null,null,null,null,null,null,null,null,null,null,null,null,null,null,null,null,null,null,null,null,null,null,null,null,null,null,null,25,null,null,null,null,{"$f":"E125&\"-\"&E126","v":"MUSTAFA YAĞIZ ÖZÇELİK (ÇRM)-ASLI ATEŞ (DYB)"},{"$f":"E128&\"-\"&E129","v":"0-0"},null,null,null,null,null,null,null,null,null,null,null,null,43]
[null,null,null,null,{"$f":"IFERROR(VLOOKUP(C31,Katılım!$A$4:$AA$301,26,0),0)","v":"İSHAK TARHAN (MRD)"},null,null,null,null,null,null,null,null,null,null,null,null,null,null,null,null,null,null,null,null,null,null,null,null,null,null,null,null,null,26,null,null,null,null,{"$f":"E130&\"-\"&E131","v":"CAFER ASAF ÖZ (KRK)-ZEYNEP ELİF ÜNSAL (AMS)"},{"$f":"E133&\"-\"&E134","v":"0-0"},null,null,null,null,null,null,null,null,null,null,null,null,43]
[6,"E6",68,null,{"$f":"IFERROR(VLOOKUP(C31,Katılım!$A$4:$AA$301,27,0),0)","v":"LEYLANUR ATASEVER (MRD)"},{"$f":"AZ10","v":0},{"$f":"IF(AND(F31=0,F33=0),\"\",IF(F31>F33,E30,E33))","v":"DEVRİM ÖZTEKİN (KRL)"},null,{"$f":"IFERROR(VLOOKUP(C31,Katılım!$A$4:$H$301,6,0),0)","v":"MRD"},null,null,"E6",6,{"$f":"OFFSET(Sablon!$DN$1,M31,#REF!)","v":{"$error":"#REF!"}},{"$f":"IFERROR(VLOOKUP(N31,Katılım!$A$4:$Z$301,26,0),0)","v":0},{"$f":"IFERROR(VLOOKUP(N31,Katılım!$A$4:$H$301,6,0),0)","v":0},null,null,null,null,null,null,null,null,null,null,null,null,null,null,null,null,null,null,27,null,null,null,null,{"$f":"E135&\"-\"&E136","v":"MUHAMMED EYMEN SOLAK (ÇRM)-LİVA ÇEVİK (KKTC)"},{"$f":"E138&\"-\"&E139","v":"0-0"},null,null,null,null,null,null,null,null,null,null,null,null,44]
[null,null,null,null,null,null,{"$f":"IF(AND(F31=0,F33=0),\"\",IF(F31>F33,E31,E34))","v":"TALİA VURAL (KRL)"},null,null,null,null,null,null,null,null,null,null,null,null,null,null,null,null,null,null,null,null,null,null,null,null,null,null,null,28,null,null,null,null,{"$f":"E140&\"-\"&E141","v":"ENSAR ERFİDAN (VAN       )-ELİF FATIMA DEMİRCİ (NVŞ)"},{"$f":"E143&\"-\"&E144","v":"0-0"},null,null,null,null,null,null,null,null,null,null,null,null,52]
["6.6",null,110,null,{"$f":"IFERROR(VLOOKUP(C33,Katılım!$A$4:$AA$301,26,0),0)","v":"DEVRİM ÖZTEKİN (KRL)"},{"$f":"BA10","v":3},null,null,{"$f":"IFERROR(VLOOKUP(C33,Katılım!$A$4:$H$301,6,0),0)","v":"KRL"},null,null,null,null,null,null,null,null,null,null,null,null,null,null,null,null,null,null,null,null,null,null,null,null,null,29,null,null,null,null,{"$f":"E145&\"-\"&E146","v":"ATA URAZ BAHADIR (MĞL)-İLKİM EYLÜL YEKREK (MĞL)"},{"$f":"E148&\"-\"&E149","v":"0-0"},null,null,null,null,null,null,null,null,null,null,null,null,47]
[null,null,null,null,{"$f":"IFERROR(VLOOKUP(C33,Katılım!$A$4:$AA$301,27,0),0)","v":"TALİA VURAL (KRL)"},null,null,null,null,null,null,null,null,null,null,null,null,null,null,null,null,null,null,null,null,null,null,null,null,null,null,null,null,null,30,null,null,null,null,{"$f":"E150&\"-\"&E151","v":"TUNAY DENİZ SAKINÇ (ÇRM)-BEREN SU ZER (ÇRM)"},{"$f":"E153&\"-\"&E154","v":"0-0"},null,null,null,null,null,null,null,null,null,null,null,null,43]
[null,null,null,null,{"$f":"IFERROR(VLOOKUP(C36,Katılım!$A$4:$AA$301,26,0),0)","v":"BERA AKİF KALKAN (AMS)"},null,null,null,null,null,null,null,null,null,null,null,null,null,null,null,null,null,null,null,null,null,null,null,null,null,null,null,null,null,31,null,null,null,null,{"$f":"E155&\"-\"&E156","v":"YUSUF EFE GÜL  (İST)-ELİS ŞAHAN (İST)"},{"$f":"E158&\"-\"&E159","v":"0-0"},null,null,null,null,null,null,null,null,null,null,null,null,37]
[7,"E7",100,null,{"$f":"IFERROR(VLOOKUP(C36,Katılım!$A$4:$AA$301,27,0),0)","v":"EBRAR TOZLU (AMS)"},{"$f":"AZ11","v":0},{"$f":"IF(AND(F36=0,F38=0),\"\",IF(F36>F38,E35,E38))","v":""},null,{"$f":"IFERROR(VLOOKUP(C36,Katılım!$A$4:$H$301,6,0),0)","v":"AMS"},null,null,"E7",7,{"$f":"OFFSET(Sablon!$DN$1,M36,#REF!)","v":{"$error":"#REF!"}},{"$f":"IFERROR(VLOOKUP(N36,Katılım!$A$4:$Z$301,26,0),0)","v":0},{"$f":"IFERROR(VLOOKUP(N36,Katılım!$A$4:$H$301,6,0),0)","v":0},null,null,null,null,null,null,null,null,null,null,null,null,null,null,null,null,null,null,32,null,null,null,null,{"$f":"E160&\"-\"&E161","v":"AHMET TALHA ALSANCAK (KRK)-AYŞE YAREN KAŞKA (AMS)"},{"$f":"E163&\"-\"&E164","v":"0-0"},null,null,null,null,null,null,null,null,null,null,null,null,49]
[null,null,null,null,null,null,{"$f":"IF(AND(F36=0,F38=0),\"\",IF(F36>F38,E36,E39))","v":""},null,null,null,null,null,null,null,null,null,null,null,null,null,null,null,null,null,null,null,null,null,null,null,null,null,null,null,33,null,null,null,null,{"$f":"E165&\"-\"&E166","v":"EYMEN YAZGAN (BRS)-ECRİN FİDAN (BRS)"},{"$f":"E168&\"-\"&E169","v":"0-0"},null,null,null,null,null,null,null,null,null,null,null,null,{"$f":"LEN(AN37)","v":36}]
["7.7",null,111,null,{"$f":"IFERROR(VLOOKUP(C38,Katılım!$A$4:$AA$301,26,0),0)","v":0},{"$f":"BA11","v":0},null,null,{"$f":"IFERROR(VLOOKUP(C38,Katılım!$A$4:$H$301,6,0),0)","v":0},null,null,null,null,null,null,null,null,null,null,null,null,null,null,null,null,null,null,null,null,null,null,null,null,null,34,null,null,null,null,{"$f":"E170&\"-\"&E171","v":"GOKTUĞ BİÇER (ÇRM)-ÖYKÜ DENİZ ERKOÇ (ÇRM)"},{"$f":"E173&\"-\"&E174","v":"0-0"},null,null,null,null,null,null,null,null,null,null,null,null,{"$f":"LEN(AN38)","v":41}]
[null,null,null,null,{"$f":"IFERROR(VLOOKUP(C38,Katılım!$A$4:$AA$301,27,0),0)","v":0},null,null,null,null,null,null,null,null,null,null,null,null,null,null,null,null,null,null,null,null,null,null,null,null,null,null,null,null,null,35,null,null,null,null,{"$f":"E175&\"-\"&E176","v":"HÜSEYİN EREN YILMAZ (ÇRM)-İPEK ÖZTÜRK (ÇRM)"},{"$f":"E178&\"-\"&E179","v":"0-0"},null,null,null,null,null,null,null,null,null,null,null,null,43]
[null,null,null,null,{"$f":"IFERROR(VLOOKUP(C41,Katılım!$A$4:$AA$301,26,0),0)","v":"ŞEYHMUS KAPLAN (ÇRM)"},null,null,null,null,null,null,null,null,null,null,null,null,null,null,null,null,null,null,null,null,null,null,null,null,null,null,null,null,null,36,null,null,null,null,{"$f":"E180&\"-\"&E181","v":"TOPRAK ÇALAKOĞLU (MĞL)-SİDELYA YILDIRIM (MUĞ)"},{"$f":"E183&\"-\"&E184","v":"0-0"},null,null,null,null,null,null,null,null,null,null,null,null,45]
[8,"E8",45,null,{"$f":"IFERROR(VLOOKUP(C41,Katılım!$A$4:$AA$301,27,0),0)","v":"ZEYNEP ELA ÇELİK (ÇRM)"},{"$f":"AZ12","v":0},{"$f":"IF(AND(F41=0,F43=0),\"\",IF(F41>F43,E40,E43))","v":""},null,{"$f":"IFERROR(VLOOKUP(C41,Katılım!$A$4:$H$301,6,0),0)","v":"ÇRM"},null,null,"E8",8,{"$f":"OFFSET(Sablon!$DN$1,M41,#REF!)","v":{"$error":"#REF!"}},{"$f":"IFERROR(VLOOKUP(N41,Katılım!$A$4:$Z$301,26,0),0)","v":0},{"$f":"IFERROR(VLOOKUP(N41,Katılım!$A$4:$H$301,6,0),0)","v":0},null,null,null,null,null,null,null,null,null,null,null,null,null,null,null,null,null,null,37,null,null,null,null,{"$f":"E185&\"-\"&E186","v":"TAHA DERELİ (İST)-BERRA DEMİR (İST)"},{"$f":"E188&\"-\"&E189","v":"0-0"},null,null,null,null,null,null,null,null,null,null,null,null,35]
[null,null,null,null,null,null,{"$f":"IF(AND(F41=0,F43=0),\"\",IF(F41>F43,E41,E44))","v":""},null,null,null,null,null,null,null,null,null,null,null,null,null,null,null,null,null,null,null,null,null,null,null,null,null,null,null,38,null,null,null,null,{"$f":"E190&\"-\"&E191","v":"EYMEN SAVCI (ADN)-BEREN BOZKURT (ADN)"},{"$f":"E193&\"-\"&E194","v":"0-0"},null,null,null,null,null,null,null,null,null,null,null,null,37]
["8.8",null,112,null,{"$f":"IFERROR(VLOOKUP(C43,Katılım!$A$4:$AA$301,26,0),0)","v":0},{"$f":"BA12","v":0},null,null,{"$f":"IFERROR(VLOOKUP(C43,Katılım!$A$4:$H$301,6,0),0)","v":0},null,null,null,null,null,null,null,null,null,null,null,null,null,null,null,null,null,null,null,null,null,null,null,null,null,39,null,null,null,null,{"$f":"E195&\"-\"&E196","v":"AHMET ERDEM AYDIN (KNY)-ZEYNEP ÖZÇELİK (İST)"},{"$f":"E198&\"-\"&E199","v":"0-0"},null,null,null,null,null,null,null,null,null,null,null,null,44]
[null,null,null,null,{"$f":"IFERROR(VLOOKUP(C43,Katılım!$A$4:$AA$301,27,0),0)","v":0},null,null,null,null,null,null,null,null,null,null,null,null,null,null,null,null,null,null,null,null,null,null,null,null,null,null,null,null,null,40,null,null,null,null,{"$f":"E200&\"-\"&E201","v":"KAYA TEMİR (ÇRM)-ELİF SU ERKOÇAK (ÇRM)"},{"$f":"E203&\"-\"&E204","v":"0-0"},null,null,null,null,null,null,null,null,null,null,null,null,38]
[null,null,null,null,{"$f":"IFERROR(VLOOKUP(C46,Katılım!$A$4:$AA$301,26,0),0)","v":"BARAN ERDEM (BTM)"},null,null,null,null,null,null,null,null,null,null,null,null,null,null,null,null,null,null,null,null,null,null,null,null,null,null,null,null,null,41,null,null,null,null,{"$f":"E205&\"-\"&E206","v":"MUHAMMED YASİR TORU (AMS)-ESLEM ÇAVŞAK (AMS)"},{"$f":"E208&\"-\"&E209","v":"0-0"},null,null,null,null,null,null,null,null,null,null,null,null,44]
[9,"E9",87,null,{"$f":"IFERROR(VLOOKUP(C46,Katılım!$A$4:$AA$301,27,0),0)","v":"YAĞMUR ALPAR (BTM)"},{"$f":"AZ13","v":0},{"$f":"IF(AND(F46=0,F48=0),\"\",IF(F46>F48,E45,E48))","v":""},null,{"$f":"IFERROR(VLOOKUP(C46,Katılım!$A$4:$H$301,6,0),0)","v":"BTM"},null,null,"E9",9,{"$f":"OFFSET(Sablon!$DN$1,M46,#REF!)","v":{"$error":"#REF!"}},{"$f":"IFERROR(VLOOKUP(N46,Katılım!$A$4:$Z$301,26,0),0)","v":0},{"$f":"IFERROR(VLOOKUP(N46,Katılım!$A$4:$H$301,6,0),0)","v":0},null,null,null,null,null,null,null,null,null,null,null,null,null,null,null,null,null,null,42,null,null,null,null,{"$f":"E210&\"-\"&E211","v":"ARMANÇ RODİN ORAKÇI (HKR)-ZELAL ÖZER (HKR)"},{"$f":"E213&\"-\"&E214","v":"0-0"},null,null,null,null,null,null,null,null,null,null,null,null,42]
[null,null,null,null,null,null,{"$f":"IF(AND(F46=0,F48=0),\"\",IF(F46>F48,E46,E49))","v":""},null,null,null,null,null,null,null,null,null,null,null,null,null,null,null,null,null,null,null,null,null,null,null,null,null,null,null,43,null,null,null,null,{"$f":"E215&\"-\"&E216","v":"SEBAHATTİN SİRAÇ DURMUŞ (SMS)-BEREN NAZ ERGENÇ (SMS)"},{"$f":"E218&\"-\"&E219","v":"0-0"},null,null,null,null,null,null,null,null,null,null,null,null,52]
["9.9",null,113,null,{"$f":"IFERROR(VLOOKUP(C48,Katılım!$A$4:$AA$301,26,0),0)","v":0},{"$f":"BA13","v":0},null,null,{"$f":"IFERROR(VLOOKUP(C48,Katılım!$A$4:$H$301,6,0),0)","v":0},null,null,null,null,null,null,null,null,null,null,null,null,null,null,null,null,null,null,null,null,null,null,null,null,null,44,null,null,null,null,{"$f":"E220&\"-\"&E221","v":"EREN GÖKDEMİR (KRK)-ÖZÜM MİRAY ÖZ (KRK)"},{"$f":"E223&\"-\"&E224","v":"0-0"},null,null,null,null,null,null,null,null,null,null,null,null,39]
[null,null,null,null,{"$f":"IFERROR(VLOOKUP(C48,Katılım!$A$4:$AA$301,27,0),0)","v":0},null,null,null,null,null,null,null,null,null,null,null,null,null,null,null,null,null,null,null,null,null,null,null,null,null,null,null,null,null,45,null,null,null,null,{"$f":"E225&\"-\"&E226","v":"AHMET URAZ KİRAZ (MĞL)-0"},{"$f":"E228&\"-\"&E229","v":"0-0"},null,null,null,null,null,null,null,null,null,null,null,null,24]
[null,null,null,null,{"$f":"IFERROR(VLOOKUP(C51,Katılım!$A$4:$AA$301,26,0),0)","v":"CAN ÖZTÜRK (SNP)"},null,null,null,null,null,null,null,null,null,null,null,null,null,null,null,null,null,null,null,null,null,null,null,null,null,null,null,null,null,46,null,null,null,null,{"$f":"E230&\"-\"&E231","v":"YUSUF İSLAM ÇİFTÇİ (HKR)-GÜLCE KARABIYIK (İZM)"},{"$f":"E233&\"-\"&E234","v":"0-0"},null,null,null,null,null,null,null,null,null,null,null,null,46]
[10,"E10",58,null,{"$f":"IFERROR(VLOOKUP(C51,Katılım!$A$4:$AA$301,27,0),0)","v":"MASAL ÇAYIR (SNP)"},{"$f":"AZ14","v":0},{"$f":"IF(AND(F51=0,F53=0),\"\",IF(F51>F53,E50,E53))","v":""},null,{"$f":"IFERROR(VLOOKUP(C51,Katılım!$A$4:$H$301,6,0),0)","v":"SNP"},null,null,"E10",10,{"$f":"OFFSET(Sablon!$DN$1,M51,#REF!)","v":{"$error":"#REF!"}},{"$f":"IFERROR(VLOOKUP(N51,Katılım!$A$4:$Z$301,26,0),0)","v":0},{"$f":"IFERROR(VLOOKUP(N51,Katılım!$A$4:$H$301,6,0),0)","v":0},null,null,null,null,null,null,null,null,null,null,null,null,null,null,null,null,null,null,47,null,null,null,null,{"$f":"E235&\"-\"&E236","v":"MUHAMMET SAİD OĞUZ (KNY)-ECRİN KAHRAMAN (KYS)"},{"$f":"E238&\"-\"&E239","v":"0-0"},null,null,null,null,null,null,null,null,null,null,null,null,45]
[null,null,null,null,null,null,{"$f":"IF(AND(F51=0,F53=0),\"\",IF(F51>F53,E51,E54))","v":""},null,null,null,null,null,null,null,null,null,null,null,null,null,null,null,null,null,null,null,null,null,null,null,null,null,null,null,48,null,null,null,null,{"$f":"E240&\"-\"&E241","v":"MERT EMİR YİĞİT (SMS)-ESLEM BAYKUT (SMS)"},{"$f":"E243&\"-\"&E244","v":"0-0"},null,null,null,null,null,null,null,null,null,null,null,null,40]
["10.10",null,114,null,{"$f":"IFERROR(VLOOKUP(C53,Katılım!$A$4:$AA$301,26,0),0)","v":0},{"$f":"BA14","v":0},null,null,{"$f":"IFERROR(VLOOKUP(C53,Katılım!$A$4:$H$301,6,0),0)","v":0},null,null,null,null,null,null,null,null,null,null,null,null,null,null,null,null,null,null,null,null,null,null,null,null,null,49,null,null,null,null,{"$f":"E245&\"-\"&E246","v":"İSMAİL TARHAN (MRD)-HAVİN MUTLU (MRD)"},{"$f":"E248&\"-\"&E249","v":"0-0"},null,null,null,null,null,null,null,null,null,null,null,null,37]
[null,null,null,null,{"$f":"IFERROR(VLOOKUP(C53,Katılım!$A$4:$AA$301,27,0),0)","v":0},null,null,null,null,null,null,null,null,null,null,null,null,null,null,null,null,null,null,null,null,null,null,null,null,null,null,null,null,null,50,null,null,null,null,{"$f":"E250&\"-\"&E251","v":"DEMİR YÖNÜ (İST)-ECE NAZ AÇIKGÖZ (KRL)"},{"$f":"E253&\"-\"&E254","v":"0-0"},null,null,null,null,null,null,null,null,null,null,null,null,38]
[null,null,null,null,{"$f":"IFERROR(VLOOKUP(C56,Katılım!$A$4:$AA$301,26,0),0)","v":"YUSUF DURSUN KOCA (AMS)"},null,null,null,null,null,null,null,null,null,null,null,null,null,null,null,null,null,null,null,null,null,null,null,null,null,null,null,null,null,51,null,null,null,null,{"$f":"E255&\"-\"&E256","v":"ALİ DUMAN (BTM)-MELİSA ALPAR (BTM)"},{"$f":"E258&\"-\"&E259","v":"0-0"},null,null,null,null,null,null,null,null,null,null,null,null,34]
[11,"E11",90,null,{"$f":"IFERROR(VLOOKUP(C56,Katılım!$A$4:$AA$301,27,0),0)","v":"SÜEDA SİVAS (AMS)"},{"$f":"AZ15","v":0},{"$f":"IF(AND(F56=0,F58=0),\"\",IF(F56>F58,E55,E58))","v":""},null,{"$f":"IFERROR(VLOOKUP(C56,Katılım!$A$4:$H$301,6,0),0)","v":"AMS"},null,null,"E11",11,{"$f":"OFFSET(Sablon!$DN$1,M56,#REF!)","v":{"$error":"#REF!"}},{"$f":"IFERROR(VLOOKUP(N56,Katılım!$A$4:$Z$301,26,0),0)","v":0},{"$f":"IFERROR(VLOOKUP(N56,Katılım!$A$4:$H$301,6,0),0)","v":0},null,null,null,null,null,null,null,null,null,null,null,null,null,null,null,null,null,null,52,null,null,null,null,{"$f":"E260&\"-\"&E261","v":"EYMEN SELİM YILMAZ (KNY)-EYLÜL ECE BECER (ÇRM)"},{"$f":"E263&\"-\"&E264","v":"0-0"},null,null,null,null,null,null,null,null,null,null,null,null,46]
[null,null,null,null,null,null,{"$f":"IF(AND(F56=0,F58=0),\"\",IF(F56>F58,E56,E59))","v":""},null,null,null,null,null,null,null,null,null,null,null,null,null,null,null,null,null,null,null,null,null,null,null,null,null,null,null,53,null,null,null,null,{"$f":"E265&\"-\"&E266","v":"MUHAMMED EMİN KARAKURT (KNY)-ADA GARİP (İST)"},{"$f":"E268&\"-\"&E269","v":"0-0"},null,null,null,null,null,null,null,null,null,null,null,null,44]
["11.11",null,115,null,{"$f":"IFERROR(VLOOKUP(C58,Katılım!$A$4:$AA$301,26,0),0)","v":0},{"$f":"BA15","v":0},null,null,{"$f":"IFERROR(VLOOKUP(C58,Katılım!$A$4:$H$301,6,0),0)","v":0},null,null,null,null,null,null,null,null,null,null,null,null,null,null,null,null,null,null,null,null,null,null,null,null,null,54,null,null,null,null,{"$f":"E270&\"-\"&E271","v":"EYMEN YERDELEN (SNP)-DEFNE ANIK (SNP)"},{"$f":"E273&\"-\"&E274","v":"0-0"},null,null,null,null,null,null,null,null,null,null,null,null,37]
[null,null,null,null,{"$f":"IFERROR(VLOOKUP(C58,Katılım!$A$4:$AA$301,27,0),0)","v":0},null,null,null,null,null,null,null,null,null,null,null,null,null,null,null,null,null,null,null,null,null,null,null,null,null,null,null,null,null,55,null,null,null,null,{"$f":"E275&\"-\"&E276","v":"KUDRET GÜLMEZLER (DNZ)-FERİDE MELİKE HAMAL (DNZ)"},{"$f":"E278&\"-\"&E279","v":"0-0"},null,null,null,null,null,null,null,null,null,null,null,null,48]
[null,null,null,null,{"$f":"IFERROR(VLOOKUP(C61,Katılım!$A$4:$AA$301,26,0),0)","v":"ÖMER MUSAB TOY (BTM)"},null,null,null,null,null,null,null,null,null,null,null,null,null,null,null,null,null,null,null,null,null,null,null,null,null,null,null,null,null,56,null,null,null,null,{"$f":"E280&\"-\"&E281","v":"ALİ UYGAR YILDIRICI (İST)-UMAY ŞAHİN (İST)"},{"$f":"E283&\"-\"&E284","v":"0-0"},null,null,null,null,null,null,null,null,null,null,null,null,42]
[12,"E12",55,null,{"$f":"IFERROR(VLOOKUP(C61,Katılım!$A$4:$AA$301,27,0),0)","v":"IRMAK BURAKMAK (DYB)"},{"$f":"AZ16","v":0},{"$f":"IF(AND(F61=0,F63=0),\"\",IF(F61>F63,E60,E63))","v":""},null,{"$f":"IFERROR(VLOOKUP(C61,Katılım!$A$4:$H$301,6,0),0)","v":"BTM"},null,null,"E12",12,{"$f":"OFFSET(Sablon!$DN$1,M61,#REF!)","v":{"$error":"#REF!"}},{"$f":"IFERROR(VLOOKUP(N61,Katılım!$A$4:$Z$301,26,0),0)","v":0},{"$f":"IFERROR(VLOOKUP(N61,Katılım!$A$4:$H$301,6,0),0)","v":0},null,null,null,null,null,null,null,null,null,null,null,null,null,null,null,null,null,null,57,null,null,null,null,{"$f":"E285&\"-\"&E286","v":"OĞUZHAN ER (HKR)-0"},{"$f":"E288&\"-\"&E289","v":"0-0"},null,null,null,null,null,null,null,null,null,null,null,null,18]
[null,null,null,null,null,null,{"$f":"IF(AND(F61=0,F63=0),\"\",IF(F61>F63,E61,E64))","v":""},null,null,null,null,null,null,null,null,null,null,null,null,null,null,null,null,null,null,null,null,null,null,null,null,null,null,null,58,null,null,null,null,{"$f":"E290&\"-\"&E291","v":"AHMET EMİR KALKAN (GZT)-ECRİN ATASEVER (MRD)"},{"$f":"E293&\"-\"&E294","v":"0-0"},null,null,null,null,null,null,null,null,null,null,null,null,44]
["12.12",null,116,null,{"$f":"IFERROR(VLOOKUP(C63,Katılım!$A$4:$AA$301,26,0),0)","v":0},{"$f":"BA16","v":0},null,null,{"$f":"IFERROR(VLOOKUP(C63,Katılım!$A$4:$H$301,6,0),0)","v":0},null,null,null,null,null,null,null,null,null,null,null,null,null,null,null,null,null,null,null,null,null,null,null,null,null,59,null,null,null,null,{"$f":"E295&\"-\"&E296","v":"ÇINAR AYDINLIK (ADN)-ECE MASAL KAYA (ADN)"},{"$f":"E298&\"-\"&E299","v":"0-0"},null,null,null,null,null,null,null,null,null,null,null,null,41]
[null,null,null,null,{"$f":"IFERROR(VLOOKUP(C63,Katılım!$A$4:$AA$301,27,0),0)","v":0},null,null,null,null,null,null,null,null,null,null,null,null,null,null,null,null,null,null,null,null,null,null,null,null,null,null,null,null,null,60,null,null,null,null,{"$f":"E300&\"-\"&E301","v":"BERAT DAĞTEKİN (GZT)-EDA ALAŞ (BTM)"},{"$f":"E303&\"-\"&E304","v":"0-0"},null,null,null,null,null,null,null,null,null,null,null,null,35]
[null,null,null,null,{"$f":"IFERROR(VLOOKUP(C66,Katılım!$A$4:$AA$301,26,0),0)","v":"SARP ÇOLAK (TRB)"},null,null,null,null,null,null,null,null,null,null,null,null,null,null,null,null,null,null,null,null,null,null,null,null,null,null,null,null,null,61,null,null,null,null,{"$f":"E305&\"-\"&E306","v":"BERK TURAN (YLV)-FİRDEVS NUR BİNGÖL (YLV)"},{"$f":"E308&\"-\"&E309","v":"0-0"},null,null,null,null,null,null,null,null,null,null,null,null,41]
[13,"E13",74,null,{"$f":"IFERROR(VLOOKUP(C66,Katılım!$A$4:$AA$301,27,0),0)","v":"ZEHRA NİL DEMİRCAN (İST)"},{"$f":"AZ17","v":0},{"$f":"IF(AND(F66=0,F68=0),\"\",IF(F66>F68,E65,E68))","v":""},null,{"$f":"IFERROR(VLOOKUP(C66,Katılım!$A$4:$H$301,6,0),0)","v":"TRB"},null,null,"E13",13,{"$f":"OFFSET(Sablon!$DN$1,M66,#REF!)","v":{"$error":"#REF!"}},{"$f":"IFERROR(VLOOKUP(N66,Katılım!$A$4:$Z$301,26,0),0)","v":0},{"$f":"IFERROR(VLOOKUP(N66,Katılım!$A$4:$H$301,6,0),0)","v":0},null,null,null,null,null,null,null,null,null,null,null,null,null,null,null,null,null,null,62,null,null,null,null,{"$f":"E310&\"-\"&E311","v":"M. BİLAL ARTUKOĞLU (MRD)-ŞEVVAL ÖZDEMİR (İST)"},{"$f":"E313&\"-\"&E314","v":"0-0"},null,null,null,null,null,null,null,null,null,null,null,null,45]
[null,null,null,null,null,null,{"$f":"IF(AND(F66=0,F68=0),\"\",IF(F66>F68,E66,E69))","v":""},null,null,null,null,null,null,null,null,null,null,null,null,null,null,null,null,null,null,null,null,null,null,null,null,null,null,null,63,null,null,null,null,{"$f":"E315&\"-\"&E316","v":"MEHMET KARAVELİOĞLU (ÇRM)-ARMİN ŞEKER (ÇRM)"},{"$f":"E318&\"-\"&E319","v":"0-0"},null,null,null,null,null,null,null,null,null,null,null,null,43]
["13.13",null,117,null,{"$f":"IFERROR(VLOOKUP(C68,Katılım!$A$4:$AA$301,26,0),0)","v":0},{"$f":"BA17","v":0},null,null,{"$f":"IFERROR(VLOOKUP(C68,Katılım!$A$4:$H$301,6,0),0)","v":0},null,null,null,null,null,null,null,null,null,null,null,null,null,null,null,null,null,null,null,null,null,null,null,null,null,64,null,null,null,null,{"$f":"E320&\"-\"&E321","v":"ALİ KESKİN (YLV)-SEDEF YILDIRIM (YLV)"},{"$f":"E323&\"-\"&E324","v":"0-0"},null,null,null,null,null,null,null,null,null,null,null,null,37]
[null,null,null,null,{"$f":"IFERROR(VLOOKUP(C68,Katılım!$A$4:$AA$301,27,0),0)","v":0}]
[null,null,null,null,{"$f":"IFERROR(VLOOKUP(C71,Katılım!$A$4:$AA$301,26,0),0)","v":"YUNUS BURAK SULAK (KNY)"}]
[14,"E14",71,null,{"$f":"IFERROR(VLOOKUP(C71,Katılım!$A$4:$AA$301,27,0),0)","v":"ELİF ASYA TAVAN (KNY)"},{"$f":"AZ18","v":0},{"$f":"IF(AND(F71=0,F73=0),\"\",IF(F71>F73,E70,E73))","v":""},null,{"$f":"IFERROR(VLOOKUP(C71,Katılım!$A$4:$H$301,6,0),0)","v":"KNY"},null,null,"E14",14,{"$f":"OFFSET(Sablon!$DN$1,M71,#REF!)","v":{"$error":"#REF!"}},{"$f":"IFERROR(VLOOKUP(N71,Katılım!$A$4:$Z$301,26,0),0)","v":0},{"$f":"IFERROR(VLOOKUP(N71,Katılım!$A$4:$H$301,6,0),0)","v":0}]
[null,null,null,null,null,null,{"$f":"IF(AND(F71=0,F73=0),\"\",IF(F71>F73,E71,E74))","v":""}]
["14.14",null,118,null,{"$f":"IFERROR(VLOOKUP(C73,Katılım!$A$4:$AA$301,26,0),0)","v":0},{"$f":"BA18","v":0},null,null,{"$f":"IFERROR(VLOOKUP(C73,Katılım!$A$4:$H$301,6,0),0)","v":0}]
[null,null,null,null,{"$f":"IFERROR(VLOOKUP(C73,Katılım!$A$4:$AA$301,27,0),0)","v":0}]
[null,null,null,null,{"$f":"IFERROR(VLOOKUP(C76,Katılım!$A$4:$AA$301,26,0),0)","v":"HALİM SANCAR (BYB)"}]
[15,"E15",103,null,{"$f":"IFERROR(VLOOKUP(C76,Katılım!$A$4:$AA$301,27,0),0)","v":"ZEYNEP AKYÜZ (BYB)"},{"$f":"AZ19","v":0},{"$f":"IF(AND(F76=0,F78=0),\"\",IF(F76>F78,E75,E78))","v":""},null,{"$f":"IFERROR(VLOOKUP(C76,Katılım!$A$4:$H$301,6,0),0)","v":"BYB"},null,null,"E15",15,{"$f":"OFFSET(Sablon!$DN$1,M76,#REF!)","v":{"$error":"#REF!"}},{"$f":"IFERROR(VLOOKUP(N76,Katılım!$A$4:$Z$301,26,0),0)","v":0},{"$f":"IFERROR(VLOOKUP(N76,Katılım!$A$4:$H$301,6,0),0)","v":0}]
[null,null,null,null,null,null,{"$f":"IF(AND(F76=0,F78=0),\"\",IF(F76>F78,E76,E79))","v":""}]
["15.15",null,119,null,{"$f":"IFERROR(VLOOKUP(C78,Katılım!$A$4:$AA$301,26,0),0)","v":0},{"$f":"BA19","v":0},null,null,{"$f":"IFERROR(VLOOKUP(C78,Katılım!$A$4:$H$301,6,0),0)","v":0}]
[null,null,null,null,{"$f":"IFERROR(VLOOKUP(C78,Katılım!$A$4:$AA$301,27,0),0)","v":0}]
[null,null,null,null,{"$f":"IFERROR(VLOOKUP(C81,Katılım!$A$4:$AA$301,26,0),0)","v":"EMİR SARIDOĞAN (ADN)"}]
[16,"E16",42,null,{"$f":"IFERROR(VLOOKUP(C81,Katılım!$A$4:$AA$301,27,0),0)","v":"GİZEM ÇİĞİL (ADN)"},{"$f":"AZ20","v":0},{"$f":"IF(AND(F81=0,F83=0),\"\",IF(F81>F83,E80,E83))","v":""},null,{"$f":"IFERROR(VLOOKUP(C81,Katılım!$A$4:$H$301,6,0),0)","v":"ADN"},null,null,"E16",16,{"$f":"OFFSET(Sablon!$DN$1,M81,#REF!)","v":{"$error":"#REF!"}},{"$f":"IFERROR(VLOOKUP(N81,Katılım!$A$4:$Z$301,26,0),0)","v":0},{"$f":"IFERROR(VLOOKUP(N81,Katılım!$A$4:$H$301,6,0),0)","v":0}]
[null,null,null,null,null,null,{"$f":"IF(AND(F81=0,F83=0),\"\",IF(F81>F83,E81,E84))","v":""}]
["16.16",null,120,null,{"$f":"IFERROR(VLOOKUP(C83,Katılım!$A$4:$AA$301,26,0),0)","v":0},{"$f":"BA20","v":0},null,null,{"$f":"IFERROR(VLOOKUP(C83,Katılım!$A$4:$H$301,6,0),0)","v":0}]
[null,null,null,null,{"$f":"IFERROR(VLOOKUP(C83,Katılım!$A$4:$AA$301,27,0),0)","v":0}]
[null,null,null,null,{"$f":"IFERROR(VLOOKUP(C86,Katılım!$A$4:$AA$301,26,0),0)","v":"TAHİR EFE ŞAHİN (KNY)"}]
[17,"E17",82,null,{"$f":"IFERROR(VLOOKUP(C86,Katılım!$A$4:$AA$301,27,0),0)","v":"ASYA BOLAT (AMS)"},{"$f":"AZ21","v":0},{"$f":"IF(AND(F86=0,F88=0),\"\",IF(F86>F88,E85,E88))","v":""},null,{"$f":"IFERROR(VLOOKUP(C86,Katılım!$A$4:$H$301,6,0),0)","v":"KNY"},null,null,"E17",17,{"$f":"OFFSET(Sablon!$DN$1,M86,#REF!)","v":{"$error":"#REF!"}},{"$f":"IFERROR(VLOOKUP(N86,Katılım!$A$4:$Z$301,26,0),0)","v":0},{"$f":"IFERROR(VLOOKUP(N86,Katılım!$A$4:$H$301,6,0),0)","v":0}]
[null,null,null,null,null,null,{"$f":"IF(AND(F86=0,F88=0),\"\",IF(F86>F88,E86,E89))","v":""}]
["17.17",null,121,null,{"$f":"IFERROR(VLOOKUP(C88,Katılım!$A$4:$AA$301,26,0),0)","v":0},{"$f":"BA21","v":0},null,null,{"$f":"IFERROR(VLOOKUP(C88,Katılım!$A$4:$H$301,6,0),0)","v":0}]
[null,null,null,null,{"$f":"IFERROR(VLOOKUP(C88,Katılım!$A$4:$AA$301,27,0),0)","v":0}]
[null,null,null,null,{"$f":"IFERROR(VLOOKUP(C91,Katılım!$A$4:$AA$301,26,0),0)","v":"HAMZA ÖZBEK (KNY)"}]
[18,"E18",63,null,{"$f":"IFERROR(VLOOKUP(C91,Katılım!$A$4:$AA$301,27,0),0)","v":"GÜLCE DEĞİŞLİ (KNY)"},{"$f":"AZ22","v":0},{"$f":"IF(AND(F91=0,F93=0),\"\",IF(F91>F93,E90,E93))","v":""},null,{"$f":"IFERROR(VLOOKUP(C91,Katılım!$A$4:$H$301,6,0),0)","v":"KNY"},null,null,"E18",18,{"$f":"OFFSET(Sablon!$DN$1,M91,#REF!)","v":{"$error":"#REF!"}},{"$f":"IFERROR(VLOOKUP(N91,Katılım!$A$4:$Z$301,26,0),0)","v":0},{"$f":"IFERROR(VLOOKUP(N91,Katılım!$A$4:$H$301,6,0),0)","v":0}]
[null,null,null,null,null,null,{"$f":"IF(AND(F91=0,F93=0),\"\",IF(F91>F93,E91,E94))","v":""}]
["18.18",null,122,null,{"$f":"IFERROR(VLOOKUP(C93,Katılım!$A$4:$AA$301,26,0),0)","v":0},{"$f":"BA22","v":0},null,null,{"$f":"IFERROR(VLOOKUP(C93,Katılım!$A$4:$H$301,6,0),0)","v":0}]
[null,null,null,null,{"$f":"IFERROR(VLOOKUP(C93,Katılım!$A$4:$AA$301,27,0),0)","v":0}]
[null,null,null,null,{"$f":"IFERROR(VLOOKUP(C96,Katılım!$A$4:$AA$301,26,0),0)","v":"MUHAMMED YUSUF ÖZTEKİN (BTM)"}]
[19,"E19",95,null,{"$f":"IFERROR(VLOOKUP(C96,Katılım!$A$4:$AA$301,27,0),0)","v":"MERVE TUŞEK (DYB)"},{"$f":"AZ23","v":0},{"$f":"IF(AND(F96=0,F98=0),\"\",IF(F96>F98,E95,E98))","v":""},null,{"$f":"IFERROR(VLOOKUP(C96,Katılım!$A$4:$H$301,6,0),0)","v":"BTM"},null,null,"E19",19,{"$f":"OFFSET(Sablon!$DN$1,M96,#REF!)","v":{"$error":"#REF!"}},{"$f":"IFERROR(VLOOKUP(N96,Katılım!$A$4:$Z$301,26,0),0)","v":0},{"$f":"IFERROR(VLOOKUP(N96,Katılım!$A$4:$H$301,6,0),0)","v":0}]
[null,null,null,null,null,null,{"$f":"IF(AND(F96=0,F98=0),\"\",IF(F96>F98,E96,E99))","v":""}]
["19.19",null,123,null,{"$f":"IFERROR(VLOOKUP(C98,Katılım!$A$4:$AA$301,26,0),0)","v":0},{"$f":"BA23","v":0},null,null,{"$f":"IFERROR(VLOOKUP(C98,Katılım!$A$4:$H$301,6,0),0)","v":0}]
[null,null,null,null,{"$f":"IFERROR(VLOOKUP(C98,Katılım!$A$4:$AA$301,27,0),0)","v":0}]
[null,null,null,null,{"$f":"IFERROR(VLOOKUP(C101,Katılım!$A$4:$AA$301,26,0),0)","v":"AHMET İLKER AY (KNY)"}]
[20,"E20",50,null,{"$f":"IFERROR(VLOOKUP(C101,Katılım!$A$4:$AA$301,27,0),0)","v":"HAFSA TORBALI (KNY)"},{"$f":"AZ24","v":0},{"$f":"IF(AND(F101=0,F103=0),\"\",IF(F101>F103,E100,E103))","v":""},null,{"$f":"IFERROR(VLOOKUP(C101,Katılım!$A$4:$H$301,6,0),0)","v":"KNY"},null,null,"E20",20,{"$f":"OFFSET(Sablon!$DN$1,M101,#REF!)","v":{"$error":"#REF!"}},{"$f":"IFERROR(VLOOKUP(N101,Katılım!$A$4:$Z$301,26,0),0)","v":0},{"$f":"IFERROR(VLOOKUP(N101,Katılım!$A$4:$H$301,6,0),0)","v":0}]
[null,null,null,null,null,null,{"$f":"IF(AND(F101=0,F103=0),\"\",IF(F101>F103,E101,E104))","v":""}]
["20.20",null,124,null,{"$f":"IFERROR(VLOOKUP(C103,Katılım!$A$4:$AA$301,26,0),0)","v":0},{"$f":"BA24","v":0},null,null,{"$f":"IFERROR(VLOOKUP(C103,Katılım!$A$4:$H$301,6,0),0)","v":0}]
[null,null,null,null,{"$f":"IFERROR(VLOOKUP(C103,Katılım!$A$4:$AA$301,27,0),0)","v":0}]
[null,null,null,null,{"$f":"IFERROR(VLOOKUP(C106,Katılım!$A$4:$AA$301,26,0),0)","v":"ÖMER MALKUŞ (KRL)"}]
[21,"E21",79,null,{"$f":"IFERROR(VLOOKUP(C106,Katılım!$A$4:$AA$301,27,0),0)","v":"ARNİSA ŞEKER (ÇRM)"},{"$f":"AZ25","v":0},{"$f":"IF(AND(F106=0,F108=0),\"\",IF(F106>F108,E105,E108))","v":""},null,{"$f":"IFERROR(VLOOKUP(C106,Katılım!$A$4:$H$301,6,0),0)","v":"KRL"},null,null,"E21",21,{"$f":"OFFSET(Sablon!$DN$1,M106,#REF!)","v":{"$error":"#REF!"}},{"$f":"IFERROR(VLOOKUP(N106,Katılım!$A$4:$Z$301,26,0),0)","v":0},{"$f":"IFERROR(VLOOKUP(N106,Katılım!$A$4:$H$301,6,0),0)","v":0}]
[null,null,null,null,null,null,{"$f":"IF(AND(F106=0,F108=0),\"\",IF(F106>F108,E106,E109))","v":""}]
["21.21",null,125,null,{"$f":"IFERROR(VLOOKUP(C108,Katılım!$A$4:$AA$301,26,0),0)","v":0},{"$f":"BA25","v":0},null,null,{"$f":"IFERROR(VLOOKUP(C108,Katılım!$A$4:$H$301,6,0),0)","v":0}]
[null,null,null,null,{"$f":"IFERROR(VLOOKUP(C108,Katılım!$A$4:$AA$301,27,0),0)","v":0}]
[null,null,null,null,{"$f":"IFERROR(VLOOKUP(C111,Katılım!$A$4:$AA$301,26,0),0)","v":"HASAN ÖZTEKİN (BTM)"}]
[22,"E22",66,null,{"$f":"IFERROR(VLOOKUP(C111,Katılım!$A$4:$AA$301,27,0),0)","v":"HÜMEYRA ULUÇ (BTM)"},{"$f":"AZ26","v":0},{"$f":"IF(AND(F111=0,F113=0),\"\",IF(F111>F113,E110,E113))","v":""},null,{"$f":"IFERROR(VLOOKUP(C111,Katılım!$A$4:$H$301,6,0),0)","v":"BTM"},null,null,"E22",22,{"$f":"OFFSET(Sablon!$DN$1,M111,#REF!)","v":{"$error":"#REF!"}},{"$f":"IFERROR(VLOOKUP(N111,Katılım!$A$4:$Z$301,26,0),0)","v":0},{"$f":"IFERROR(VLOOKUP(N111,Katılım!$A$4:$H$301,6,0),0)","v":0}]
[null,null,null,null,null,null,{"$f":"IF(AND(F111=0,F113=0),\"\",IF(F111>F113,E111,E114))","v":""}]
["22.22",null,126,null,{"$f":"IFERROR(VLOOKUP(C113,Katılım!$A$4:$AA$301,26,0),0)","v":0},{"$f":"BA26","v":0},null,null,{"$f":"IFERROR(VLOOKUP(C113,Katılım!$A$4:$H$301,6,0),0)","v":0}]
[null,null,null,null,{"$f":"IFERROR(VLOOKUP(C113,Katılım!$A$4:$AA$301,27,0),0)","v":0}]
[null,null,null,null,{"$f":"IFERROR(VLOOKUP(C116,Katılım!$A$4:$AA$301,26,0),0)","v":"ZAHİD EMİR TEMEL (KNY)"}]
[23,"E23",98,null,{"$f":"IFERROR(VLOOKUP(C116,Katılım!$A$4:$AA$301,27,0),0)","v":"DEFNE ZEYNEP KELES (AMS)"},{"$f":"AZ27","v":0},{"$f":"IF(AND(F116=0,F118=0),\"\",IF(F116>F118,E115,E118))","v":""},null,{"$f":"IFERROR(VLOOKUP(C116,Katılım!$A$4:$H$301,6,0),0)","v":"KNY"},null,null,"E23",23,{"$f":"OFFSET(Sablon!$DN$1,M116,#REF!)","v":{"$error":"#REF!"}},{"$f":"IFERROR(VLOOKUP(N116,Katılım!$A$4:$Z$301,26,0),0)","v":0},{"$f":"IFERROR(VLOOKUP(N116,Katılım!$A$4:$H$301,6,0),0)","v":0}]
[null,null,null,null,null,null,{"$f":"IF(AND(F116=0,F118=0),\"\",IF(F116>F118,E116,E119))","v":""}]
["23.23",null,127,null,{"$f":"IFERROR(VLOOKUP(C118,Katılım!$A$4:$AA$301,26,0),0)","v":0},{"$f":"BA27","v":0},null,null,{"$f":"IFERROR(VLOOKUP(C118,Katılım!$A$4:$H$301,6,0),0)","v":0}]
[null,null,null,null,{"$f":"IFERROR(VLOOKUP(C118,Katılım!$A$4:$AA$301,27,0),0)","v":0}]
[null,null,null,null,{"$f":"IFERROR(VLOOKUP(C121,Katılım!$A$4:$AA$301,26,0),0)","v":"EGE BOLAT (ADN)"}]
[24,"E24",47,null,{"$f":"IFERROR(VLOOKUP(C121,Katılım!$A$4:$AA$301,27,0),0)","v":"CEREN BUDAK (ADN)"},{"$f":"AZ28","v":0},{"$f":"IF(AND(F121=0,F123=0),\"\",IF(F121>F123,E120,E123))","v":""},null,{"$f":"IFERROR(VLOOKUP(C121,Katılım!$A$4:$H$301,6,0),0)","v":"ADN"},null,null,"E24",24,{"$f":"OFFSET(Sablon!$DN$1,M121,#REF!)","v":{"$error":"#REF!"}},{"$f":"IFERROR(VLOOKUP(N121,Katılım!$A$4:$Z$301,26,0),0)","v":0},{"$f":"IFERROR(VLOOKUP(N121,Katılım!$A$4:$H$301,6,0),0)","v":0}]
[null,null,null,null,null,null,{"$f":"IF(AND(F121=0,F123=0),\"\",IF(F121>F123,E121,E124))","v":""}]
["24.24",null,128,null,{"$f":"IFERROR(VLOOKUP(C123,Katılım!$A$4:$AA$301,26,0),0)","v":0},{"$f":"BA28","v":0},null,null,{"$f":"IFERROR(VLOOKUP(C123,Katılım!$A$4:$H$301,6,0),0)","v":0}]
[null,null,null,null,{"$f":"IFERROR(VLOOKUP(C123,Katılım!$A$4:$AA$301,27,0),0)","v":0}]
[null,null,null,null,{"$f":"IFERROR(VLOOKUP(C126,Katılım!$A$4:$AA$301,26,0),0)","v":"MUSTAFA YAĞIZ ÖZÇELİK (ÇRM)"}]
[25,"E25",91,null,{"$f":"IFERROR(VLOOKUP(C126,Katılım!$A$4:$AA$301,27,0),0)","v":"ASLI ATEŞ (DYB)"},{"$f":"AZ29","v":0},{"$f":"IF(AND(F126=0,F128=0),\"\",IF(F126>F128,E125,E128))","v":""},null,{"$f":"IFERROR(VLOOKUP(C126,Katılım!$A$4:$H$301,6,0),0)","v":"ÇRM"},null,null,"E25",25,{"$f":"OFFSET(Sablon!$DN$1,M126,#REF!)","v":{"$error":"#REF!"}},{"$f":"IFERROR(VLOOKUP(N126,Katılım!$A$4:$Z$301,26,0),0)","v":0},{"$f":"IFERROR(VLOOKUP(N126,Katılım!$A$4:$H$301,6,0),0)","v":0}]
[null,null,null,null,null,null,{"$f":"IF(AND(F126=0,F128=0),\"\",IF(F126>F128,E126,E129))","v":""}]
["25.25",null,129,null,{"$f":"IFERROR(VLOOKUP(C128,Katılım!$A$4:$AA$301,26,0),0)","v":0},{"$f":"BA29","v":0},null,null,{"$f":"IFERROR(VLOOKUP(C128,Katılım!$A$4:$H$301,6,0),0)","v":0}]
[null,null,null,null,{"$f":"IFERROR(VLOOKUP(C128,Katılım!$A$4:$AA$301,27,0),0)","v":0}]
[null,null,null,null,{"$f":"IFERROR(VLOOKUP(C131,Katılım!$A$4:$AA$301,26,0),0)","v":"CAFER ASAF ÖZ (KRK)"}]
[26,"E26",54,null,{"$f":"IFERROR(VLOOKUP(C131,Katılım!$A$4:$AA$301,27,0),0)","v":"ZEYNEP ELİF ÜNSAL (AMS)"},{"$f":"AZ30","v":0},{"$f":"IF(AND(F131=0,F133=0),\"\",IF(F131>F133,E130,E133))","v":""},null,{"$f":"IFERROR(VLOOKUP(C131,Katılım!$A$4:$H$301,6,0),0)","v":"KRK"},null,null,"E26",26,{"$f":"OFFSET(Sablon!$DN$1,M131,#REF!)","v":{"$error":"#REF!"}},{"$f":"IFERROR(VLOOKUP(N131,Katılım!$A$4:$Z$301,26,0),0)","v":0},{"$f":"IFERROR(VLOOKUP(N131,Katılım!$A$4:$H$301,6,0),0)","v":0}]
[null,null,null,null,null,null,{"$f":"IF(AND(F131=0,F133=0),\"\",IF(F131>F133,E131,E134))","v":""}]
["26.26",null,130,null,{"$f":"IFERROR(VLOOKUP(C133,Katılım!$A$4:$AA$301,26,0),0)","v":0},{"$f":"BA30","v":0},null,null,{"$f":"IFERROR(VLOOKUP(C133,Katılım!$A$4:$H$301,6,0),0)","v":0}]
[null,null,null,null,{"$f":"IFERROR(VLOOKUP(C133,Katılım!$A$4:$AA$301,27,0),0)","v":0}]
[null,null,null,null,{"$f":"IFERROR(VLOOKUP(C136,Katılım!$A$4:$AA$301,26,0),0)","v":"MUHAMMED EYMEN SOLAK (ÇRM)"}]
[27,"E27",65,null,{"$f":"IFERROR(VLOOKUP(C136,Katılım!$A$4:$AA$301,27,0),0)","v":"LİVA ÇEVİK (KKTC)"},{"$f":"AZ31","v":0},{"$f":"IF(AND(F136=0,F138=0),\"\",IF(F136>F138,E135,E138))","v":""},null,{"$f":"IFERROR(VLOOKUP(C136,Katılım!$A$4:$H$301,6,0),0)","v":"ÇRM"},null,null,"E27",27,{"$f":"OFFSET(Sablon!$DN$1,M136,#REF!)","v":{"$error":"#REF!"}},{"$f":"IFERROR(VLOOKUP(N136,Katılım!$A$4:$Z$301,26,0),0)","v":0},{"$f":"IFERROR(VLOOKUP(N136,Katılım!$A$4:$H$301,6,0),0)","v":0}]
[null,null,null,null,null,null,{"$f":"IF(AND(F136=0,F138=0),\"\",IF(F136>F138,E136,E139))","v":""}]
["27.27",null,131,null,{"$f":"IFERROR(VLOOKUP(C138,Katılım!$A$4:$AA$301,26,0),0)","v":0},{"$f":"BA31","v":0},null,null,{"$f":"IFERROR(VLOOKUP(C138,Katılım!$A$4:$H$301,6,0),0)","v":0}]
[null,null,null,null,{"$f":"IFERROR(VLOOKUP(C138,Katılım!$A$4:$AA$301,27,0),0)","v":0}]
[null,null,null,null,{"$f":"IFERROR(VLOOKUP(C141,Katılım!$A$4:$AA$301,26,0),0)","v":"ENSAR ERFİDAN (VAN       )"}]
[28,"E28",76,null,{"$f":"IFERROR(VLOOKUP(C141,Katılım!$A$4:$AA$301,27,0),0)","v":"ELİF FATIMA DEMİRCİ (NVŞ)"},{"$f":"AZ32","v":0},{"$f":"IF(AND(F141=0,F143=0),\"\",IF(F141>F143,E140,E143))","v":""},null,{"$f":"IFERROR(VLOOKUP(C141,Katılım!$A$4:$H$301,6,0),0)","v":"VAN       "},null,null,"E28",28,{"$f":"OFFSET(Sablon!$DN$1,M141,#REF!)","v":{"$error":"#REF!"}},{"$f":"IFERROR(VLOOKUP(N141,Katılım!$A$4:$Z$301,26,0),0)","v":0},{"$f":"IFERROR(VLOOKUP(N141,Katılım!$A$4:$H$301,6,0),0)","v":0}]
[null,null,null,null,null,null,{"$f":"IF(AND(F141=0,F143=0),\"\",IF(F141>F143,E141,E144))","v":""}]
["28.28",null,132,null,{"$f":"IFERROR(VLOOKUP(C143,Katılım!$A$4:$AA$301,26,0),0)","v":0},{"$f":"BA32","v":0},null,null,{"$f":"IFERROR(VLOOKUP(C143,Katılım!$A$4:$H$301,6,0),0)","v":0}]
[null,null,null,null,{"$f":"IFERROR(VLOOKUP(C143,Katılım!$A$4:$AA$301,27,0),0)","v":0}]
[null,null,null,null,{"$f":"IFERROR(VLOOKUP(C146,Katılım!$A$4:$AA$301,26,0),0)","v":"ATA URAZ BAHADIR (MĞL)"}]
[29,"E29",43,null,{"$f":"IFERROR(VLOOKUP(C146,Katılım!$A$4:$AA$301,27,0),0)","v":"İLKİM EYLÜL YEKREK (MĞL)"},{"$f":"AZ33","v":0},{"$f":"IF(AND(F146=0,F148=0),\"\",IF(F146>F148,E145,E148))","v":""},null,{"$f":"IFERROR(VLOOKUP(C146,Katılım!$A$4:$H$301,6,0),0)","v":"MĞL"},null,null,"E29",29,{"$f":"OFFSET(Sablon!$DN$1,M146,#REF!)","v":{"$error":"#REF!"}},{"$f":"IFERROR(VLOOKUP(N146,Katılım!$A$4:$Z$301,26,0),0)","v":0},{"$f":"IFERROR(VLOOKUP(N146,Katılım!$A$4:$H$301,6,0),0)","v":0}]
[null,null,null,null,null,null,{"$f":"IF(AND(F146=0,F148=0),\"\",IF(F146>F148,E146,E149))","v":""}]
["29.29",null,133,null,{"$f":"IFERROR(VLOOKUP(C148,Katılım!$A$4:$AA$301,26,0),0)","v":0},{"$f":"BA33","v":0},null,null,{"$f":"IFERROR(VLOOKUP(C148,Katılım!$A$4:$H$301,6,0),0)","v":0}]
[null,null,null,null,{"$f":"IFERROR(VLOOKUP(C148,Katılım!$A$4:$AA$301,27,0),0)","v":0}]
[null,null,null,null,{"$f":"IFERROR(VLOOKUP(C151,Katılım!$A$4:$AA$301,26,0),0)","v":"TUNAY DENİZ SAKINÇ (ÇRM)"}]
[30,"E30",60,null,{"$f":"IFERROR(VLOOKUP(C151,Katılım!$A$4:$AA$301,27,0),0)","v":"BEREN SU ZER (ÇRM)"},{"$f":"AZ34","v":0},{"$f":"IF(AND(F151=0,F153=0),\"\",IF(F151>F153,E150,E153))","v":""},null,{"$f":"IFERROR(VLOOKUP(C151,Katılım!$A$4:$H$301,6,0),0)","v":"ÇRM"},null,null,"E30",30,{"$f":"OFFSET(Sablon!$DN$1,M151,#REF!)","v":{"$error":"#REF!"}},{"$f":"IFERROR(VLOOKUP(N151,Katılım!$A$4:$Z$301,26,0),0)","v":0},{"$f":"IFERROR(VLOOKUP(N151,Katılım!$A$4:$H$301,6,0),0)","v":0}]
[null,null,null,null,null,null,{"$f":"IF(AND(F151=0,F153=0),\"\",IF(F151>F153,E151,E154))","v":""}]
["30.30",null,134,null,{"$f":"IFERROR(VLOOKUP(C153,Katılım!$A$4:$AA$301,26,0),0)","v":0},{"$f":"BA34","v":0},null,null,{"$f":"IFERROR(VLOOKUP(C153,Katılım!$A$4:$H$301,6,0),0)","v":0}]
[null,null,null,null,{"$f":"IFERROR(VLOOKUP(C153,Katılım!$A$4:$AA$301,27,0),0)","v":0}]
[null,null,null,null,{"$f":"IFERROR(VLOOKUP(C156,Katılım!$A$4:$AA$301,26,0),0)","v":"YUSUF EFE GÜL  (İST)"}]
[31,"E31",80,null,{"$f":"IFERROR(VLOOKUP(C156,Katılım!$A$4:$AA$301,27,0),0)","v":"ELİS ŞAHAN (İST)"},{"$f":"AZ35","v":0},{"$f":"IF(AND(F156=0,F158=0),\"\",IF(F156>F158,E155,E158))","v":""},null,{"$f":"IFERROR(VLOOKUP(C156,Katılım!$A$4:$H$301,6,0),0)","v":"İST"},null,null,"E31",31,{"$f":"OFFSET(Sablon!$DN$1,M156,#REF!)","v":{"$error":"#REF!"}},{"$f":"IFERROR(VLOOKUP(N156,Katılım!$A$4:$Z$301,26,0),0)","v":0},{"$f":"IFERROR(VLOOKUP(N156,Katılım!$A$4:$H$301,6,0),0)","v":0}]
[null,null,null,null,null,null,{"$f":"IF(AND(F156=0,F158=0),\"\",IF(F156>F158,E156,E159))","v":""}]
["31.31",null,135,null,{"$f":"IFERROR(VLOOKUP(C158,Katılım!$A$4:$AA$301,26,0),0)","v":0},{"$f":"BA35","v":0},null,null,{"$f":"IFERROR(VLOOKUP(C158,Katılım!$A$4:$H$301,6,0),0)","v":0}]
[null,null,null,null,{"$f":"IFERROR(VLOOKUP(C158,Katılım!$A$4:$AA$301,27,0),0)","v":0}]
[null,null,null,null,{"$f":"IFERROR(VLOOKUP(C161,Katılım!$A$4:$AA$301,26,0),0)","v":"AHMET TALHA ALSANCAK (KRK)"}]
[32,"E32",97,null,{"$f":"IFERROR(VLOOKUP(C161,Katılım!$A$4:$AA$301,27,0),0)","v":"AYŞE YAREN KAŞKA (AMS)"},{"$f":"AZ36","v":0},{"$f":"IF(AND(F161=0,F163=0),\"\",IF(F161>F163,E160,E163))","v":""},null,{"$f":"IFERROR(VLOOKUP(C161,Katılım!$A$4:$H$301,6,0),0)","v":"KRK"},null,null,"E32",32,{"$f":"OFFSET(Sablon!$DN$1,M161,#REF!)","v":{"$error":"#REF!"}},{"$f":"IFERROR(VLOOKUP(N161,Katılım!$A$4:$Z$301,26,0),0)","v":0},{"$f":"IFERROR(VLOOKUP(N161,Katılım!$A$4:$H$301,6,0),0)","v":0}]
[null,null,null,null,null,null,{"$f":"IF(AND(F161=0,F163=0),\"\",IF(F161>F163,E161,E164))","v":""}]
["32.32",null,136,null,{"$f":"IFERROR(VLOOKUP(C163,Katılım!$A$4:$AA$301,26,0),0)","v":0},{"$f":"BA36","v":0},null,null,{"$f":"IFERROR(VLOOKUP(C163,Katılım!$A$4:$H$301,6,0),0)","v":0}]
[null,null,null,null,{"$f":"IFERROR(VLOOKUP(C163,Katılım!$A$4:$AA$301,27,0),0)","v":0}]
[null,null,null,null,{"$f":"IFERROR(VLOOKUP(C166,Katılım!$A$4:$AA$301,26,0),0)","v":"EYMEN YAZGAN (BRS)"}]
[33,"E33",102,null,{"$f":"IFERROR(VLOOKUP(C166,Katılım!$A$4:$AA$301,27,0),0)","v":"ECRİN FİDAN (BRS)"},{"$f":"AZ37","v":0},{"$f":"IF(AND(F166=0,F168=0),\"\",IF(F166>F168,E165,E168))","v":""},null,{"$f":"IFERROR(VLOOKUP(C166,Katılım!$A$4:$H$301,6,0),0)","v":"BRS"},null,null,"E33",33,{"$f":"OFFSET(Sablon!$DN$1,M166,#REF!)","v":{"$error":"#REF!"}},{"$f":"IFERROR(VLOOKUP(N166,Katılım!$A$4:$Z$301,26,0),0)","v":0},{"$f":"IFERROR(VLOOKUP(N166,Katılım!$A$4:$H$301,6,0),0)","v":0}]
[null,null,null,null,null,null,{"$f":"IF(AND(F166=0,F168=0),\"\",IF(F166>F168,E166,E169))","v":""}]
["33.33",null,137,null,{"$f":"IFERROR(VLOOKUP(C168,Katılım!$A$4:$AA$301,26,0),0)","v":0},{"$f":"BA37","v":0},null,null,{"$f":"IFERROR(VLOOKUP(C168,Katılım!$A$4:$H$301,6,0),0)","v":0}]
[null,null,null,null,{"$f":"IFERROR(VLOOKUP(C168,Katılım!$A$4:$AA$301,27,0),0)","v":0}]
[null,null,null,null,{"$f":"IFERROR(VLOOKUP(C171,Katılım!$A$4:$AA$301,26,0),0)","v":"GOKTUĞ BİÇER (ÇRM)"}]
[34,"E34",64,null,{"$f":"IFERROR(VLOOKUP(C171,Katılım!$A$4:$AA$301,27,0),0)","v":"ÖYKÜ DENİZ ERKOÇ (ÇRM)"},{"$f":"AZ38","v":0},{"$f":"IF(AND(F171=0,F173=0),\"\",IF(F171>F173,E170,E173))","v":""},null,{"$f":"IFERROR(VLOOKUP(C171,Katılım!$A$4:$H$301,6,0),0)","v":"ÇRM"},null,null,"E34",34,{"$f":"OFFSET(Sablon!$DN$1,M171,#REF!)","v":{"$error":"#REF!"}},{"$f":"IFERROR(VLOOKUP(N171,Katılım!$A$4:$Z$301,26,0),0)","v":0},{"$f":"IFERROR(VLOOKUP(N171,Katılım!$A$4:$H$301,6,0),0)","v":0}]
[null,null,null,null,null,null,{"$f":"IF(AND(F171=0,F173=0),\"\",IF(F171>F173,E171,E174))","v":""}]
["34.34",null,138,null,{"$f":"IFERROR(VLOOKUP(C173,Katılım!$A$4:$AA$301,26,0),0)","v":0},{"$f":"BA38","v":0},null,null,{"$f":"IFERROR(VLOOKUP(C173,Katılım!$A$4:$H$301,6,0),0)","v":0}]
[null,null,null,null,{"$f":"IFERROR(VLOOKUP(C173,Katılım!$A$4:$AA$301,27,0),0)","v":0}]
[null,null,null,null,{"$f":"IFERROR(VLOOKUP(C176,Katılım!$A$4:$AA$301,26,0),0)","v":"HÜSEYİN EREN YILMAZ (ÇRM)"}]
[35,"E35",59,null,{"$f":"IFERROR(VLOOKUP(C176,Katılım!$A$4:$AA$301,27,0),0)","v":"İPEK ÖZTÜRK (ÇRM)"},{"$f":"AZ39","v":0},{"$f":"IF(AND(F176=0,F178=0),\"\",IF(F176>F178,E175,E178))","v":""},null,{"$f":"IFERROR(VLOOKUP(C176,Katılım!$A$4:$H$301,6,0),0)","v":"ÇRM"},null,null,"E35",35,{"$f":"OFFSET(Sablon!$DN$1,M176,#REF!)","v":{"$error":"#REF!"}},{"$f":"IFERROR(VLOOKUP(N176,Katılım!$A$4:$Z$301,26,0),0)","v":0},{"$f":"IFERROR(VLOOKUP(N176,Katılım!$A$4:$H$301,6,0),0)","v":0}]
[null,null,null,null,null,null,{"$f":"IF(AND(F176=0,F178=0),\"\",IF(F176>F178,E176,E179))","v":""}]
["35.35",null,139,null,{"$f":"IFERROR(VLOOKUP(C178,Katılım!$A$4:$AA$301,26,0),0)","v":0},{"$f":"BA39","v":0},null,null,{"$f":"IFERROR(VLOOKUP(C178,Katılım!$A$4:$H$301,6,0),0)","v":0}]
[null,null,null,null,{"$f":"IFERROR(VLOOKUP(C178,Katılım!$A$4:$AA$301,27,0),0)","v":0}]
[null,null,null,null,{"$f":"IFERROR(VLOOKUP(C181,Katılım!$A$4:$AA$301,26,0),0)","v":"TOPRAK ÇALAKOĞLU (MĞL)"}]
[36,"E36",75,null,{"$f":"IFERROR(VLOOKUP(C181,Katılım!$A$4:$AA$301,27,0),0)","v":"SİDELYA YILDIRIM (MUĞ)"},{"$f":"AZ40","v":0},{"$f":"IF(AND(F181=0,F183=0),\"\",IF(F181>F183,E180,E183))","v":""},null,{"$f":"IFERROR(VLOOKUP(C181,Katılım!$A$4:$H$301,6,0),0)","v":"MĞL"},null,null,"E36",36,{"$f":"OFFSET(Sablon!$DN$1,M181,#REF!)","v":{"$error":"#REF!"}},{"$f":"IFERROR(VLOOKUP(N181,Katılım!$A$4:$Z$301,26,0),0)","v":0},{"$f":"IFERROR(VLOOKUP(N181,Katılım!$A$4:$H$301,6,0),0)","v":0}]
[null,null,null,null,null,null,{"$f":"IF(AND(F181=0,F183=0),\"\",IF(F181>F183,E181,E184))","v":""}]
["36.36",null,140,null,{"$f":"IFERROR(VLOOKUP(C183,Katılım!$A$4:$AA$301,26,0),0)","v":0},{"$f":"BA40","v":0},null,null,{"$f":"IFERROR(VLOOKUP(C183,Katılım!$A$4:$H$301,6,0),0)","v":0}]
[null,null,null,null,{"$f":"IFERROR(VLOOKUP(C183,Katılım!$A$4:$AA$301,27,0),0)","v":0}]
[null,null,null,null,{"$f":"IFERROR(VLOOKUP(C186,Katılım!$A$4:$AA$301,26,0),0)","v":"TAHA DERELİ (İST)"}]
[37,"E37",48,null,{"$f":"IFERROR(VLOOKUP(C186,Katılım!$A$4:$AA$301,27,0),0)","v":"BERRA DEMİR (İST)"},{"$f":"AZ41","v":0},{"$f":"IF(AND(F186=0,F188=0),\"\",IF(F186>F188,E185,E188))","v":""},null,{"$f":"IFERROR(VLOOKUP(C186,Katılım!$A$4:$H$301,6,0),0)","v":"İST"},null,null,"E37",37,{"$f":"OFFSET(Sablon!$DN$1,M186,#REF!)","v":{"$error":"#REF!"}},{"$f":"IFERROR(VLOOKUP(N186,Katılım!$A$4:$Z$301,26,0),0)","v":0},{"$f":"IFERROR(VLOOKUP(N186,Katılım!$A$4:$H$301,6,0),0)","v":0}]
[null,null,null,null,null,null,{"$f":"IF(AND(F186=0,F188=0),\"\",IF(F186>F188,E186,E189))","v":""}]
["37.37",null,141,null,{"$f":"IFERROR(VLOOKUP(C188,Katılım!$A$4:$AA$301,26,0),0)","v":0},{"$f":"BA41","v":0},null,null,{"$f":"IFERROR(VLOOKUP(C188,Katılım!$A$4:$H$301,6,0),0)","v":0}]
[null,null,null,null,{"$f":"IFERROR(VLOOKUP(C188,Katılım!$A$4:$AA$301,27,0),0)","v":0}]
[null,null,null,null,{"$f":"IFERROR(VLOOKUP(C191,Katılım!$A$4:$AA$301,26,0),0)","v":"EYMEN SAVCI (ADN)"}]
[38,"E38",49,null,{"$f":"IFERROR(VLOOKUP(C191,Katılım!$A$4:$AA$301,27,0),0)","v":"BEREN BOZKURT (ADN)"},{"$f":"AZ42","v":0},{"$f":"IF(AND(F191=0,F193=0),\"\",IF(F191>F193,E190,E193))","v":""},null,{"$f":"IFERROR(VLOOKUP(C191,Katılım!$A$4:$H$301,6,0),0)","v":"ADN"},null,null,"E38",38,{"$f":"OFFSET(Sablon!$DN$1,M191,#REF!)","v":{"$error":"#REF!"}},{"$f":"IFERROR(VLOOKUP(N191,Katılım!$A$4:$Z$301,26,0),0)","v":0},{"$f":"IFERROR(VLOOKUP(N191,Katılım!$A$4:$H$301,6,0),0)","v":0}]
[null,null,null,null,null,null,{"$f":"IF(AND(F191=0,F193=0),\"\",IF(F191>F193,E191,E194))","v":""}]
["38.38",null,142,null,{"$f":"IFERROR(VLOOKUP(C193,Katılım!$A$4:$AA$301,26,0),0)","v":0},{"$f":"BA42","v":0},null,null,{"$f":"IFERROR(VLOOKUP(C193,Katılım!$A$4:$H$301,6,0),0)","v":0}]
[null,null,null,null,{"$f":"IFERROR(VLOOKUP(C193,Katılım!$A$4:$AA$301,27,0),0)","v":0}]
[null,null,null,null,{"$f":"IFERROR(VLOOKUP(C196,Katılım!$A$4:$AA$301,26,0),0)","v":"AHMET ERDEM AYDIN (KNY)"}]
[39,"E39",53,null,{"$f":"IFERROR(VLOOKUP(C196,Katılım!$A$4:$AA$301,27,0),0)","v":"ZEYNEP ÖZÇELİK (İST)"},{"$f":"AZ43","v":0},{"$f":"IF(AND(F196=0,F198=0),\"\",IF(F196>F198,E195,E198))","v":""},null,{"$f":"IFERROR(VLOOKUP(C196,Katılım!$A$4:$H$301,6,0),0)","v":"KNY"},null,null,"E39",39,{"$f":"OFFSET(Sablon!$DN$1,M196,#REF!)","v":{"$error":"#REF!"}},{"$f":"IFERROR(VLOOKUP(N196,Katılım!$A$4:$Z$301,26,0),0)","v":0},{"$f":"IFERROR(VLOOKUP(N196,Katılım!$A$4:$H$301,6,0),0)","v":0}]
[null,null,null,null,null,null,{"$f":"IF(AND(F196=0,F198=0),\"\",IF(F196>F198,E196,E199))","v":""}]
["39.39",null,143,null,{"$f":"IFERROR(VLOOKUP(C198,Katılım!$A$4:$AA$301,26,0),0)","v":0},{"$f":"BA43","v":0},null,null,{"$f":"IFERROR(VLOOKUP(C198,Katılım!$A$4:$H$301,6,0),0)","v":0}]
[null,null,null,null,{"$f":"IFERROR(VLOOKUP(C198,Katılım!$A$4:$AA$301,27,0),0)","v":0}]
[null,null,null,null,{"$f":"IFERROR(VLOOKUP(C201,Katılım!$A$4:$AA$301,26,0),0)","v":"KAYA TEMİR (ÇRM)"}]
[40,"E40",70,null,{"$f":"IFERROR(VLOOKUP(C201,Katılım!$A$4:$AA$301,27,0),0)","v":"ELİF SU ERKOÇAK (ÇRM)"},{"$f":"AZ44","v":0},{"$f":"IF(AND(F201=0,F203=0),\"\",IF(F201>F203,E200,E203))","v":""},null,{"$f":"IFERROR(VLOOKUP(C201,Katılım!$A$4:$H$301,6,0),0)","v":"ÇRM"},null,null,"E40",40,{"$f":"OFFSET(Sablon!$DN$1,M201,#REF!)","v":{"$error":"#REF!"}},{"$f":"IFERROR(VLOOKUP(N201,Katılım!$A$4:$Z$301,26,0),0)","v":0},{"$f":"IFERROR(VLOOKUP(N201,Katılım!$A$4:$H$301,6,0),0)","v":0}]
[null,null,null,null,null,null,{"$f":"IF(AND(F201=0,F203=0),\"\",IF(F201>F203,E201,E204))","v":""}]
["40.40",null,144,null,{"$f":"IFERROR(VLOOKUP(C203,Katılım!$A$4:$AA$301,26,0),0)","v":0},{"$f":"BA44","v":0},null,null,{"$f":"IFERROR(VLOOKUP(C203,Katılım!$A$4:$H$301,6,0),0)","v":0}]
[null,null,null,null,{"$f":"IFERROR(VLOOKUP(C203,Katılım!$A$4:$AA$301,27,0),0)","v":0}]
[null,null,null,null,{"$f":"IFERROR(VLOOKUP(C206,Katılım!$A$4:$AA$301,26,0),0)","v":"MUHAMMED YASİR TORU (AMS)"}]
[41,"E41",86,null,{"$f":"IFERROR(VLOOKUP(C206,Katılım!$A$4:$AA$301,27,0),0)","v":"ESLEM ÇAVŞAK (AMS)"},{"$f":"AZ45","v":0},{"$f":"IF(AND(F206=0,F208=0),\"\",IF(F206>F208,E205,E208))","v":""},null,{"$f":"IFERROR(VLOOKUP(C206,Katılım!$A$4:$H$301,6,0),0)","v":"AMS"},null,null,"E41",41,{"$f":"OFFSET(Sablon!$DN$1,M206,#REF!)","v":{"$error":"#REF!"}},{"$f":"IFERROR(VLOOKUP(N206,Katılım!$A$4:$Z$301,26,0),0)","v":0},{"$f":"IFERROR(VLOOKUP(N206,Katılım!$A$4:$H$301,6,0),0)","v":0}]
[null,null,null,null,null,null,{"$f":"IF(AND(F206=0,F208=0),\"\",IF(F206>F208,E206,E209))","v":""}]
["41.41",null,145,null,{"$f":"IFERROR(VLOOKUP(C208,Katılım!$A$4:$AA$301,26,0),0)","v":0},{"$f":"BA45","v":0},null,null,{"$f":"IFERROR(VLOOKUP(C208,Katılım!$A$4:$H$301,6,0),0)","v":0}]
[null,null,null,null,{"$f":"IFERROR(VLOOKUP(C208,Katılım!$A$4:$AA$301,27,0),0)","v":0}]
[null,null,null,null,{"$f":"IFERROR(VLOOKUP(C211,Katılım!$A$4:$AA$301,26,0),0)","v":"ARMANÇ RODİN ORAKÇI (HKR)"}]
[42,"E42",85,null,{"$f":"IFERROR(VLOOKUP(C211,Katılım!$A$4:$AA$301,27,0),0)","v":"ZELAL ÖZER (HKR)"},{"$f":"AZ46","v":0},{"$f":"IF(AND(F211=0,F213=0),\"\",IF(F211>F213,E210,E213))","v":""},null,{"$f":"IFERROR(VLOOKUP(C211,Katılım!$A$4:$H$301,6,0),0)","v":"HKR"},null,null,"E42",42,{"$f":"OFFSET(Sablon!$DN$1,M211,#REF!)","v":{"$error":"#REF!"}},{"$f":"IFERROR(VLOOKUP(N211,Katılım!$A$4:$Z$301,26,0),0)","v":0},{"$f":"IFERROR(VLOOKUP(N211,Katılım!$A$4:$H$301,6,0),0)","v":0}]
[null,null,null,null,null,null,{"$f":"IF(AND(F211=0,F213=0),\"\",IF(F211>F213,E211,E214))","v":""}]
["42.42",null,146,null,{"$f":"IFERROR(VLOOKUP(C213,Katılım!$A$4:$AA$301,26,0),0)","v":0},{"$f":"BA46","v":0},null,null,{"$f":"IFERROR(VLOOKUP(C213,Katılım!$A$4:$H$301,6,0),0)","v":0}]
[null,null,null,null,{"$f":"IFERROR(VLOOKUP(C213,Katılım!$A$4:$AA$301,27,0),0)","v":0}]
[null,null,null,null,{"$f":"IFERROR(VLOOKUP(C216,Katılım!$A$4:$AA$301,26,0),0)","v":"SEBAHATTİN SİRAÇ DURMUŞ (SMS)"}]
[43,"E43",96,null,{"$f":"IFERROR(VLOOKUP(C216,Katılım!$A$4:$AA$301,27,0),0)","v":"BEREN NAZ ERGENÇ (SMS)"},{"$f":"AZ47","v":0},{"$f":"IF(AND(F216=0,F218=0),\"\",IF(F216>F218,E215,E218))","v":""},null,{"$f":"IFERROR(VLOOKUP(C216,Katılım!$A$4:$H$301,6,0),0)","v":"SMS"},null,null,"E43",43,{"$f":"OFFSET(Sablon!$DN$1,M216,#REF!)","v":{"$error":"#REF!"}},{"$f":"IFERROR(VLOOKUP(N216,Katılım!$A$4:$Z$301,26,0),0)","v":0},{"$f":"IFERROR(VLOOKUP(N216,Katılım!$A$4:$H$301,6,0),0)","v":0}]
[null,null,null,null,null,null,{"$f":"IF(AND(F216=0,F218=0),\"\",IF(F216>F218,E216,E219))","v":""}]
["43.43",null,147,null,{"$f":"IFERROR(VLOOKUP(C218,Katılım!$A$4:$AA$301,26,0),0)","v":0},{"$f":"BA47","v":0},null,null,{"$f":"IFERROR(VLOOKUP(C218,Katılım!$A$4:$H$301,6,0),0)","v":0}]
[null,null,null,null,{"$f":"IFERROR(VLOOKUP(C218,Katılım!$A$4:$AA$301,27,0),0)","v":0}]
[null,null,null,null,{"$f":"IFERROR(VLOOKUP(C221,Katılım!$A$4:$AA$301,26,0),0)","v":"EREN GÖKDEMİR (KRK)"}]
[44,"E44",92,null,{"$f":"IFERROR(VLOOKUP(C221,Katılım!$A$4:$AA$301,27,0),0)","v":"ÖZÜM MİRAY ÖZ (KRK)"},{"$f":"AZ48","v":0},{"$f":"IF(AND(F221=0,F223=0),\"\",IF(F221>F223,E220,E223))","v":""},null,{"$f":"IFERROR(VLOOKUP(C221,Katılım!$A$4:$H$301,6,0),0)","v":"KRK"},null,null,"E44",44,{"$f":"OFFSET(Sablon!$DN$1,M221,#REF!)","v":{"$error":"#REF!"}},{"$f":"IFERROR(VLOOKUP(N221,Katılım!$A$4:$Z$301,26,0),0)","v":0},{"$f":"IFERROR(VLOOKUP(N221,Katılım!$A$4:$H$301,6,0),0)","v":0}]
[null,null,null,null,null,null,{"$f":"IF(AND(F221=0,F223=0),\"\",IF(F221>F223,E221,E224))","v":""}]
["44.44",null,148,null,{"$f":"IFERROR(VLOOKUP(C223,Katılım!$A$4:$AA$301,26,0),0)","v":0},{"$f":"BA48","v":0},null,null,{"$f":"IFERROR(VLOOKUP(C223,Katılım!$A$4:$H$301,6,0),0)","v":0}]
[null,null,null,null,{"$f":"IFERROR(VLOOKUP(C223,Katılım!$A$4:$AA$301,27,0),0)","v":0}]
[null,null,null,null,{"$f":"IFERROR(VLOOKUP(C226,Katılım!$A$4:$AA$301,26,0),0)","v":"AHMET URAZ KİRAZ (MĞL)"}]
[45,"E45",44,null,{"$f":"IFERROR(VLOOKUP(C226,Katılım!$A$4:$AA$301,27,0),0)","v":0},{"$f":"AZ49","v":0},{"$f":"IF(AND(F226=0,F228=0),\"\",IF(F226>F228,E225,E228))","v":""},null,{"$f":"IFERROR(VLOOKUP(C226,Katılım!$A$4:$H$301,6,0),0)","v":"MĞL"},null,null,"E45",45,{"$f":"OFFSET(Sablon!$DN$1,M226,#REF!)","v":{"$error":"#REF!"}},{"$f":"IFERROR(VLOOKUP(N226,Katılım!$A$4:$Z$301,26,0),0)","v":0},{"$f":"IFERROR(VLOOKUP(N226,Katılım!$A$4:$H$301,6,0),0)","v":0}]
[null,null,null,null,null,null,{"$f":"IF(AND(F226=0,F228=0),\"\",IF(F226>F228,E226,E229))","v":""}]
["45.45",null,149,null,{"$f":"IFERROR(VLOOKUP(C228,Katılım!$A$4:$AA$301,26,0),0)","v":0},{"$f":"BA49","v":0},null,null,{"$f":"IFERROR(VLOOKUP(C228,Katılım!$A$4:$H$301,6,0),0)","v":0}]
[null,null,null,null,{"$f":"IFERROR(VLOOKUP(C228,Katılım!$A$4:$AA$301,27,0),0)","v":0}]
[null,null,null,null,{"$f":"IFERROR(VLOOKUP(C231,Katılım!$A$4:$AA$301,26,0),0)","v":"YUSUF İSLAM ÇİFTÇİ (HKR)"}]
[46,"E46",69,null,{"$f":"IFERROR(VLOOKUP(C231,Katılım!$A$4:$AA$301,27,0),0)","v":"GÜLCE KARABIYIK (İZM)"},{"$f":"AZ50","v":0},{"$f":"IF(AND(F231=0,F233=0),\"\",IF(F231>F233,E230,E233))","v":""},null,{"$f":"IFERROR(VLOOKUP(C231,Katılım!$A$4:$H$301,6,0),0)","v":"HKR"},null,null,"E46",46,{"$f":"OFFSET(Sablon!$DN$1,M231,#REF!)","v":{"$error":"#REF!"}},{"$f":"IFERROR(VLOOKUP(N231,Katılım!$A$4:$Z$301,26,0),0)","v":0},{"$f":"IFERROR(VLOOKUP(N231,Katılım!$A$4:$H$301,6,0),0)","v":0}]
[null,null,null,null,null,null,{"$f":"IF(AND(F231=0,F233=0),\"\",IF(F231>F233,E231,E234))","v":""}]
["46.46",null,150,null,{"$f":"IFERROR(VLOOKUP(C233,Katılım!$A$4:$AA$301,26,0),0)","v":0},{"$f":"BA50","v":0},null,null,{"$f":"IFERROR(VLOOKUP(C233,Katılım!$A$4:$H$301,6,0),0)","v":0}]
[null,null,null,null,{"$f":"IFERROR(VLOOKUP(C233,Katılım!$A$4:$AA$301,27,0),0)","v":0}]
[null,null,null,null,{"$f":"IFERROR(VLOOKUP(C236,Katılım!$A$4:$AA$301,26,0),0)","v":"MUHAMMET SAİD OĞUZ (KNY)"}]
[47,"E47",101,null,{"$f":"IFERROR(VLOOKUP(C236,Katılım!$A$4:$AA$301,27,0),0)","v":"ECRİN KAHRAMAN (KYS)"},{"$f":"AZ51","v":0},{"$f":"IF(AND(F236=0,F238=0),\"\",IF(F236>F238,E235,E238))","v":""},null,{"$f":"IFERROR(VLOOKUP(C236,Katılım!$A$4:$H$301,6,0),0)","v":"KNY"},null,null,"E47",47,{"$f":"OFFSET(Sablon!$DN$1,M236,#REF!)","v":{"$error":"#REF!"}},{"$f":"IFERROR(VLOOKUP(N236,Katılım!$A$4:$Z$301,26,0),0)","v":0},{"$f":"IFERROR(VLOOKUP(N236,Katılım!$A$4:$H$301,6,0),0)","v":0}]
[null,null,null,null,null,null,{"$f":"IF(AND(F236=0,F238=0),\"\",IF(F236>F238,E236,E239))","v":""}]
["47.47",null,151,null,{"$f":"IFERROR(VLOOKUP(C238,Katılım!$A$4:$AA$301,26,0),0)","v":0},{"$f":"BA51","v":0},null,null,{"$f":"IFERROR(VLOOKUP(C238,Katılım!$A$4:$H$301,6,0),0)","v":0}]
[null,null,null,null,{"$f":"IFERROR(VLOOKUP(C238,Katılım!$A$4:$AA$301,27,0),0)","v":0}]
[null,null,null,null,{"$f":"IFERROR(VLOOKUP(C241,Katılım!$A$4:$AA$301,26,0),0)","v":"MERT EMİR YİĞİT (SMS)"}]
[48,"E48",81,null,{"$f":"IFERROR(VLOOKUP(C241,Katılım!$A$4:$AA$301,27,0),0)","v":"ESLEM BAYKUT (SMS)"},{"$f":"AZ52","v":0},{"$f":"IF(AND(F241=0,F243=0),\"\",IF(F241>F243,E240,E243))","v":""},null,{"$f":"IFERROR(VLOOKUP(C241,Katılım!$A$4:$H$301,6,0),0)","v":"SMS"},null,null,"E48",48,{"$f":"OFFSET(Sablon!$DN$1,M241,#REF!)","v":{"$error":"#REF!"}},{"$f":"IFERROR(VLOOKUP(N241,Katılım!$A$4:$Z$301,26,0),0)","v":0},{"$f":"IFERROR(VLOOKUP(N241,Katılım!$A$4:$H$301,6,0),0)","v":0}]
[null,null,null,null,null,null,{"$f":"IF(AND(F241=0,F243=0),\"\",IF(F241>F243,E241,E244))","v":""}]
["48.48",null,152,null,{"$f":"IFERROR(VLOOKUP(C243,Katılım!$A$4:$AA$301,26,0),0)","v":0},{"$f":"BA52","v":0},null,null,{"$f":"IFERROR(VLOOKUP(C243,Katılım!$A$4:$H$301,6,0),0)","v":0}]
[null,null,null,null,{"$f":"IFERROR(VLOOKUP(C243,Katılım!$A$4:$AA$301,27,0),0)","v":0}]
[null,null,null,null,{"$f":"IFERROR(VLOOKUP(C246,Katılım!$A$4:$AA$301,26,0),0)","v":"İSMAİL TARHAN (MRD)"}]
[49,"E49",41,null,{"$f":"IFERROR(VLOOKUP(C246,Katılım!$A$4:$AA$301,27,0),0)","v":"HAVİN MUTLU (MRD)"},{"$f":"AZ53","v":0},{"$f":"IF(AND(F246=0,F248=0),\"\",IF(F246>F248,E245,E248))","v":""},null,{"$f":"IFERROR(VLOOKUP(C246,Katılım!$A$4:$H$301,6,0),0)","v":"MRD"},null,null,"E49",49,{"$f":"OFFSET(Sablon!$DN$1,M246,#REF!)","v":{"$error":"#REF!"}},{"$f":"IFERROR(VLOOKUP(N246,Katılım!$A$4:$Z$301,26,0),0)","v":0},{"$f":"IFERROR(VLOOKUP(N246,Katılım!$A$4:$H$301,6,0),0)","v":0}]
[null,null,null,null,null,null,{"$f":"IF(AND(F246=0,F248=0),\"\",IF(F246>F248,E246,E249))","v":""}]
["49.49",null,153,null,{"$f":"IFERROR(VLOOKUP(C248,Katılım!$A$4:$AA$301,26,0),0)","v":0},{"$f":"BA53","v":0},null,null,{"$f":"IFERROR(VLOOKUP(C248,Katılım!$A$4:$H$301,6,0),0)","v":0}]
[null,null,null,null,{"$f":"IFERROR(VLOOKUP(C248,Katılım!$A$4:$AA$301,27,0),0)","v":0}]
[null,null,null,null,{"$f":"IFERROR(VLOOKUP(C251,Katılım!$A$4:$AA$301,26,0),0)","v":"DEMİR YÖNÜ (İST)"}]
[50,"E50",99,null,{"$f":"IFERROR(VLOOKUP(C251,Katılım!$A$4:$AA$301,27,0),0)","v":"ECE NAZ AÇIKGÖZ (KRL)"},{"$f":"AZ54","v":0},{"$f":"IF(AND(F251=0,F253=0),\"\",IF(F251>F253,E250,E253))","v":""},null,{"$f":"IFERROR(VLOOKUP(C251,Katılım!$A$4:$H$301,6,0),0)","v":"İST"},null,null,"E50",50,{"$f":"OFFSET(Sablon!$DN$1,M251,#REF!)","v":{"$error":"#REF!"}},{"$f":"IFERROR(VLOOKUP(N251,Katılım!$A$4:$Z$301,26,0),0)","v":0},{"$f":"IFERROR(VLOOKUP(N251,Katılım!$A$4:$H$301,6,0),0)","v":0}]
[null,null,null,null,null,null,{"$f":"IF(AND(F251=0,F253=0),\"\",IF(F251>F253,E251,E254))","v":""}]
["50.50",null,154,null,{"$f":"IFERROR(VLOOKUP(C253,Katılım!$A$4:$AA$301,26,0),0)","v":0},{"$f":"BA54","v":0},null,null,{"$f":"IFERROR(VLOOKUP(C253,Katılım!$A$4:$H$301,6,0),0)","v":0}]
[null,null,null,null,{"$f":"IFERROR(VLOOKUP(C253,Katılım!$A$4:$AA$301,27,0),0)","v":0}]
[null,null,null,null,{"$f":"IFERROR(VLOOKUP(C256,Katılım!$A$4:$AA$301,26,0),0)","v":"ALİ DUMAN (BTM)"}]
[51,"E51",78,null,{"$f":"IFERROR(VLOOKUP(C256,Katılım!$A$4:$AA$301,27,0),0)","v":"MELİSA ALPAR (BTM)"},{"$f":"AZ55","v":0},{"$f":"IF(AND(F256=0,F258=0),\"\",IF(F256>F258,E255,E258))","v":""},null,{"$f":"IFERROR(VLOOKUP(C256,Katılım!$A$4:$H$301,6,0),0)","v":"BTM"},null,null,"E51",51,{"$f":"OFFSET(Sablon!$DN$1,M256,#REF!)","v":{"$error":"#REF!"}},{"$f":"IFERROR(VLOOKUP(N256,Katılım!$A$4:$Z$301,26,0),0)","v":0},{"$f":"IFERROR(VLOOKUP(N256,Katılım!$A$4:$H$301,6,0),0)","v":0}]
[null,null,null,null,null,null,{"$f":"IF(AND(F256=0,F258=0),\"\",IF(F256>F258,E256,E259))","v":""}]
["51.51",null,155,null,{"$f":"IFERROR(VLOOKUP(C258,Katılım!$A$4:$AA$301,26,0),0)","v":0},{"$f":"BA55","v":0},null,null,{"$f":"IFERROR(VLOOKUP(C258,Katılım!$A$4:$H$301,6,0),0)","v":0}]
[null,null,null,null,{"$f":"IFERROR(VLOOKUP(C258,Katılım!$A$4:$AA$301,27,0),0)","v":0}]
[null,null,null,null,{"$f":"IFERROR(VLOOKUP(C261,Katılım!$A$4:$AA$301,26,0),0)","v":"EYMEN SELİM YILMAZ (KNY)"}]
[52,"E52",57,null,{"$f":"IFERROR(VLOOKUP(C261,Katılım!$A$4:$AA$301,27,0),0)","v":"EYLÜL ECE BECER (ÇRM)"},{"$f":"AZ56","v":0},{"$f":"IF(AND(F261=0,F263=0),\"\",IF(F261>F263,E260,E263))","v":""},null,{"$f":"IFERROR(VLOOKUP(C261,Katılım!$A$4:$H$301,6,0),0)","v":"KNY"},null,null,"E52",52,{"$f":"OFFSET(Sablon!$DN$1,M261,#REF!)","v":{"$error":"#REF!"}},{"$f":"IFERROR(VLOOKUP(N261,Katılım!$A$4:$Z$301,26,0),0)","v":0},{"$f":"IFERROR(VLOOKUP(N261,Katılım!$A$4:$H$301,6,0),0)","v":0}]
[null,null,null,null,null,null,{"$f":"IF(AND(F261=0,F263=0),\"\",IF(F261>F263,E261,E264))","v":""}]
["52.52",null,156,null,{"$f":"IFERROR(VLOOKUP(C263,Katılım!$A$4:$AA$301,26,0),0)","v":0},{"$f":"BA56","v":0},null,null,{"$f":"IFERROR(VLOOKUP(C263,Katılım!$A$4:$H$301,6,0),0)","v":0}]
[null,null,null,null,{"$f":"IFERROR(VLOOKUP(C263,Katılım!$A$4:$AA$301,27,0),0)","v":0}]
[null,null,null,null,{"$f":"IFERROR(VLOOKUP(C266,Katılım!$A$4:$AA$301,26,0),0)","v":"MUHAMMED EMİN KARAKURT (KNY)"}]
[53,"E53",73,null,{"$f":"IFERROR(VLOOKUP(C266,Katılım!$A$4:$AA$301,27,0),0)","v":"ADA GARİP (İST)"},{"$f":"AZ57","v":0},{"$f":"IF(AND(F266=0,F268=0),\"\",IF(F266>F268,E265,E268))","v":""},null,{"$f":"IFERROR(VLOOKUP(C266,Katılım!$A$4:$H$301,6,0),0)","v":"KNY"},null,null,"E53",53,{"$f":"OFFSET(Sablon!$DN$1,M266,#REF!)","v":{"$error":"#REF!"}},{"$f":"IFERROR(VLOOKUP(N266,Katılım!$A$4:$Z$301,26,0),0)","v":0},{"$f":"IFERROR(VLOOKUP(N266,Katılım!$A$4:$H$301,6,0),0)","v":0}]
[null,null,null,null,null,null,{"$f":"IF(AND(F266=0,F268=0),\"\",IF(F266>F268,E266,E269))","v":""}]
["53.53",null,157,null,{"$f":"IFERROR(VLOOKUP(C268,Katılım!$A$4:$AA$301,26,0),0)","v":0},{"$f":"BA57","v":0},null,null,{"$f":"IFERROR(VLOOKUP(C268,Katılım!$A$4:$H$301,6,0),0)","v":0}]
[null,null,null,null,{"$f":"IFERROR(VLOOKUP(C268,Katılım!$A$4:$AA$301,27,0),0)","v":0}]
[null,null,null,null,{"$f":"IFERROR(VLOOKUP(C271,Katılım!$A$4:$AA$301,26,0),0)","v":"EYMEN YERDELEN (SNP)"}]
[54,"E54",37,null,{"$f":"IFERROR(VLOOKUP(C271,Katılım!$A$4:$AA$301,27,0),0)","v":"DEFNE ANIK (SNP)"},{"$f":"AZ58","v":0},{"$f":"IF(AND(F271=0,F273=0),\"\",IF(F271>F273,E270,E273))","v":""},null,{"$f":"IFERROR(VLOOKUP(C271,Katılım!$A$4:$H$301,6,0),0)","v":"SNP"},null,null,"E54",54,{"$f":"OFFSET(Sablon!$DN$1,M271,#REF!)","v":{"$error":"#REF!"}},{"$f":"IFERROR(VLOOKUP(N271,Katılım!$A$4:$Z$301,26,0),0)","v":0},{"$f":"IFERROR(VLOOKUP(N271,Katılım!$A$4:$H$301,6,0),0)","v":0}]
[null,null,null,null,null,null,{"$f":"IF(AND(F271=0,F273=0),\"\",IF(F271>F273,E271,E274))","v":""}]
["54.54",null,158,null,{"$f":"IFERROR(VLOOKUP(C273,Katılım!$A$4:$AA$301,26,0),0)","v":0},{"$f":"BA58","v":0},null,null,{"$f":"IFERROR(VLOOKUP(C273,Katılım!$A$4:$H$301,6,0),0)","v":0}]
[null,null,null,null,{"$f":"IFERROR(VLOOKUP(C273,Katılım!$A$4:$AA$301,27,0),0)","v":0}]
[null,null,null,null,{"$f":"IFERROR(VLOOKUP(C276,Katılım!$A$4:$AA$301,26,0),0)","v":"KUDRET GÜLMEZLER (DNZ)"}]
[55,"E55",51,null,{"$f":"IFERROR(VLOOKUP(C276,Katılım!$A$4:$AA$301,27,0),0)","v":"FERİDE MELİKE HAMAL (DNZ)"},{"$f":"AZ59","v":0},{"$f":"IF(AND(F276=0,F278=0),\"\",IF(F276>F278,E275,E278))","v":""},null,{"$f":"IFERROR(VLOOKUP(C276,Katılım!$A$4:$H$301,6,0),0)","v":"DNZ"},null,null,"E55",55,{"$f":"OFFSET(Sablon!$DN$1,M276,#REF!)","v":{"$error":"#REF!"}},{"$f":"IFERROR(VLOOKUP(N276,Katılım!$A$4:$Z$301,26,0),0)","v":0},{"$f":"IFERROR(VLOOKUP(N276,Katılım!$A$4:$H$301,6,0),0)","v":0}]
[null,null,null,null,null,null,{"$f":"IF(AND(F276=0,F278=0),\"\",IF(F276>F278,E276,E279))","v":""}]
["55.55",null,159,null,{"$f":"IFERROR(VLOOKUP(C278,Katılım!$A$4:$AA$301,26,0),0)","v":0},{"$f":"BA59","v":0},null,null,{"$f":"IFERROR(VLOOKUP(C278,Katılım!$A$4:$H$301,6,0),0)","v":0}]
[null,null,null,null,{"$f":"IFERROR(VLOOKUP(C278,Katılım!$A$4:$AA$301,27,0),0)","v":0}]
[null,null,null,null,{"$f":"IFERROR(VLOOKUP(C281,Katılım!$A$4:$AA$301,26,0),0)","v":"ALİ UYGAR YILDIRICI (İST)"}]
[56,"E56",56,null,{"$f":"IFERROR(VLOOKUP(C281,Katılım!$A$4:$AA$301,27,0),0)","v":"UMAY ŞAHİN (İST)"},{"$f":"AZ60","v":0},{"$f":"IF(AND(F281=0,F283=0),\"\",IF(F281>F283,E280,E283))","v":""},null,{"$f":"IFERROR(VLOOKUP(C281,Katılım!$A$4:$H$301,6,0),0)","v":"İST"},null,null,"E56",56,{"$f":"OFFSET(Sablon!$DN$1,M281,#REF!)","v":{"$error":"#REF!"}},{"$f":"IFERROR(VLOOKUP(N281,Katılım!$A$4:$Z$301,26,0),0)","v":0},{"$f":"IFERROR(VLOOKUP(N281,Katılım!$A$4:$H$301,6,0),0)","v":0}]
[null,null,null,null,null,null,{"$f":"IF(AND(F281=0,F283=0),\"\",IF(F281>F283,E281,E284))","v":""}]
["56.56",null,160,null,{"$f":"IFERROR(VLOOKUP(C283,Katılım!$A$4:$AA$301,26,0),0)","v":0},{"$f":"BA60","v":0},null,null,{"$f":"IFERROR(VLOOKUP(C283,Katılım!$A$4:$H$301,6,0),0)","v":0}]
[null,null,null,null,{"$f":"IFERROR(VLOOKUP(C283,Katılım!$A$4:$AA$301,27,0),0)","v":0}]
[null,null,null,null,{"$f":"IFERROR(VLOOKUP(C286,Katılım!$A$4:$AA$301,26,0),0)","v":"OĞUZHAN ER (HKR)"}]
[57,"E57",88,null,{"$f":"IFERROR(VLOOKUP(C286,Katılım!$A$4:$AA$301,27,0),0)","v":0},{"$f":"AZ61","v":0},{"$f":"IF(AND(F286=0,F288=0),\"\",IF(F286>F288,E285,E288))","v":""},null,{"$f":"IFERROR(VLOOKUP(C286,Katılım!$A$4:$H$301,6,0),0)","v":"HKR"},null,null,"E57",57,{"$f":"OFFSET(Sablon!$DN$1,M286,#REF!)","v":{"$error":"#REF!"}},{"$f":"IFERROR(VLOOKUP(N286,Katılım!$A$4:$Z$301,26,0),0)","v":0},{"$f":"IFERROR(VLOOKUP(N286,Katılım!$A$4:$H$301,6,0),0)","v":0}]
[null,null,null,null,null,null,{"$f":"IF(AND(F286=0,F288=0),\"\",IF(F286>F288,E286,E289))","v":""}]
["57.57",null,161,null,{"$f":"IFERROR(VLOOKUP(C288,Katılım!$A$4:$AA$301,26,0),0)","v":0},{"$f":"BA61","v":0},null,null,{"$f":"IFERROR(VLOOKUP(C288,Katılım!$A$4:$H$301,6,0),0)","v":0}]
[null,null,null,null,{"$f":"IFERROR(VLOOKUP(C288,Katılım!$A$4:$AA$301,27,0),0)","v":0}]
[null,null,null,null,{"$f":"IFERROR(VLOOKUP(C291,Katılım!$A$4:$AA$301,26,0),0)","v":"AHMET EMİR KALKAN (GZT)"}]
[58,"E58",38,null,{"$f":"IFERROR(VLOOKUP(C291,Katılım!$A$4:$AA$301,27,0),0)","v":"ECRİN ATASEVER (MRD)"},{"$f":"AZ62","v":0},{"$f":"IF(AND(F291=0,F293=0),\"\",IF(F291>F293,E290,E293))","v":""},null,{"$f":"IFERROR(VLOOKUP(C291,Katılım!$A$4:$H$301,6,0),0)","v":"GZT"},null,null,"E58",58,{"$f":"OFFSET(Sablon!$DN$1,M291,#REF!)","v":{"$error":"#REF!"}},{"$f":"IFERROR(VLOOKUP(N291,Katılım!$A$4:$Z$301,26,0),0)","v":0},{"$f":"IFERROR(VLOOKUP(N291,Katılım!$A$4:$H$301,6,0),0)","v":0}]
[null,null,null,null,null,null,{"$f":"IF(AND(F291=0,F293=0),\"\",IF(F291>F293,E291,E294))","v":""}]
["58.58",null,162,null,{"$f":"IFERROR(VLOOKUP(C293,Katılım!$A$4:$AA$301,26,0),0)","v":0},{"$f":"BA62","v":0},null,null,{"$f":"IFERROR(VLOOKUP(C293,Katılım!$A$4:$H$301,6,0),0)","v":0}]
[null,null,null,null,{"$f":"IFERROR(VLOOKUP(C293,Katılım!$A$4:$AA$301,27,0),0)","v":0}]
[null,null,null,null,{"$f":"IFERROR(VLOOKUP(C296,Katılım!$A$4:$AA$301,26,0),0)","v":"ÇINAR AYDINLIK (ADN)"}]
[59,"E59",62,null,{"$f":"IFERROR(VLOOKUP(C296,Katılım!$A$4:$AA$301,27,0),0)","v":"ECE MASAL KAYA (ADN)"},{"$f":"AZ63","v":0},{"$f":"IF(AND(F296=0,F298=0),\"\",IF(F296>F298,E295,E298))","v":""},null,{"$f":"IFERROR(VLOOKUP(C296,Katılım!$A$4:$H$301,6,0),0)","v":"ADN"},null,null,"E59",59,{"$f":"OFFSET(Sablon!$DN$1,M296,#REF!)","v":{"$error":"#REF!"}},{"$f":"IFERROR(VLOOKUP(N296,Katılım!$A$4:$Z$301,26,0),0)","v":0},{"$f":"IFERROR(VLOOKUP(N296,Katılım!$A$4:$H$301,6,0),0)","v":0}]
[null,null,null,null,null,null,{"$f":"IF(AND(F296=0,F298=0),\"\",IF(F296>F298,E296,E299))","v":""}]
["59.59",null,163,null,{"$f":"IFERROR(VLOOKUP(C298,Katılım!$A$4:$AA$301,26,0),0)","v":0},{"$f":"BA63","v":0},null,null,{"$f":"IFERROR(VLOOKUP(C298,Katılım!$A$4:$H$301,6,0),0)","v":0}]
[null,null,null,null,{"$f":"IFERROR(VLOOKUP(C298,Katılım!$A$4:$AA$301,27,0),0)","v":0}]
[null,null,null,null,{"$f":"IFERROR(VLOOKUP(C301,Katılım!$A$4:$AA$301,26,0),0)","v":"BERAT DAĞTEKİN (GZT)"}]
[60,"E60",89,null,{"$f":"IFERROR(VLOOKUP(C301,Katılım!$A$4:$AA$301,27,0),0)","v":"EDA ALAŞ (BTM)"},{"$f":"AZ64","v":0},{"$f":"IF(AND(F301=0,F303=0),\"\",IF(F301>F303,E300,E303))","v":""},null,{"$f":"IFERROR(VLOOKUP(C301,Katılım!$A$4:$H$301,6,0),0)","v":"GZT"},null,null,"E60",60,{"$f":"OFFSET(Sablon!$DN$1,M301,#REF!)","v":{"$error":"#REF!"}},{"$f":"IFERROR(VLOOKUP(N301,Katılım!$A$4:$Z$301,26,0),0)","v":0},{"$f":"IFERROR(VLOOKUP(N301,Katılım!$A$4:$H$301,6,0),0)","v":0}]
[null,null,null,null,null,null,{"$f":"IF(AND(F301=0,F303=0),\"\",IF(F301>F303,E301,E304))","v":""}]
["60.60",null,164,null,{"$f":"IFERROR(VLOOKUP(C303,Katılım!$A$4:$AA$301,26,0),0)","v":0},{"$f":"BA64","v":0},null,null,{"$f":"IFERROR(VLOOKUP(C303,Katılım!$A$4:$H$301,6,0),0)","v":0}]
[null,null,null,null,{"$f":"IFERROR(VLOOKUP(C303,Katılım!$A$4:$AA$301,27,0),0)","v":0}]
[null,null,null,null,{"$f":"IFERROR(VLOOKUP(C306,Katılım!$A$4:$AA$301,26,0),0)","v":"BERK TURAN (YLV)"}]
[61,"E61",35,null,{"$f":"IFERROR(VLOOKUP(C306,Katılım!$A$4:$AA$301,27,0),0)","v":"FİRDEVS NUR BİNGÖL (YLV)"},{"$f":"AZ65","v":0},{"$f":"IF(AND(F306=0,F308=0),\"\",IF(F306>F308,E305,E308))","v":""},null,{"$f":"IFERROR(VLOOKUP(C306,Katılım!$A$4:$H$301,6,0),0)","v":"YLV"},null,null,"E61",61,{"$f":"OFFSET(Sablon!$DN$1,M306,#REF!)","v":{"$error":"#REF!"}},{"$f":"IFERROR(VLOOKUP(N306,Katılım!$A$4:$Z$301,26,0),0)","v":0},{"$f":"IFERROR(VLOOKUP(N306,Katılım!$A$4:$H$301,6,0),0)","v":0}]
[null,null,null,null,null,null,{"$f":"IF(AND(F306=0,F308=0),\"\",IF(F306>F308,E306,E309))","v":""}]
["61.61",null,165,null,{"$f":"IFERROR(VLOOKUP(C308,Katılım!$A$4:$AA$301,26,0),0)","v":0},{"$f":"BA65","v":0},null,null,{"$f":"IFERROR(VLOOKUP(C308,Katılım!$A$4:$H$301,6,0),0)","v":0}]
[null,null,null,null,{"$f":"IFERROR(VLOOKUP(C308,Katılım!$A$4:$AA$301,27,0),0)","v":0}]
[null,null,null,null,{"$f":"IFERROR(VLOOKUP(C311,Katılım!$A$4:$AA$301,26,0),0)","v":"M. BİLAL ARTUKOĞLU (MRD)"}]
[62,"E62",39,null,{"$f":"IFERROR(VLOOKUP(C311,Katılım!$A$4:$AA$301,27,0),0)","v":"ŞEVVAL ÖZDEMİR (İST)"},{"$f":"AZ66","v":0},{"$f":"IF(AND(F311=0,F313=0),\"\",IF(F311>F313,E310,E313))","v":""},null,{"$f":"IFERROR(VLOOKUP(C311,Katılım!$A$4:$H$301,6,0),0)","v":"MRD"},null,null,"E62",62,{"$f":"OFFSET(Sablon!$DN$1,M311,#REF!)","v":{"$error":"#REF!"}},{"$f":"IFERROR(VLOOKUP(N311,Katılım!$A$4:$Z$301,26,0),0)","v":0},{"$f":"IFERROR(VLOOKUP(N311,Katılım!$A$4:$H$301,6,0),0)","v":0}]
[null,null,null,null,null,null,{"$f":"IF(AND(F311=0,F313=0),\"\",IF(F311>F313,E311,E314))","v":""}]
["62.62",null,166,null,{"$f":"IFERROR(VLOOKUP(C313,Katılım!$A$4:$AA$301,26,0),0)","v":0},{"$f":"BA66","v":0},null,null,{"$f":"IFERROR(VLOOKUP(C313,Katılım!$A$4:$H$301,6,0),0)","v":0}]
[null,null,null,null,{"$f":"IFERROR(VLOOKUP(C313,Katılım!$A$4:$AA$301,27,0),0)","v":0}]
[null,null,null,null,{"$f":"IFERROR(VLOOKUP(C316,Katılım!$A$4:$AA$301,26,0),0)","v":"MEHMET KARAVELİOĞLU (ÇRM)"}]
[63,"E63",83,null,{"$f":"IFERROR(VLOOKUP(C316,Katılım!$A$4:$AA$301,27,0),0)","v":"ARMİN ŞEKER (ÇRM)"},{"$f":"AZ67","v":0},{"$f":"IF(AND(F316=0,F318=0),\"\",IF(F316>F318,E315,E318))","v":""},null,{"$f":"IFERROR(VLOOKUP(C316,Katılım!$A$4:$H$301,6,0),0)","v":"ÇRM"},null,null,"E63",63,{"$f":"OFFSET(Sablon!$DN$1,M316,#REF!)","v":{"$error":"#REF!"}},{"$f":"IFERROR(VLOOKUP(N316,Katılım!$A$4:$Z$301,26,0),0)","v":0},{"$f":"IFERROR(VLOOKUP(N316,Katılım!$A$4:$H$301,6,0),0)","v":0}]
[null,null,null,null,null,null,{"$f":"IF(AND(F316=0,F318=0),\"\",IF(F316>F318,E316,E319))","v":""}]
["63.63",null,167,null,{"$f":"IFERROR(VLOOKUP(C318,Katılım!$A$4:$AA$301,26,0),0)","v":0},{"$f":"BA67","v":0},null,null,{"$f":"IFERROR(VLOOKUP(C318,Katılım!$A$4:$H$301,6,0),0)","v":0}]
[null,null,null,null,{"$f":"IFERROR(VLOOKUP(C318,Katılım!$A$4:$AA$301,27,0),0)","v":0}]
[null,null,null,null,{"$f":"IFERROR(VLOOKUP(C321,Katılım!$A$4:$AA$301,26,0),0)","v":"ALİ KESKİN (YLV)"}]
[64,"E64",72,null,{"$f":"IFERROR(VLOOKUP(C321,Katılım!$A$4:$AA$301,27,0),0)","v":"SEDEF YILDIRIM (YLV)"},{"$f":"AZ68","v":0},{"$f":"IF(AND(F321=0,F323=0),\"\",IF(F321>F323,E320,E323))","v":""},null,{"$f":"IFERROR(VLOOKUP(C321,Katılım!$A$4:$H$301,6,0),0)","v":"YLV"},null,null,"E64",64,{"$f":"OFFSET(Sablon!$DN$1,M321,#REF!)","v":{"$error":"#REF!"}},{"$f":"IFERROR(VLOOKUP(N321,Katılım!$A$4:$Z$301,26,0),0)","v":0},{"$f":"IFERROR(VLOOKUP(N321,Katılım!$A$4:$H$301,6,0),0)","v":0}]
[null,null,null,null,null,null,{"$f":"IF(AND(F321=0,F323=0),\"\",IF(F321>F323,E321,E324))","v":""}]
["64.64",null,168,null,{"$f":"IFERROR(VLOOKUP(C323,Katılım!$A$4:$AA$301,26,0),0)","v":0},{"$f":"BA68","v":0},null,null,{"$f":"IFERROR(VLOOKUP(C323,Katılım!$A$4:$H$301,6,0),0)","v":0}]
[null,null,null,null,{"$f":"IFERROR(VLOOKUP(C323,Katılım!$A$4:$AA$301,27,0),0)","v":0}]

{"sheet":"Eleme","index":3,"n_rows":586,"n_cols":86,"rows_kept":586,"cut":false,"hidden":false,"merged":[[16,5,16,11],[17,5,17,11],[18,5,18,11],[19,5,19,10],[19,12,19,18],[20,12,20,18],[21,5,21,11],[22,5,22,11],[23,5,23,11],[9,5,9,10],[9,12,9,18],[10,12,10,18],[11,5,11,11],[12,5,12,11],[13,5,13,11],[14,5,14,10],[14,12,14,18],[15,12,15,18],[0,0,0,32],[1,0,1,32],[3,5,3,11],[4,5,4,10],[4,12,4,18],[5,12,5,18],[6,5,6,11],[7,5,7,11],[8,5,8,11],[535,26,535,32],[536,26,536,32],[555,26,555,32],[556,26,556,32],[575,26,575,32],[576,26,576,32],[585,5,585,11],[275,26,275,32],[276,26,276,32],[295,26,295,32],[296,26,296,32],[315,26,315,32],[335,26,335,32],[355,26,355,32],[375,26,375,32],[395,26,395,32],[415,26,415,32],[435,26,435,32],[455,26,455,32],[456,26,456,32],[475,26,475,32],[476,26,476,32],[495,26,495,32],[496,26,496,32],[515,26,515,32],[516,26,516,32],[579,5,579,11],[580,5,580,11],[580,19,580,25],[581,5,581,11],[581,19,581,25],[582,5,582,10],[582,12,582,18],[565,5,565,11],[566,5,566,11],[567,5,567,10],[567,12,567,18],[568,12,568,18],[569,5,569,11],[570,5,570,11],[570,19,570,25],[571,5,571,11],[571,19,571,25],[559,5,559,11],[560,5,560,11],[560,19,560,25],[561,5,561,11],[561,19,561,25],[583,12,583,18],[584,5,584,11],[572,5,572,10],[572,12,572,18],[573,12,573,18],[574,5,574,11],[575,5,575,11],[576,5,576,11],[577,5,577,10],[577,12,577,18],[578,12,578,18],[562,5,562,10],[562,12,562,18],[563,12,563,18],[564,5,564,11],[552,5,552,10],[552,12,552,18],[553,12,553,18],[554,5,554,11],[555,5,555,11],[556,5,556,11],[557,5,557,10],[557,12,557,18],[558,12,558,18],[545,5,545,11],[546,5,546,11],[547,5,547,10],[547,12,547,18],[548,12,548,18],[549,5,549,11],[550,5,550,11],[550,19,550,25],[551,5,551,11],[551,19,551,25],[539,5,539,11],[540,5,540,11],[540,19,540,25],[541,5,541,11],[541,19,541,25],[542,5,542,10],[542,12,542,18],[543,12,543,18],[544,5,544,11],[532,5,532,10],[532,12,532,18],[533,12,533,18],[534,5,534,11],[535,5,535,11],[536,5,536,11],[537,5,537,10],[537,12,537,18],[538,12,538,18],[525,5,525,11],[526,5,526,11],[527,5,527,10],[527,12,527,18],[528,12,528,18],[529,5,529,11],[530,5,530,11],[530,19,530,25],[531,5,531,11],[531,19,531,25],[519,5,519,11],[520,5,520,11],[520,19,520,25],[521,5,521,11],[521,19,521,25],[522,5,522,10],[522,12,522,18],[523,12,523,18],[524,5,524,11],[512,5,512,10],[512,12,512,18],[513,12,513,18],[514,5,514,11],[515,5,515,11],[516,5,516,11],[517,5,517,10],[517,12,517,18],[518,12,518,18],[505,5,505,11],[506,5,506,11],[507,5,507,10],[507,12,507,18],[508,12,508,18],[509,5,509,11],[510,5,510,11],[510,19,510,25],[511,5,511,11],[511,19,511,25],[499,5,499,11],[500,5,500,11],[500,19,500,25],[501,5,501,11],[501,19,501,25],[502,5,502,10],[502,12,502,18],[503,12,503,18],[504,5,504,11],[492,5,492,10],[492,12,492,18],[493,12,493,18],[494,5,494,11],[495,5,495,11],[496,5,496,11],[497,5,497,10],[497,12,497,18],[498,12,498,18],[485,5,485,11],[486,5,486,11],[487,5,487,10],[487,12,487,18],[488,12,488,18],[489,5,489,11],[490,5,490,11],[490,19,490,25],[491,5,491,11],[491,19,491,25],[479,5,479,11],[480,5,480,11],[480,19,480,25],[481,5,481,11],[481,19,481,25],[482,5,482,10],[482,12,482,18],[483,12,483,18],[484,5,484,11],[472,5,472,10],[472,12,472,18],[473,12,473,18],[474,5,474,11],[475,5,475,11],[476,5,476,11],[477,5,477,10],[477,12,477,18],[478,12,478,18],[465,5,465,11],[466,5,466,11],[467,5,467,10],[467,12,467,18],[468,12,468,18],[469,5,469,11],[470,5,470,11],[470,19,470,25],[471,5,471,11],[471,19,471,25],[459,5,459,11],[460,5,460,11],[460,19,460,25],[461,5,461,11],[461,19,461,25],[462,5,462,10],[462,12,462,18],[463,12,463,18],[464,5,464,11],[452,5,452,10],[452,12,452,18],[453,12,453,18],[454,5,454,11],[455,5,455,11],[456,5,456,11],[457,5,457,10],[457,12,457,18],[458,12,458,18],[445,5,445,11],[446,5,446,11],[447,5,447,10],[447,12,447,18],[448,12,448,18],[449,5,449,11],[450,5,450,11],[450,19,450,25],[451,5,451,11],[451,19,451,25],[439,5,439,11],[440,5,440,11],[440,19,440,25],[441,5,441,11],[441,19,441,25],[442,5,442,10],[442,12,442,18],[443,12,443,18],[444,5,444,11],[432,5,432,10],[432,12,432,18],[433,12,433,18],[434,5,434,11],[435,5,435,11],[436,5,436,11],[437,5,437,10],[437,12,437,18],[438,12,438,18],[425,5,425,11],[426,5,426,11],[427,5,427,10],[427,12,427,18],[428,12,428,18],[429,5,429,11],[430,5,430,11],[430,19,430,25],[431,5,431,11],[431,19,431,25],[419,5,419,11],[420,5,420,11],[420,19,420,25],[421,5,421,11],[421,19,421,25],[422,5,422,10],[422,12,422,18],[423,12,423,18],[424,5,424,11],[412,5,412,10],[412,12,412,18],[413,12,413,18],[414,5,414,11],[415,5,415,11],[416,5,416,11],[417,5,417,10],[417,12,417,18],[418,12,418,18],[405,5,405,11],[406,5,406,11],[407,5,407,10],[407,12,407,18],[408,12,408,18],[409,5,409,11],[410,5,410,11],[410,19,410,25],[411,5,411,11],[411,19,411,25],[399,5,399,11],[400,5,400,11],[400,19,400,25],[401,5,401,11],[401,19,401,25],[402,5,402,10],[402,12,402,18],[403,12,403,18],[404,5,404,11],[392,5,392,10],[392,12,392,18],[393,12,393,18],[394,5,394,11],[395,5,395,11],[396,5,396,11],[397,5,397,10],[397,12,397,18],[398,12,398,18],[385,5,385,11],[386,5,386,11],[387,5,387,10],[387,12,387,18],[388,12,388,18],[389,5,389,11],[390,5,390,11],[390,19,390,25],[391,5,391,11],[391,19,391,25],[379,5,379,11],[380,5,380,11],[380,19,380,25],[381,5,381,11],[381,19,381,25],[382,5,382,10],[382,12,382,18],[383,12,383,18],[384,5,384,11],[372,5,372,10],[372,12,372,18],[373,12,373,18],[374,5,374,11],[375,5,375,11],[376,5,376,11],[377,5,377,10],[377,12,377,18],[378,12,378,18],[365,5,365,11],[366,5,366,11],[367,5,367,10],[367,12,367,18],[368,12,368,18],[369,5,369,11],[370,5,370,11],[370,19,370,25],[371,5,371,11],[371,19,371,25],[359,5,359,11],[360,5,360,11],[360,19,360,25],[361,5,361,11],[361,19,361,25],[362,5,362,10],[362,12,362,18],[363,12,363,18],[364,5,364,11],[352,5,352,10],[352,12,352,18],[353,12,353,18],[354,5,354,11],[355,5,355,11],[356,5,356,11],[357,5,357,10],[357,12,357,18],[358,12,358,18],[345,5,345,11],[346,5,346,11],[347,5,347,10],[347,12,347,18],[348,12,348,18],[349,5,349,11],[350,5,350,11],[350,19,350,25],[351,5,351,11],[351,19,351,25],[339,5,339,11],[340,5,340,11],[340,19,340,25],[341,5,341,11],[341,19,341,25],[342,5,342,10],[342,12,342,18],[343,12,343,18],[344,5,344,11],[332,5,332,10],[332,12,332,18],[333,12,333,18],[334,5,334,11],[335,5,335,11],[336,5,336,11],[337,5,337,10],[337,12,337,18],[338,12,338,18],[325,5,325,11],[326,5,326,11],[327,5,327,10],[327,12,327,18],[328,12,328,18],[329,5,329,11],[330,5,330,11],[330,19,330,25],[331,5,331,11],[331,19,331,25],[319,5,319,11],[320,5,320,11],[320,19,320,25],[321,5,321,11],[321,19,321,25],[322,5,322,10],[322,12,322,18],[323,12,323,18],[324,5,324,11],[312,5,312,10],[312,12,312,18],[313,12,313,18],[314,5,314,11],[315,5,315,11],[316,5,316,11],[317,5,317,10],[317,12,317,18],[318,12,318,18],[305,5,305,11],[306,5,306,11],[307,5,307,10],[307,12,307,18],[308,12,308,18],[309,5,309,11],[310,5,310,11],[310,19,310,25],[311,5,311,11],[311,19,311,25],[299,5,299,11],[300,5,300,11],[300,19,300,25],[301,5,301,11],[301,19,301,25],[302,5,302,10],[302,12,302,18],[303,12,303,18],[304,5,304,11],[292,5,292,10],[292,12,292,18],[293,12,293,18],[294,5,294,11],[295,5,295,11],[296,5,296,11],[297,5,297,10],[297,12,297,18],[298,12,298,18],[285,5,285,11],[286,5,286,11],[287,5,287,10],[287,12,287,18],[288,12,288,18],[289,5,289,11],[290,5,290,11],[290,19,290,25],[291,5,291,11],[291,19,291,25],[396,26,396,32],[416,26,416,32],[436,26,436,32],[189,12,189,18],[199,12,199,18],[209,12,209,18],[219,12,219,18],[229,12,229,18],[239,12,239,18],[283,12,283,18],[190,12,190,18],[194,12,194,18],[197,19,197,25],[200,12,200,18],[267,12,267,18],[271,19,271,25],[272,12,272,18],[273,12,273,18],[250,12,250,18],[224,12,224,18],[316,26,316,32],[336,26,336,32],[238,19,238,25],[249,12,249,18],[227,19,227,25],[157,19,157,25],[148,19,148,25],[356,26,356,32],[248,19,248,25],[376,26,376,32],[217,19,217,25],[237,19,237,25],[218,19,218,25],[154,12,154,18],[160,12,160,18],[164,12,164,18],[144,12,144,18],[150,12,150,18],[108,19,108,25],[168,19,168,25],[188,19,188,25],[208,19,208,25],[177,19,177,25],[129,12,129,18],[139,12,139,18],[109,12,109,18],[119,12,119,18],[127,19,127,25],[138,19,138,25],[158,19,158,25],[178,19,178,25],[198,19,198,25],[147,19,147,25],[167,19,167,25],[187,19,187,25],[207,19,207,25],[252,5,252,11],[95,12,95,18],[99,12,99,18],[105,12,105,18],[115,12,115,18],[125,12,125,18],[135,12,135,18],[145,12,145,18],[155,12,155,18],[165,12,165,18],[175,12,175,18],[185,12,185,18],[195,12,195,18],[205,12,205,18],[215,12,215,18],[225,12,225,18],[235,12,235,18],[245,12,245,18],[122,5,122,11],[124,5,124,10],[127,5,127,11],[108,5,108,11],[161,5,161,11],[143,5,143,11],[146,5,146,11],[151,5,151,11],[129,5,129,10],[132,5,132,11],[134,5,134,10],[137,5,137,11],[139,5,139,10],[142,5,142,11],[144,5,144,10],[2,65,2,66],[266,5,266,11],[267,5,267,10],[271,5,271,11],[272,5,272,10],[274,5,274,11],[281,5,281,11],[268,12,268,18],[269,5,269,11],[270,5,270,11],[270,19,270,25],[277,5,277,10],[278,12,278,18],[280,5,280,11],[280,19,280,25],[281,19,281,25],[137,19,137,25],[123,5,123,11],[128,5,128,11],[126,5,126,11],[128,19,128,25],[130,12,130,18],[148,5,148,11],[153,5,153,11],[284,5,284,11],[275,5,275,11],[276,5,276,11],[277,12,277,18],[279,5,279,11],[282,5,282,10],[282,12,282,18],[133,5,133,11],[138,5,138,11],[136,5,136,11],[140,12,140,18],[141,5,141,11],[164,5,164,10],[149,12,149,18],[159,12,159,18],[166,5,166,11],[170,12,170,18],[171,5,171,11],[174,12,174,18],[176,5,176,11],[158,5,158,11],[163,5,163,11],[167,5,167,11],[169,5,169,10],[217,5,217,11],[219,5,219,10],[222,5,222,11],[180,12,180,18],[181,5,181,11],[184,12,184,18],[186,5,186,11],[131,5,131,11],[134,12,134,18],[147,5,147,11],[149,5,149,10],[152,5,152,11],[154,5,154,10],[157,5,157,11],[159,5,159,10],[162,5,162,11],[156,5,156,11],[168,5,168,11],[189,5,189,10],[192,5,192,11],[173,5,173,11],[208,5,208,11],[213,5,213,11],[204,12,204,18],[206,5,206,11],[210,12,210,18],[211,5,211,11],[214,12,214,18],[216,5,216,11],[212,5,212,11],[214,5,214,10],[204,5,204,10],[207,5,207,11],[209,5,209,10],[178,5,178,11],[177,5,177,11],[179,5,179,10],[182,5,182,11],[184,5,184,10],[187,5,187,11],[197,5,197,11],[199,5,199,10],[202,5,202,11],[201,5,201,11],[193,5,193,11],[198,5,198,11],[196,5,196,11],[194,5,194,10],[191,5,191,11],[188,5,188,11],[251,5,251,11],[238,5,238,11],[243,5,243,11],[248,5,248,11],[240,12,240,18],[241,5,241,11],[244,12,244,18],[246,5,246,11],[224,5,224,10],[228,5,228,11],[233,5,233,11],[226,5,226,11],[230,12,230,18],[231,5,231,11],[234,12,234,18],[236,5,236,11],[227,5,227,11],[229,5,229,10],[232,5,232,11],[234,5,234,10],[239,5,239,10],[242,5,242,11],[244,5,244,10],[247,5,247,11],[249,5,249,10],[247,19,247,25],[110,12,110,18],[111,5,111,11],[114,12,114,18],[116,5,116,11],[117,19,117,25],[120,12,120,18],[121,5,121,11],[124,12,124,18],[113,5,113,11],[118,5,118,11],[237,5,237,11],[228,19,228,25],[179,12,179,18],[172,5,172,11],[174,5,174,10],[169,12,169,18],[183,5,183,11],[218,5,218,11],[223,5,223,11],[220,12,220,18],[221,5,221,11],[203,5,203,11],[109,5,109,10],[112,5,112,11],[114,5,114,10],[117,5,117,11],[119,5,119,10],[107,19,107,25],[118,19,118,25],[94,12,94,18],[96,5,96,11],[97,19,97,25],[100,12,100,18],[101,5,101,11],[104,12,104,18],[106,5,106,11],[98,5,98,11],[103,5,103,11],[94,5,94,10],[97,5,97,11],[99,5,99,10],[102,5,102,11],[104,5,104,10],[98,19,98,25],[28,5,28,11],[29,5,29,10],[29,12,29,18],[24,5,24,10],[24,12,24,18],[25,12,25,18],[26,5,26,11],[27,5,27,11],[107,5,107,11],[93,5,93,11],[30,12,30,18],[31,5,31,11],[32,5,32,11],[33,5,33,11],[34,5,34,10],[34,12,34,18],[35,12,35,18],[42,5,42,11],[43,5,43,11],[44,5,44,10],[44,12,44,18],[45,12,45,18],[46,5,46,11],[47,5,47,11],[36,5,36,11],[37,5,37,11],[38,5,38,11],[39,5,39,10],[39,12,39,18],[40,12,40,18],[41,5,41,11],[49,5,49,10],[49,12,49,18],[68,5,68,11],[56,5,56,11],[57,5,57,11],[58,5,58,11],[59,5,59,10],[59,12,59,18],[60,12,60,18],[61,5,61,11],[48,5,48,11],[50,12,50,18],[51,5,51,11],[52,5,52,11],[53,5,53,11],[54,5,54,10],[54,12,54,18],[55,12,55,18],[66,5,66,11],[67,5,67,11],[62,5,62,11],[63,5,63,11],[64,5,64,10],[64,12,64,18],[65,12,65,18],[82,5,82,11],[76,5,76,11],[77,5,77,11],[78,5,78,11],[79,5,79,10],[79,12,79,18],[80,12,80,18],[81,5,81,11],[69,5,69,10],[69,12,69,18],[70,12,70,18],[71,5,71,11],[72,5,72,11],[73,5,73,11],[74,5,74,10],[74,12,74,18],[75,12,75,18]]}
["TÜRKİYE MASA TENİSİ FEDERASYONU                                                                                                                                                                                                                                                                                   İsmail Eren ALICI Küçükler Ferdi-Takım Türkiye Şampiyonası",null,null,null,null,null,null,null,null,null,null,null,null,null,null,null,null,null,null,null,null,null,null,null,null,null,null,null,null,null,null,null,null,null,null,null,null,null,null,null,null,null,null,null,null,null,null,null,null,null,null,null,null,null,null,null,null,null,null,null,null,null,null,null,null,null,null,null,null,null,null,null,null,null,null,null,null,null,null,null,null,null,null,null,"1st Round",2]
["KARMA [ 09-13 Nisan 2025 ÇORUM ] [ Eleme ]",null,null,null,null,null,null,null,null,null,null,null,null,null,null,null,null,null,null,null,null,null,null,null,null,null,null,null,null,null,null,null,null,null,null,null,null,null,null,null,null,null,null,null,null,null,null,null,null,null,null,null,null,null,null,null,null,null,null,null,null,null,null,null,null,null,null,null,null,null,null,null,null,null,null,null,null,null,null,null,null,null,null,null,"2sn Round"]
["Y","S","B","Q","#",null,null,null,null,null,null,null,null,null,null,null,null,null,null,null,null,null,null,null,null,null,null,null,null,null,null,null,null,null,null,null,null,null,null,null,null,null,null,null,null,null,null,null,null,null,null,null,null,null,null,null,null,null,"#",null,"Time","Table","Competition","Player A","Player B","Result",null,null,null,null,null,null,null,null,null,null,null,null,null,null,null,null,null,null,"3th Round"]
[1,1,null,null,1,"ARAS AYDIN (İST)",null,null,null,null,null,null,null,null,null,null,null,null,null,null,null,null,null,null,null,null,null,null,null,null,null,null,null,null,null,null,null,null,null,null,null,null,null,null,null,null,null,null,null,null,null,null,null,null,null,null,null,null,1,null,null,null,null,"ARAS AYDIN (İST)-ARMİN AYDIN (İST)","-"]
[null,null,null,null," ","ARMİN AYDIN (İST)",null,null,null,null,null,1,"",null,null,null,null,null,null,null,null,null,null,null,null,null,null,null,null,null,null,null,null,null,null,null,null,null,null,null,null,null,null,null,null,null,null,null,null,null,null,null,null,null,null,null,null,null,2,null,null,null,null,"AHMET EFE YILMAZ (İST)-AYŞE NAR ALPTEKİN (İST)","BEYAZIT BERK DEMİR (AMS)-ESMA KAMER SÜT (KYS)"]
[null,null,null,null,null,null,null,0,0,null,null,null,"",null,null,null,null,null,null,1,null,null,null,null,null,null,null,null,null,null,null,null,null,null,null,null,null,null,null,null,null,null,null,null,null,null,null,null,null,null,null,null,null,null,null,null,null,null,3,null,null,null,null,"ALİ ENES SEREN (KNY)-ASİYE TUĞÇE KENAR (KNY)","TOLGAHAN PEKMEZ (AMS)-ZÜMRA KALKAN (AMS)"]
[2,17,1,null,999,null,null,null,null,null,null,null,null,null,null,null,null,null,null,null,null,null,null,null,null,null,null,null,null,null,null,null,null,null,null,null,null,null,null,null,null,null,null,null,null,null,null,null,null,null,null,null,null,null,null,null,null,null,4,null,null,null,null,"-","MUHAMMED EMRE KANTİK (ÇRM)-DERİN MÜLAZIM (ÇRM)"]
[null,null,null,null,null,null,null,null,null,null,null,null,null,null,null,null,null,null,null,null,null,null,null,null,null,null,null,null,null,null,null,null,null,null,null,null,null,null,null,null,null,null,null,null,null,null,null,null,null,null,null,null,null,null,null,null,null,null,5,null,null,null,null,"AKİF EMRE BUCAK (İST)-AYBİGE FERİDE ÜSTÜNDAĞ (MĞL)","-"]
[3,17,9,"E9",16,"AHMET EFE YILMAZ (İST)",null,null,null,null,null,null,null,null,null,null,null,null,null,null,null,null,null,null,null,null,null,null,null,null,null,null,null,null,null,null,null,null,null,null,null,null,null,null,null,null,null,null,null,null,null,null,null,null,null,null,null,null,6,null,null,null,null,"ALİ BERKE GÜMÜŞ (KNY)-BURCU AL (KNY)","MUHAMMED EMİN KABADAYI (BRS)-EMİNE AYDINAY (BRS)"]
[null,null,null,null,null,"AYŞE NAR ALPTEKİN (İST)",null,null,null,null,null,2,"",null,null,null,null,null,null,null,null,null,null,null,null,null,null,null,null,null,null,null,null,null,null,null,null,null,null,null,null,null,null,null,null,null,null,null,null,null,null,null,null,null,null,null,null,null,7,null,null,null,null,"MUSTAFA YILDIRIM (İST)-FEYZA KOÇER (KYS)","ENSAR AYDIN (İST)-İPEK UĞUR (İST)"]
[null,null,null,null,null,null,null,0,0,null,null,null,"",null,null,null,null,null,null,2,null,null,null,null,null,null,null,null,null,null,null,null,null,null,null,null,null,null,null,null,null,null,null,null,null,null,null,null,null,null,null,null,null,null,null,null,null,null,8,null,null,null,null,"-","AHMET YİĞİT GÜLENLER (GZT)-MEDİNE İREM TÜRKAN (BTM)"]
[4,9,null,"E8",17,"BEYAZIT BERK DEMİR (AMS)",null,null,null,null,null,null,null,null,null,null,null,null,null,null,null,null,null,null,null,null,null,null,null,null,null,null,null,null,null,null,null,null,null,null,null,null,null,null,null,null,null,null,null,null,null,null,null,null,null,null,null,null,9,null,null,null,null,"AHMET BERK TÜKENMEZ (İST)-ZEYNEP DURAN (İST)","-"]
[null,null,null,null,null,"ESMA KAMER SÜT (KYS)",null,null,null,null,null,null,null,null,null,null,null,null,null,null,null,null,null,null,null,null,null,null,null,null,null,null,null,null,null,null,null,null,null,null,null,null,null,null,null,null,null,null,null,null,null,null,null,null,null,null,null,null,10,null,null,null,null,"KEREM KÖSE (İST)-BERRA BAHTİYAR (SKR)","DURSUN AYAZ NARMAN (KRK)-ZEYNEP KALKAN (HTY)"]
[5,9,null,"E16",9,"ALİ ENES SEREN (KNY)",null,null,null,null,null,null,null,null,null,null,null,null,null,null,null,null,null,null,null,null,null,null,null,null,null,null,null,null,null,null,null,null,null,null,null,null,null,null,null,null,null,null,null,null,null,null,null,null,null,null,null,null,11,null,null,null,null,"CEMAL AYAZ KARTAL (YLV)-DURU BERİL TOK (YLV)","CANBERK SEVİNDİK (ÇRM)-ELİF NUR KOÇ (ÇRM)"]
[null,null,null,null,null,"ASİYE TUĞÇE KENAR (KNY)",null,null,null,null,null,3,"",null,null,null,null,null,null,null,null,null,null,null,null,null,null,null,null,null,null,null,null,null,null,null,null,null,null,null,null,null,null,null,null,null,null,null,null,null,null,null,null,null,null,null,null,null,12,null,null,null,null,"-","YİĞİT HÜSEYİN SUBAŞI (ÇRM)-ELİF DURU BECER (ÇRM)"]
[null,null,null,null,null,null,null,0,0,null,null,null,"",null,null,null,null,null,null,3,null,null,null,null,null,null,null,null,null,null,null,null,null,null,null,null,null,null,null,null,null,null,null,null,null,null,null,null,null,null,null,null,null,null,null,null,null,null,13,null,null,null,null,"TAYİP YUSUF (BTM)-ŞEVVAL ALAŞ (BTM)","-"]
[6,17,13,"E1",24,"TOLGAHAN PEKMEZ (AMS)",null,null,null,null,null,null,null,null,null,null,null,null,null,null,null,null,null,null,null,null,null,null,null,null,null,null,null,null,null,null,null,null,null,null,null,null,null,null,null,null,null,null,null,null,null,null,null,null,null,null,null,null,14,null,null,null,null,"MUSTAFA KAYRA TURAN (KNY)-CEYDA DÖKMECİ (KNY)","AHMET ÇELİK (ÇRM)-HAFSA YURTERİ (İZM)"]
[null,null,null,null,null,"ZÜMRA KALKAN (AMS)",null,null,null,null,null,null,null,null,null,null,null,null,null,null,null,null,null,null,null,null,null,null,null,null,null,null,null,null,null,null,null,null,null,null,null,null,null,null,null,null,null,null,null,null,null,null,null,null,null,null,null,null,15,null,null,null,null,"ALİ SAİD AKDOĞAN (ÇRM)-ESMA SULTAN SARI (SKR)","HÜSEYİN UTKU KIRBAÇ  (İST)-BUĞLEM SENA ÇALIŞKAN (SKR)"]
[7,17,5,null,25,null,null,null,null,null,null,null,null,null,null,null,null,null,null,null,null,null,null,null,null,null,null,null,null,null,null,null,null,null,null,null,null,null,null,null,null,null,null,null,null,null,null,null,null,null,null,null,null,null,null,null,null,null,16,null,null,null,null,"-","BERAT ÖZDEMİR (ÇRM)-BELİNAY DAVUŞ (KST)"]
[null,null,null,null,null,null,null,null,null,null,null,4,""]
[null,null,null,null,null,null,null,0,0,null,null,null,"",null,null,null,null,null,null,4]
[8,5,null,null,8,"MUHAMMED EMRE KANTİK (ÇRM)"]
[null,null,null,null,null,"DERİN MÜLAZIM (ÇRM)"]
[9,5,null,null,5,"AKİF EMRE BUCAK (İST)"]
[null,null,null,null,null,"AYBİGE FERİDE ÜSTÜNDAĞ (MĞL)",null,null,null,null,null,5,""]
[null,null,null,null,null,null,null,0,0,null,null,null,"",null,null,null,null,null,null,5]
[10,17,7,null,28]
[]
[11,17,15,"E5",20,"ALİ BERKE GÜMÜŞ (KNY)"]
[null,null,null,null,null,"BURCU AL (KNY)",null,null,null,null,null,6,""]
[null,null,null,null,null,null,null,0,0,null,null,null,"",null,null,null,null,null,null,6]
[12,9,null,"E13",12,"MUHAMMED EMİN KABADAYI (BRS)"]
[null,null,null,null,null,"EMİNE AYDINAY (BRS)"]
[13,9,null,"E12",13,"MUSTAFA YILDIRIM (İST)"]
[null,null,null,null,null,"FEYZA KOÇER (KYS)",null,null,null,null,null,7,""]
[null,null,null,null,null,null,null,0,0,null,null,null,"",null,null,null,null,null,null,7]
[14,17,11,"E4",21,"ENSAR AYDIN (İST)"]
[null,null,null,null,null,"İPEK UĞUR (İST)"]
[15,17,3,null,29]
[null,null,null,null,null,null,null,null,null,null,null,8,""]
[null,null,null,null,null,null,null,0,0,null,null,null,"",null,null,null,null,null,null,8]
[16,3,null,null,4,"AHMET YİĞİT GÜLENLER (GZT)"]
[null,null,null,null,null,"MEDİNE İREM TÜRKAN (BTM)"]
[17,3,null,null,3,"AHMET BERK TÜKENMEZ (İST)"]
[null,null,null,null,null,"ZEYNEP DURAN (İST)",null,null,null,null,null,9,""]
[null,null,null,null,null,null,null,0,0,null,null,null,"",null,null,null,null,null,null,9]
[18,17,4,null,999]
[]
[19,17,12,"E3",22,"KEREM KÖSE (İST)"]
[null,null,null,null,null,"BERRA BAHTİYAR (SKR)",null,null,null,null,null,10,""]
[null,null,null,null,null,null,null,0,0,null,null,null,"",null,null,null,null,null,null,10]
[20,9,null,"E14",14,"DURSUN AYAZ NARMAN (KRK)"]
[null,null,null,null,null,"ZEYNEP KALKAN (HTY)"]
[21,9,null,"E11",11,"CEMAL AYAZ KARTAL (YLV)"]
[null,null,null,null,null,"DURU BERİL TOK (YLV)",null,null,null,null,null,11,""]
[null,null,null,null,null,null,null,0,0,null,null,null,"",null,null,null,null,null,null,11]
[22,17,null,"E6",19,"CANBERK SEVİNDİK (ÇRM)"]
[null,null,null,null,null,"ELİF NUR KOÇ (ÇRM)"]
[23,17,8,null,27]
[null,null,null,null,null,null,null,null,null,null,null,12,""]
[null,null,null,null,null,null,null,0,0,null,null,null,"",null,null,null,null,null,null,12]
[24,5,null,null,6,"YİĞİT HÜSEYİN SUBAŞI (ÇRM)"]
[null,null,null,null,null,"ELİF DURU BECER (ÇRM)"]
[25,5,null,null,7,"TAYİP YUSUF (BTM)"]
[null,null,null,null,null,"ŞEVVAL ALAŞ (BTM)",null,null,null,null,null,13,""]
[null,null,null,null,null,null,null,0,0,null,null,null,"",null,null,null,null,null,null,13]
[26,17,6,null,26]
[]
[27,17,14,"E7",18,"MUSTAFA KAYRA TURAN (KNY)"]
[null,null,null,null,null,"CEYDA DÖKMECİ (KNY)",null,null,null,null,null,14,""]
[null,null,null,null,null,null,null,0,0,null,null,null,"",null,null,null,null,null,null,14]
[28,9,null,"E15",10,"AHMET ÇELİK (ÇRM)"]
[null,null,null,null,null,"HAFSA YURTERİ (İZM)"]
[29,9,null,"E10",15,"ALİ SAİD AKDOĞAN (ÇRM)"]
[null,null,null,null,null,"ESMA SULTAN SARI (SKR)",null,null,null,null,null,15,""]
[null,null,null,null,null,null,null,0,0,null,null,null,"",null,null,null,null,null,null,15]
[30,17,10,"E2",23,"HÜSEYİN UTKU KIRBAÇ  (İST)"]
[null,null,null,null,null,"BUĞLEM SENA ÇALIŞKAN (SKR)"]
[31,17,2,null,999]
[null,null,null,null,null,null,null,null,null,null,null,16,""]
[null,null,null,null,null,null,null,0,0,null,null,null,"",null,null,null,null,null,null,16]
[32,2,null,null,2,"BERAT ÖZDEMİR (ÇRM)"]
[null,null,null,null,null,"BELİNAY DAVUŞ (KST)"]
[]
[]
[]
[]
[]
[]
[]
[]
[]
[]
[1,1,0," ",1,"ARAS AYDIN (İST)",null,null,null,null,null,null,null,null,null,null,null,null,null,null,null,null,null,null,null,null,null,null,null,null,null,null,null,null,null,null,null,null,null,null,null,null,null,null,null,null,null,null,null,null,null,null,null,null,null,null,null,null,1,null,null,null,null,"ARAS AYDIN (İST)-ARMİN AYDIN (İST)","-"]
[null,null,null,null," ","ARMİN AYDIN (İST)",null,null,null,null,null,1,"",null,null,null,null,null,null,null,null,null,null,null,null,null,null,null,null,null,null,null,null,null,null,null,null,null,null,null,null,null,null,null,null,null,null,null,null,null,null,null,null,null,null,null,null,null,2,null,null,null,null,"TAHA DERELİ (İST)-BERRA DEMİR (İST)","FURKAN KONYALI (ÇRM)-BURCU ASEL TUNCER (ÇRM)"]
[null,null,null,null,null,null,null,0,0,null,null,null,"",null,null,null,null,null,null,null,null,null,null,null,null,null,null,null,null,null,null,null,null,null,null,null,null,null,null,null,null,null,null,null,null,null,null,null,null,null,null,null,null,null,null,null,null,null,3,null,null,null,null,"BEYAZIT BERK DEMİR (AMS)-ESMA KAMER SÜT (KYS)","KAYA ARSLAN (İST)-IRMAK PİŞKİNOĞLU (KRL)"]
[2,33,1,null,999,null,null,null,null,null,null,null,null,null,null,null,null,null,33,null,null,null,null,null,null,null,null,null,null,null,null,null,null,null,null,null,null,null,null,null,null,null,null,null,null,null,null,null,null,null,null,null,null,null,null,null,null,null,4,null,null,null,null,"EYMEN SAVCI (ADN)-BEREN BOZKURT (ADN)","AHMET EFE YILMAZ (İST)-AYŞE NAR ALPTEKİN (İST)"]
[null,null,null,null,null,null,null,null,null,null,null,null,null,null,null,null,null,null,null,"",null,null,null,null,null,null,null,null,null,null,null,null,null,null,null,null,null,null,null,null,null,null,null,null,null,null,null,null,null,null,null,null,null,null,null,null,null,null,5,null,null,null,null,"ALİ ENES SEREN (KNY)-ASİYE TUĞÇE KENAR (KNY)","ALİ UYGAR YILDIRICI (İST)-UMAY ŞAHİN (İST)"]
[3,33,17,"E16",48,"TAHA DERELİ (İST)",null,null,null,null,null,null,null,null,0,0,null,null,null,"",null,null,null,null,null,null,null,null,null,null,null,null,null,null,null,null,null,null,null,null,null,null,null,null,null,null,null,null,null,null,null,null,null,null,null,null,null,null,6,null,null,null,null,"MEHMET FATİH GEZER (İST)-CEMRE İPEK YÜTÜK (İST)","TOLGAHAN PEKMEZ (AMS)-ZÜMRA KALKAN (AMS)"]
[null,null,null,"",null,"BERRA DEMİR (İST)",null,null,null,null,null,2,"",null,null,null,null,null,null,null,null,null,null,null,null,null,null,null,null,null,null,null,null,null,null,null,null,null,null,null,null,null,null,null,null,null,null,null,null,null,null,null,null,null,null,null,null,null,7,null,null,null,null,"MUHAMMED BELLO (MRS)-NİSA ÜZÜMCÜ (BTM)","İSMAİL TARHAN (MRD)-HAVİN MUTLU (MRD)"]
[null,null,null,null,null,null,null,0,0,null,null,null,"",null,null,null,null,null,null,null,null,null,null,null,null,null,null,null,null,null,null,null,null,null,null,null,null,null,null,null,null,null,null,null,null,null,null,null,null,null,null,null,null,null,null,null,null,null,8,null,null,null,null,"-","MUHAMMED EMRE KANTİK (ÇRM)-DERİN MÜLAZIM (ÇRM)"]
[4,17,0,"",32,"FURKAN KONYALI (ÇRM)",null,null,null,null,null,null,null,null,null,null,null,null,null,null,null,null,null,null,null,null,null,null,null,null,null,null,null,null,null,null,null,null,null,null,null,null,null,null,null,null,null,null,null,null,null,null,null,null,null,null,null,null,9,null,null,null,null,"AKİF EMRE BUCAK (İST)-AYBİGE FERİDE ÜSTÜNDAĞ (MĞL)","-"]
[null,null,null,null,null,"BURCU ASEL TUNCER (ÇRM)",null,null,null,null,null,null,null,null,null,null,null,null,null,null,null,null,null,null,null,null,null,null,null,null,null,null,null,null,null,null,null,null,null,null,null,null,null,null,null,null,null,null,null,null,null,null,null,null,null,null,null,null,10,null,null,null,null,"AHMET URAZ KİRAZ (MĞL)-0","METEHAN ŞAHİN (GZT)-ASMİN YAĞMAHAN (BTM)"]
[5,17,0,"",17,"BEYAZIT BERK DEMİR (AMS)",null,null,null,null,null,null,null,null,null,null,null,null,null,null,null,null,null,null,null,null,null,null,null,null,null,null,null,null,null,null,null,null,null,null,null,null,null,null,null,null,null,null,null,null,null,null,null,null,null,null,null,null,11,null,null,null,null,"ENSAR AYDIN (İST)-İPEK UĞUR (İST)","EYMEN YERDELEN (SNP)-DEFNE ANIK (SNP)"]
[null,null,null,"",null,"ESMA KAMER SÜT (KYS)",null,null,null,null,null,3,"",null,null,null,null,null,null,null,null,null,null,null,null,null,null,null,null,null,null,null,null,null,null,null,null,null,null,null,null,null,null,null,null,null,null,null,null,null,null,null,null,null,null,null,null,null,12,null,null,null,null,"AHMET ERDEM AYDIN (KNY)-ZEYNEP ÖZÇELİK (İST)","MUHAMMED EMİN KABADAYI (BRS)-EMİNE AYDINAY (BRS)"]
[null,null,null,null,null,null,null,0,0,null,null,null,"",null,null,null,null,null,null,null,null,null,null,null,null,null,null,null,null,null,null,null,null,null,null,null,null,null,null,null,null,null,null,null,null,null,null,null,null,null,null,null,null,null,null,null,null,null,13,null,null,null,null,"MUSTAFA YILDIRIM (İST)-FEYZA KOÇER (KYS)","AKİF ÇİĞİL (ADN)-AYÇA SU DÖŞ (ADN)"]
[6,33,25,"E8",33,"KAYA ARSLAN (İST)",null,null,null,null,null,null,null,null,null,null,null,null,34,null,null,null,null,null,null,null,null,null,null,null,null,null,null,null,null,null,null,null,null,null,null,null,null,null,null,null,null,null,null,null,null,null,null,null,null,null,null,null,14,null,null,null,null,"MEHMET TATAR (VAN       )-NİHAN BERA KOÇER (NVŞ)","ALİ BERKE GÜMÜŞ (KNY)-BURCU AL (KNY)"]
[null,null,null,null,null,"IRMAK PİŞKİNOĞLU (KRL)",null,null,null,null,null,null,null,null,null,null,null,null,null,"",null,null,null,null,null,null,null,null,null,null,null,null,null,null,null,null,null,null,null,null,null,null,null,null,null,null,null,null,null,null,null,null,null,null,null,null,null,null,15,null,null,null,null,"MUHAMMED BARIŞ KALKAN (GZT)-ZEYNEP POLAT (GZT)","ŞEYHMUS KAPLAN (ÇRM)-ZEYNEP ELA ÇELİK (ÇRM)"]
[7,33,9,"E24",49,"EYMEN SAVCI (ADN)",null,null,null,null,null,null,null,null,0,0,null,null,null,"",null,null,null,null,null,null,null,null,null,null,null,null,null,null,null,null,null,null,null,null,null,null,null,null,null,null,null,null,null,null,null,null,null,null,null,null,null,null,16,null,null,null,null,"-","AHMET YİĞİT GÜLENLER (GZT)-MEDİNE İREM TÜRKAN (BTM)"]
[null,null,null,"",null,"BEREN BOZKURT (ADN)",null,null,null,null,null,4,"",null,null,null,null,null,null,null,null,null,null,null,null,null,null,null,null,null,null,null,null,null,null,null,null,null,null,null,null,null,null,null,null,null,null,null,null,null,null,null,null,null,null,null,null,null,17,null,null,null,null,"AHMET BERK TÜKENMEZ (İST)-ZEYNEP DURAN (İST)","-"]
[null,null,null,null,null,null,null,0,0,null,null,null,"",null,null,null,null,null,null,null,null,null,null,null,null,null,null,null,null,null,null,null,null,null,null,null,null,null,null,null,null,null,null,null,null,null,null,null,null,null,null,null,null,null,null,null,null,null,18,null,null,null,null,"MEHMET AKİF TORU (AMS)-DENİZ BERRA BAYRAM (KYS)","AKİF EYMEN TURAN (İST)-EDA MORAL (İST)"]
[8,9," ","",16,"AHMET EFE YILMAZ (İST)",null,null,null,null,null,null,null,null,null,null,null,null,null,null,null,null,null,null,null,null,null,null,null,null,null,null,null,null,null,null,null,null,null,null,null,null,null,null,null,null,null,null,null,null,null,null,null,null,null,null,null,null,19,null,null,null,null,"CANBERK SEVİNDİK (ÇRM)-ELİF NUR KOÇ (ÇRM)","BERK TURAN (YLV)-FİRDEVS NUR BİNGÖL (YLV)"]
[null,null,null,null,null,"AYŞE NAR ALPTEKİN (İST)",null,null,null,null,null,null,null,null,null,null,null,null,null,null,null,null,null,null,null,null,null,null,null,null,null,null,null,null,null,null,null,null,null,null,null,null,null,null,null,null,null,null,null,null,null,null,null,null,null,null,null,null,20,null,null,null,null,"KUDRET GÜLMEZLER (DNZ)-FERİDE MELİKE HAMAL (DNZ)","DURSUN AYAZ NARMAN (KRK)-ZEYNEP KALKAN (HTY)"]
[9,9,0,"",9,"ALİ ENES SEREN (KNY)",null,null,null,null,null,null,null,null,null,null,null,null,null,null,null,null,null,null,null,null,null,null,null,null,null,null,null,null,null,null,null,null,null,null,null,null,null,null,null,null,null,null,null,null,null,null,null,null,null,null,null,null,21,null,null,null,null,"CEMAL AYAZ KARTAL (YLV)-DURU BERİL TOK (YLV)","CAFER ASAF ÖZ (KRK)-ZEYNEP ELİF ÜNSAL (AMS)"]
[null,null,null,"",null,"ASİYE TUĞÇE KENAR (KNY)",null,null,null,null,null,5,"",null,null,null,null,null,null,null,null,null,null,null,null,null,null,null,null,null,null,null,null,null,null,null,null,null,null,null,null,null,null,null,null,null,null,null,null,null,null,null,null,null,null,null,null,null,22,null,null,null,null,"AHMET EMİR KALKAN (GZT)-ECRİN ATASEVER (MRD)","KEREM KÖSE (İST)-BERRA BAHTİYAR (SKR)"]
[null,null,null,null,null,null,null,0,0,null,null,null,"",null,null,null,null,null,null,null,null,null,null,null,null,null,null,null,null,null,null,null,null,null,null,null,null,null,null,null,null,null,null,null,null,null,null,null,null,null,null,null,null,null,null,null,null,null,23,null,null,null,null,"KERİM ESAT ODACI (KNY)-ELA TOPRAK TOKATLI (KNY)","ATA URAZ BAHADIR (MĞL)-İLKİM EYLÜL YEKREK (MĞL)"]
[10,33,13,"E20",56,"ALİ UYGAR YILDIRICI (İST)",null,null,null,null,null,null,null,null,null,null,null,null,35,null,null,null,null,null,null,null,null,null,null,null,null,null,null,null,null,null,null,null,null,null,null,null,null,null,null,null,null,null,null,null,null,null,null,null,null,null,null,null,24,null,null,null,null,"-","YİĞİT HÜSEYİN SUBAŞI (ÇRM)-ELİF DURU BECER (ÇRM)"]
[null,null,null,null,null,"UMAY ŞAHİN (İST)",null,null,null,null,null,null,null,null,null,null,null,null,null,"",null,null,null,null,null,null,null,null,null,null,null,null,null,null,null,null,null,null,null,null,null,null,null,null,null,null,null,null,null,null,null,null,null,null,null,null,null,null,25,null,null,null,null,"TAYİP YUSUF (BTM)-ŞEVVAL ALAŞ (BTM)","-"]
[11,33,29,"E4",40,"MEHMET FATİH GEZER (İST)",null,null,null,null,null,null,null,null,0,0,null,null,null,"",null,null,null,null,null,null,null,null,null,null,null,null,null,null,null,null,null,null,null,null,null,null,null,null,null,null,null,null,null,null,null,null,null,null,null,null,null,null,26,null,null,null,null,"ÖMER MUSAB TOY (BTM)-IRMAK BURAKMAK (DYB)","YİĞİT BOLAT (ADN)-ATİYE ÖZER (ADN)"]
[null,null,null,"",null,"CEMRE İPEK YÜTÜK (İST)",null,null,null,null,null,6,"",null,null,null,null,null,null,null,null,null,null,null,null,null,null,null,null,null,null,null,null,null,null,null,null,null,null,null,null,null,null,null,null,null,null,null,null,null,null,null,null,null,null,null,null,null,27,null,null,null,null,"HÜSEYİN UTKU KIRBAÇ  (İST)-BUĞLEM SENA ÇALIŞKAN (SKR)","M. BİLAL ARTUKOĞLU (MRD)-ŞEVVAL ÖZDEMİR (İST)"]
[null,null,null,null,null,null,null,0,0,null,null,null,"",null,null,null,null,null,null,null,null,null,null,null,null,null,null,null,null,null,null,null,null,null,null,null,null,null,null,null,null,null,null,null,null,null,null,null,null,null,null,null,null,null,null,null,null,null,28,null,null,null,null,"EMİR SARIDOĞAN (ADN)-GİZEM ÇİĞİL (ADN)","AHMET ÇELİK (ÇRM)-HAFSA YURTERİ (İZM)"]
[12,17,0,"",24,"TOLGAHAN PEKMEZ (AMS)",null,null,null,null,null,null,null,null,null,null,null,null,null,null,null,null,null,null,null,null,null,null,null,null,null,null,null,null,null,null,null,null,null,null,null,null,null,null,null,null,null,null,null,null,null,null,null,null,null,null,null,null,29,null,null,null,null,"ALİ SAİD AKDOĞAN (ÇRM)-ESMA SULTAN SARI (SKR)","AHMET İLKER AY (KNY)-HAFSA TORBALI (KNY)"]
[null,null,null,null,null,"ZÜMRA KALKAN (AMS)",null,null,null,null,null,null,null,null,null,null,null,null,null,null,null,null,null,null,null,null,null,null,null,null,null,null,null,null,null,null,null,null,null,null,null,null,null,null,null,null,null,null,null,null,null,null,null,null,null,null,null,null,30,null,null,null,null,"KEREM GÜLLER (İST)-ADA MORAL (İST)","MUSTAFA KAYRA TURAN (KNY)-CEYDA DÖKMECİ (KNY)"]
[13,17,0,"",25,"MUHAMMED BELLO (MRS)",null,null,null,null,null,null,null,null,null,null,null,null,null,null,null,null,null,null,null,null,null,null,null,null,null,null,null,null,null,null,null,null,null,null,null,null,null,null,null,null,null,null,null,null,null,null,null,null,null,null,null,null,31,null,null,null,null,"AKİF EFE ASLANPAY (MĞL)-ZEYNEP ÇAM (MĞL)","EGE BOLAT (ADN)-CEREN BUDAK (ADN)"]
[null,null,null,"",null,"NİSA ÜZÜMCÜ (BTM)",null,null,null,null,null,7,"",null,null,null,null,null,null,null,null,null,null,null,null,null,null,null,null,null,null,null,null,null,null,null,null,null,null,null,null,null,null,null,null,null,null,null,null,null,null,null,null,null,null,null,null,null,32,null,null,null,null,"-","BERAT ÖZDEMİR (ÇRM)-BELİNAY DAVUŞ (KST)"]
[null,null,null,null,null,null,null,0,0,null,null,null,"",null,null,null,null,null,null,null,null,null,null,null,null,null,null,null,null,null,null,null,null,null,null,null,null,null,null,null,null,null,null,null,null,null,null,null,null,null,null,null,null,null,null,null,null,null,33,null,null,null,null,"-","FURKAN KONYALI (ÇRM)-BURCU ASEL TUNCER (ÇRM)"]
[14,33,21,"E12",41,"İSMAİL TARHAN (MRD)",null,null,null,null,null,null,null,null,null,null,null,null,36,null,null,null,null,null,null,null,null,null,null,null,null,null,null,null,null,null,null,null,null,null,null,null,null,null,null,null,null,null,null,null,null,null,null,null,null,null,null,null,34,null,null,null,null,"KAYA ARSLAN (İST)-IRMAK PİŞKİNOĞLU (KRL)","AHMET EFE YILMAZ (İST)-AYŞE NAR ALPTEKİN (İST)"]
[null,null,null,null,null,"HAVİN MUTLU (MRD)",null,null,null,null,null,null,null,null,null,null,null,null,null,"",null,null,null,null,null,null,null,null,null,null,null,null,null,null,null,null,null,null,null,null,null,null,null,null,null,null,null,null,null,null,null,null,null,null,null,null,null,null,35,null,null,null,null,"ALİ UYGAR YILDIRICI (İST)-UMAY ŞAHİN (İST)","TOLGAHAN PEKMEZ (AMS)-ZÜMRA KALKAN (AMS)"]
[15,33,5,null,999,null,null,null,null,null,null,null,null,null,0,0,null,null,null,"",null,null,null,null,null,null,null,null,null,null,null,null,null,null,null,null,null,null,null,null,null,null,null,null,null,null,null,null,null,null,null,null,null,null,null,null,null,null,36,null,null,null,null,"İSMAİL TARHAN (MRD)-HAVİN MUTLU (MRD)","MUHAMMED EMRE KANTİK (ÇRM)-DERİN MÜLAZIM (ÇRM)"]
[null,null,null,"",null,null,null,null,null,null,null,8,"",null,null,null,null,null,null,null,null,null,null,null,null,null,null,null,null,null,null,null,null,null,null,null,null,null,null,null,null,null,null,null,null,null,null,null,null,null,null,null,null,null,null,null,null,null,37,null,null,null,null,"-","METEHAN ŞAHİN (GZT)-ASMİN YAĞMAHAN (BTM)"]
[null,null,null,null,null,null,null,0,0,null,null,null,"",null,null,null,null,null,null,null,null,null,null,null,null,null,null,null,null,null,null,null,null,null,null,null,null,null,null,null,null,null,null,null,null,null,null,null,null,null,null,null,null,null,null,null,null,null,38,null,null,null,null,"EYMEN YERDELEN (SNP)-DEFNE ANIK (SNP)","MUHAMMED EMİN KABADAYI (BRS)-EMİNE AYDINAY (BRS)"]
[16,5," ","",8,"MUHAMMED EMRE KANTİK (ÇRM)",null,null,null,null,null,null,null,null,null,null,null,null,null,null,null,null,null,null,null,null,null,null,null,null,null,null,null,null,null,null,null,null,null,null,null,null,null,null,null,null,null,null,null,null,null,null,null,null,null,null,null,null,39,null,null,null,null,"AKİF ÇİĞİL (ADN)-AYÇA SU DÖŞ (ADN)","ALİ BERKE GÜMÜŞ (KNY)-BURCU AL (KNY)"]
[null,null,null,null,null,"DERİN MÜLAZIM (ÇRM)",null,null,null,null,null,null,null,null,null,null,null,null,null,null,null,null,null,null,null,null,null,null,null,null,null,null,null,null,null,null,null,null,null,null,null,null,null,null,null,null,null,null,null,null,null,null,null,null,null,null,null,null,40,null,null,null,null,"ŞEYHMUS KAPLAN (ÇRM)-ZEYNEP ELA ÇELİK (ÇRM)","AHMET YİĞİT GÜLENLER (GZT)-MEDİNE İREM TÜRKAN (BTM)"]
[17,5,0,"",5,"AKİF EMRE BUCAK (İST)",null,null,null,null,null,null,null,null,null,null,null,null,null,null,null,null,null,null,null,null,null,null,null,null,null,null,null,null,null,null,null,null,null,null,null,null,null,null,null,null,null,null,null,null,null,null,null,null,null,null,null,null,41,null,null,null,null,"-","AKİF EYMEN TURAN (İST)-EDA MORAL (İST)"]
[null,null,null,"",null,"AYBİGE FERİDE ÜSTÜNDAĞ (MĞL)",null,null,null,null,null,9,"",null,null,null,null,null,null,null,null,null,null,null,null,null,null,null,null,null,null,null,null,null,null,null,null,null,null,null,null,null,null,null,null,null,null,null,null,null,null,null,null,null,null,null,null,null,42,null,null,null,null,"BERK TURAN (YLV)-FİRDEVS NUR BİNGÖL (YLV)","DURSUN AYAZ NARMAN (KRK)-ZEYNEP KALKAN (HTY)"]
[null,null,null,null,null,null,null,0,0,null,null,null,"",null,null,null,null,null,null,null,null,null,null,null,null,null,null,null,null,null,null,null,null,null,null,null,null,null,null,null,null,null,null,null,null,null,null,null,null,null,null,null,null,null,null,null,null,null,43,null,null,null,null,"CAFER ASAF ÖZ (KRK)-ZEYNEP ELİF ÜNSAL (AMS)","KEREM KÖSE (İST)-BERRA BAHTİYAR (SKR)"]
[18,33,7,null,999,null,null,null,null,null,null,null,null,null,null,null,null,null,37,null,null,null,null,null,null,null,null,null,null,null,null,null,null,null,null,null,null,null,null,null,null,null,null,null,null,null,null,null,null,null,null,null,null,null,null,null,null,null,44,null,null,null,null,"ATA URAZ BAHADIR (MĞL)-İLKİM EYLÜL YEKREK (MĞL)","YİĞİT HÜSEYİN SUBAŞI (ÇRM)-ELİF DURU BECER (ÇRM)"]
[null,null,null,null,null,null,null,null,null,null,null,null,null,null,null,null,null,null,null,"",null,null,null,null,null,null,null,null,null,null,null,null,null,null,null,null,null,null,null,null,null,null,null,null,null,null,null,null,null,null,null,null,null,null,null,null,null,null,45,null,null,null,null,"-","YİĞİT BOLAT (ADN)-ATİYE ÖZER (ADN)"]
[19,33,23,"E10",44,"AHMET URAZ KİRAZ (MĞL)",null,null,null,null,null,null,null,null,0,0,null,null,null,"",null,null,null,null,null,null,null,null,null,null,null,null,null,null,null,null,null,null,null,null,null,null,null,null,null,null,null,null,null,null,null,null,null,null,null,null,null,null,46,null,null,null,null,"M. BİLAL ARTUKOĞLU (MRD)-ŞEVVAL ÖZDEMİR (İST)","AHMET ÇELİK (ÇRM)-HAFSA YURTERİ (İZM)"]
[null,null,null,"",null,0,null,null,null,null,null,10,"",null,null,null,null,null,null,null,null,null,null,null,null,null,null,null,null,null,null,null,null,null,null,null,null,null,null,null,null,null,null,null,null,null,null,null,null,null,null,null,null,null,null,null,null,null,47,null,null,null,null,"AHMET İLKER AY (KNY)-HAFSA TORBALI (KNY)","MUSTAFA KAYRA TURAN (KNY)-CEYDA DÖKMECİ (KNY)"]
[null,null,null,null,null,null,null,0,0,null,null,null,"",null,null,null,null,null,null,null,null,null,null,null,null,null,null,null,null,null,null,null,null,null,null,null,null,null,null,null,null,null,null,null,null,null,null,null,null,null,null,null,null,null,null,null,null,null,48,null,null,null,null,"EGE BOLAT (ADN)-CEREN BUDAK (ADN)","BERAT ÖZDEMİR (ÇRM)-BELİNAY DAVUŞ (KST)"]
[20,17,0,"",28,"METEHAN ŞAHİN (GZT)"]
[null,null,null,null,null,"ASMİN YAĞMAHAN (BTM)"]
[21,17,0,"",21,"ENSAR AYDIN (İST)"]
[null,null,null,"",null,"İPEK UĞUR (İST)",null,null,null,null,null,11,""]
[null,null,null,null,null,null,null,0,0,null,null,null,""]
[22,33,31,"E2",37,"EYMEN YERDELEN (SNP)",null,null,null,null,null,null,null,null,null,null,null,null,38]
[null,null,null,null,null,"DEFNE ANIK (SNP)",null,null,null,null,null,null,null,null,null,null,null,null,null,""]
[23,33,15,"E18",53,"AHMET ERDEM AYDIN (KNY)",null,null,null,null,null,null,null,null,0,0,null,null,null,""]
[null,null,null,"",null,"ZEYNEP ÖZÇELİK (İST)",null,null,null,null,null,12,""]
[null,null,null,null,null,null,null,0,0,null,null,null,""]
[24,9," ","",12,"MUHAMMED EMİN KABADAYI (BRS)"]
[null,null,null,null,null,"EMİNE AYDINAY (BRS)"]
[25,9,0,"",13,"MUSTAFA YILDIRIM (İST)"]
[null,null,null,"",null,"FEYZA KOÇER (KYS)",null,null,null,null,null,13,""]
[null,null,null,null,null,null,null,0,0,null,null,null,""]
[26,33,11,"E22",52,"AKİF ÇİĞİL (ADN)",null,null,null,null,null,null,null,null,null,null,null,null,39]
[null,null,null,null,null,"AYÇA SU DÖŞ (ADN)",null,null,null,null,null,null,null,null,null,null,null,null,null,""]
[27,33,27,"E6",36,"MEHMET TATAR (VAN       )",null,null,null,null,null,null,null,null,0,0,null,null,null,""]
[null,null,null,"",null,"NİHAN BERA KOÇER (NVŞ)",null,null,null,null,null,14,""]
[null,null,null,null,null,null,null,0,0,null,null,null,""]
[28,17,0,"",20,"ALİ BERKE GÜMÜŞ (KNY)"]
[null,null,null,null,null,"BURCU AL (KNY)"]
[29,17,0,"",29,"MUHAMMED BARIŞ KALKAN (GZT)"]
[null,null,null,"",null,"ZEYNEP POLAT (GZT)",null,null,null,null,null,15,""]
[null,null,null,null,null,null,null,0,0,null,null,null,""]
[30,33,19,"E14",45,"ŞEYHMUS KAPLAN (ÇRM)",null,null,null,null,null,null,null,null,null,null,null,null,40]
[null,null,null,null,null,"ZEYNEP ELA ÇELİK (ÇRM)",null,null,null,null,null,null,null,null,null,null,null,null,null,""]
[31,33,3,null,999,null,null,null,null,null,null,null,null,null,0,0,null,null,null,""]
[null,null,null,"",null,null,null,null,null,null,null,16,""]
[null,null,null,null,null,null,null,0,0,null,null,null,""]
[32,3," ","",4,"AHMET YİĞİT GÜLENLER (GZT)"]
[null,null,null,null,null,"MEDİNE İREM TÜRKAN (BTM)"]
[33,3,0,"",3,"AHMET BERK TÜKENMEZ (İST)"]
[null,null,null,"",null,"ZEYNEP DURAN (İST)",null,null,null,null,null,17,""]
[null,null,null,null,null,null,null,0,0,null,null,null,""]
[34,33,4,null,999,null,null,null,null,null,null,null,null,null,null,null,null,null,41]
[null,null,null,null,null,null,null,null,null,null,null,null,null,null,null,null,null,null,null,""]
[35,33,20,"E13",46,"MEHMET AKİF TORU (AMS)",null,null,null,null,null,null,null,null,0,0,null,null,null,""]
[null,null,null,"",null,"DENİZ BERRA BAYRAM (KYS)",null,null,null,null,null,18,""]
[null,null,null,null,null,null,null,0,0,null,null,null,""]
[36,17,0,"",30,"AKİF EYMEN TURAN (İST)"]
[null,null,null,null,null,"EDA MORAL (İST)"]
[37,17,0,"",19,"CANBERK SEVİNDİK (ÇRM)"]
[null,null,null,"",null,"ELİF NUR KOÇ (ÇRM)",null,null,null,null,null,19,""]
[null,null,null,null,null,null,null,0,0,null,null,null,""]
[38,33,28,"E5",35,"BERK TURAN (YLV)",null,null,null,null,null,null,null,null,null,null,null,null,42]
[null,null,null,null,null,"FİRDEVS NUR BİNGÖL (YLV)",null,null,null,null,null,null,null,null,null,null,null,null,null,""]
[39,33,12,"E21",51,"KUDRET GÜLMEZLER (DNZ)",null,null,null,null,null,null,null,null,0,0,null,null,null,""]
[null,null,null,"",null,"FERİDE MELİKE HAMAL (DNZ)",null,null,null,null,null,20,""]
[null,null,null,null,null,null,null,0,0,null,null,null,""]
[40,9," ","",14,"DURSUN AYAZ NARMAN (KRK)"]
[null,null,null,null,null,"ZEYNEP KALKAN (HTY)"]
[41,9,0,"",11,"CEMAL AYAZ KARTAL (YLV)"]
[null,null,null,"",null,"DURU BERİL TOK (YLV)",null,null,null,null,null,21,""]
[null,null,null,null,null,null,null,0,0,null,null,null,""]
[42,33,16,"E17",54,"CAFER ASAF ÖZ (KRK)",null,null,null,null,null,null,null,null,null,null,null,null,43]
[null,null,null,null,null,"ZEYNEP ELİF ÜNSAL (AMS)",null,null,null,null,null,null,null,null,null,null,null,null,null,""]
[43,33,0,"E1",38,"AHMET EMİR KALKAN (GZT)",null,null,null,null,null,null,null,null,0,0,null,null,null,""]
[null,null,null,"",null,"ECRİN ATASEVER (MRD)",null,null,null,null,null,22,""]
[null,null,null,null,null,null,null,0,0,null,null,null,""]
[44,17,0,"",22,"KEREM KÖSE (İST)"]
[null,null,null,null,null,"BERRA BAHTİYAR (SKR)"]
[45,17,0,"",27,"KERİM ESAT ODACI (KNY)"]
[null,null,null,"",null,"ELA TOPRAK TOKATLI (KNY)",null,null,null,null,null,23,""]
[null,null,null,null,null,null,null,0,0,null,null,null,""]
[46,33,24,"E9",43,"ATA URAZ BAHADIR (MĞL)",null,null,null,null,null,null,null,null,null,null,null,null,44]
[null,null,null,null,null,"İLKİM EYLÜL YEKREK (MĞL)",null,null,null,null,null,null,null,null,null,null,null,null,null,""]
[47,33,8,null,999,null,null,null,null,null,null,null,null,null,0,0,null,null,null,""]
[null,null,null,"",null,null,null,null,null,null,null,24,""]
[null,null,null,null,null,null,null,0,0,null,null,null,""]
[48,5," ","",6,"YİĞİT HÜSEYİN SUBAŞI (ÇRM)"]
[null,null,null,null,null,"ELİF DURU BECER (ÇRM)"]
[49,5,0,"",7,"TAYİP YUSUF (BTM)"]
[null,null,null,"",null,"ŞEVVAL ALAŞ (BTM)",null,null,null,null,null,25,""]
[null,null,null,null,null,null,null,0,0,null,null,null,""]
[50,33,6,null,999,null,null,null,null,null,null,null,null,null,null,null,null,null,45]
[null,null,null,null,null,null,null,null,null,null,null,null,null,null,null,null,null,null,null,""]
[51,33,22,"E11",55,"ÖMER MUSAB TOY (BTM)",null,null,null,null,null,null,null,null,0,0,null,null,null,""]
[null,null,null,"",null,"IRMAK BURAKMAK (DYB)",null,null,null,null,null,26,""]
[null,null,null,null,null,null,null,0,0,null,null,null,""]
[52,17,0,"",26,"YİĞİT BOLAT (ADN)"]
[null,null,null,null,null,"ATİYE ÖZER (ADN)"]
[53,17,0,"",23,"HÜSEYİN UTKU KIRBAÇ  (İST)"]
[null,null,null,"",null,"BUĞLEM SENA ÇALIŞKAN (SKR)",null,null,null,null,null,27,""]
[null,null,null,null,null,null,null,0,0,null,null,null,""]
[54,33,14,"E3",39,"M. BİLAL ARTUKOĞLU (MRD)",null,null,null,null,null,null,null,null,null,null,null,null,46]
[null,null,null,null,null,"ŞEVVAL ÖZDEMİR (İST)",null,null,null,null,null,null,null,null,null,null,null,null,null,""]
[55,33,8,"E19",42,"EMİR SARIDOĞAN (ADN)",null,null,null,null,null,null,null,null,0,0,null,null,null,""]
[null,null,null,"",null,"GİZEM ÇİĞİL (ADN)",null,null,null,null,null,28,""]
[null,null,null,null,null,null,null,0,0,null,null,null,""]
[56,9," ","",10,"AHMET ÇELİK (ÇRM)"]
[null,null,null,null,null,"HAFSA YURTERİ (İZM)"]
[57,9,0,"",15,"ALİ SAİD AKDOĞAN (ÇRM)"]
[null,null,null,"",null,"ESMA SULTAN SARI (SKR)",null,null,null,null,null,29,""]
[null,null,null,null,null,null,null,0,0,null,null,null,""]
[58,33,10,"E23",50,"AHMET İLKER AY (KNY)",null,null,null,null,null,null,null,null,null,null,null,null,47]
[null,null,null,null,null,"HAFSA TORBALI (KNY)",null,null,null,null,null,null,null,null,null,null,null,null,null,""]
[59,33,26,"E7",34,"KEREM GÜLLER (İST)",null,null,null,null,null,null,null,null,0,0,null,null,null,""]
[null,null,null,"",null,"ADA MORAL (İST)",null,null,null,null,null,30,""]
[null,null,null,null,null,null,null,0,0,null,null,null,""]
[60,17,0,"",18,"MUSTAFA KAYRA TURAN (KNY)"]
[null,null,null,null,null,"CEYDA DÖKMECİ (KNY)"]
[61,17,0,"",31,"AKİF EFE ASLANPAY (MĞL)"]
[null,null,null,"",null,"ZEYNEP ÇAM (MĞL)",null,null,null,null,null,31,""]
[null,null,null,null,null,null,null,0,0,null,null,null,""]
[62,33,18,"E15",47,"EGE BOLAT (ADN)",null,null,null,null,null,null,null,null,null,null,null,null,48]
[null,null,null,null,null,"CEREN BUDAK (ADN)",null,null,null,null,null,null,null,null,null,null,null,null,null,""]
[63,33,2,null,999,null,null,null,null,null,null,null,null,null,0,0,null,null,null,""]
[null,null,null,null,null,null,null,null,null,null,null,32,""]
[null,null,null,null,null,null,null,0,0,null,null,null,""]
[64,2," "," ",2,"BERAT ÖZDEMİR (ÇRM)"]
[null,null,null,null,null,"BELİNAY DAVUŞ (KST)"]
[]
[]
[]
[]
[]
[]
[]
[]
[]
[]
[]
[]
[]
[1,1,0,0,1,"ARAS AYDIN (İST)",null,null,null,null,null,null,null,null,null,null,null,null,null,null,null,null,null,null,null,null,null,null,null,null,null,null,null,null,null,null,null,null,null,null,null,null,null,null,null,null,null,null,null,null,null,null,null,null,null,null,null,null,1,"2025-04-11",null,null,null,"ARAS AYDIN (İST)-ARMİN AYDIN (İST)",{"$error":"#N/A"},3]
[null,null,null,null,null,"ARMİN AYDIN (İST)",null,null,null,null,null,1,"ARAS AYDIN (İST)",null,null,null,null,null,null,null,null,null,null,null,null,null,null,null,null,null,null,null,null,null,null,null,null,null,null,null,null,null,null,null,null,null,null,null,null,null,null,null,null,null,null,null,null,null,2,"2025-04-11",null,null,null,{"$error":"#N/A"},{"$error":"#N/A"}]
[null,null,null,null,null,null,null,3,0,null,null,null,"ARMİN AYDIN (İST)",null,null,null,null,null,null,null,null,null,null,null,null,null,null,null,null,null,null,null,null,null,null,null,null,null,null,null,null,null,null,null,null,null,null,null,null,null,null,null,null,null,null,null,null,null,3,"2025-04-11",null,null,null,"İSMAİL TARHAN (MRD)-HAVİN MUTLU (MRD)","EMİR SARIDOĞAN (ADN)-GİZEM ÇİĞİL (ADN)",3,0]
[2,65,1,"E64",999,{"$error":"#N/A"},null,null,null,null,null,null,null,null,null,null,null,null,65,null,null,null,null,null,null,null,null,null,null,null,null,null,null,null,null,null,null,null,null,null,null,null,null,null,null,null,null,null,null,null,null,null,null,null,null,null,null,null,4,"2025-04-11",null,null,null,"ATA URAZ BAHADIR (MĞL)-İLKİM EYLÜL YEKREK (MĞL)","FURKAN KONYALI (ÇRM)-BURCU ASEL TUNCER (ÇRM)",0,3]
[null,null,null,null,null,{"$error":"#N/A"},null,null,null,null,null,null,null,null,null,null,null,null,null,"ARAS AYDIN (İST)",null,null,null,null,null,null,null,null,null,null,null,null,null,null,null,null,null,null,null,null,null,null,null,null,null,null,null,null,null,null,null,null,null,null,null,null,null,null,5,"2025-04-11",null,null,null,"BEYAZIT BERK DEMİR (AMS)-ESMA KAMER SÜT (KYS)","AHMET URAZ KİRAZ (MĞL)-0",3,0]
[3,65,33,"E32",999,{"$error":"#N/A"},null,null,null,null,null,null,null,null,3,0,null,null,null,"ARMİN AYDIN (İST)",null,null,null,null,null,null,null,null,null,null,null,null,null,null,null,null,null,null,null,null,null,null,null,null,null,null,null,null,null,null,null,null,null,null,null,null,null,null,6,"2025-04-11",null,null,null,"ŞEYHMUS KAPLAN (ÇRM)-ZEYNEP ELA ÇELİK (ÇRM)","KAYA ARSLAN (İST)-IRMAK PİŞKİNOĞLU (KRL)",0,3]
[null,null,null,"",null,{"$error":"#N/A"},null,null,null,null,null,2,"",null,null,null,null,null,null,null,null,null,null,null,null,97,null,null,null,null,null,null,null,null,null,null,null,null,null,null,null,null,null,null,null,null,null,null,null,null,null,null,null,null,null,null,null,null,7,"2025-04-11",null,null,null,"MEHMET AKİF TORU (AMS)-DENİZ BERRA BAYRAM (KYS)","EGE BOLAT (ADN)-CEREN BUDAK (ADN)",3,0]
[null,null,null,null,null,null,null,0,0,null,null,null,"",null,null,null,null,null,null,null,null,null,null,null,null,null,null,null,null,null,null,null,null,null,null,null,null,null,null,null,null,null,null,null,null,null,null,null,null,null,null,null,null,null,null,null,null,null,8,"2025-04-11",null,null,null,"TAHA DERELİ (İST)-BERRA DEMİR (İST)","AHMET EFE YILMAZ (İST)-AYŞE NAR ALPTEKİN (İST)",0,3]
[4,33,0,"",999,{"$error":"#N/A"},null,null,null,null,null,null,null,null,null,null,null,null,null,null,null,null,null,null,null,null,null,null,null,null,null,null,null,null,null,null,null,null,null,null,null,null,null,null,null,null,null,null,null,null,null,null,null,null,null,null,null,null,9,"2025-04-11",null,null,null,"ALİ ENES SEREN (KNY)-ASİYE TUĞÇE KENAR (KNY)","EYMEN SAVCI (ADN)-BEREN BOZKURT (ADN)",3,0]
[null,null,null,null,null,{"$error":"#N/A"},null,null,null,null,null,null,null,null,null,null,null,null,null,null,null,null,null,null,null,null,"ARAS AYDIN (İST)",null,null,null,null,null,null,null,null,null,null,null,null,null,null,null,null,null,null,null,null,null,null,null,null,null,null,null,null,null,null,null,10,"2025-04-11",null,null,null,"AHMET İLKER AY (KNY)-HAFSA TORBALI (KNY)","KUDRET GÜLMEZLER (DNZ)-FERİDE MELİKE HAMAL (DNZ)",3,0]
[5,33,0,"",41,"İSMAİL TARHAN (MRD)",null,null,null,null,null,null,null,null,null,null,null,null,null,null,null,3,0,null,null,null,"ARMİN AYDIN (İST)",null,null,null,null,null,null,null,null,null,null,null,null,null,null,null,null,null,null,null,null,null,null,null,null,null,null,null,null,null,null,null,11,"2025-04-11",null,null,null,"MEHMET FATİH GEZER (İST)-CEMRE İPEK YÜTÜK (İST)",{"$error":"#N/A"},3,0]
[null,null,null,null,null,"HAVİN MUTLU (MRD)",null,null,null,null,null,3,"İSMAİL TARHAN (MRD)",null,null,null,null,null,null,null,null,null,null,null,null,null,null,null,null,null,null,null,null,null,null,null,null,null,null,null,null,null,null,null,null,null,null,null,null,null,null,null,null,null,null,null,null,null,12,"2025-04-11",null,null,null,"AHMET ERDEM AYDIN (KNY)-ZEYNEP ÖZÇELİK (İST)","TOLGAHAN PEKMEZ (AMS)-ZÜMRA KALKAN (AMS)",3,0]
[null,null,null,"",null,null,null,3,0,null,null,null,"HAVİN MUTLU (MRD)",null,null,null,null,null,null,null,null,null,null,null,null,null,null,null,null,null,null,null,null,null,null,null,null,null,null,null,null,null,null,null,null,null,null,null,null,null,null,null,null,null,null,null,null,null,13,"2025-04-11",null,null,null,"MUHAMMED BELLO (MRS)-NİSA ÜZÜMCÜ (BTM)","CAFER ASAF ÖZ (KRK)-ZEYNEP ELİF ÜNSAL (AMS)",3,0]
[6,65,49,"E16",42,"EMİR SARIDOĞAN (ADN)",null,null,null,null,null,null,null,null,null,null,null,null,66,null,null,null,null,null,null,null,null,null,null,null,null,null,null,null,null,null,null,null,null,null,null,null,null,null,null,null,null,null,null,null,null,null,null,null,null,null,null,null,14,"2025-04-11",null,null,null,"ÖMER MUSAB TOY (BTM)-IRMAK BURAKMAK (DYB)","ALİ UYGAR YILDIRICI (İST)-UMAY ŞAHİN (İST)",3,2]
[null,null,null,null,null,"GİZEM ÇİĞİL (ADN)",null,null,null,null,null,null,null,null,null,null,null,null,null,"FURKAN KONYALI (ÇRM)",null,null,null,null,null,null,null,null,null,null,null,null,null,null,null,null,null,null,null,null,null,null,null,null,null,null,null,null,null,null,null,null,null,null,null,null,null,null,15,"2025-04-11",null,null,null,{"$error":"#N/A"},{"$error":"#N/A"}]
[7,65,17,"E48",43,"ATA URAZ BAHADIR (MĞL)",null,null,null,null,null,null,null,null,0,3,null,null,null,"BURCU ASEL TUNCER (ÇRM)",null,null,null,null,null,null,null,null,null,null,null,null,null,null,null,null,null,null,null,null,null,null,null,null,null,null,null,null,null,null,null,null,null,null,null,null,null,null,16,"2025-04-11",null,null,null,{"$error":"#N/A"},"MUHAMMED EMRE KANTİK (ÇRM)-DERİN MÜLAZIM (ÇRM)",null,3]
[null,null,null,"",null,"İLKİM EYLÜL YEKREK (MĞL)",null,null,null,null,null,4,"FURKAN KONYALI (ÇRM)",null,null,null,null,null,null,null,null,null,null,null,null,null,null,null,null,null,null,null,null,null,null,null,null,null,null,null,null,null,null,null,null,null,null,null,null,null,null,null,null,null,null,null,null,null,17,"2025-04-11",null,null,null,"AKİF EMRE BUCAK (İST)-AYBİGE FERİDE ÜSTÜNDAĞ (MĞL)",{"$error":"#N/A"},3]
[null,null,null,null,null,null,null,0,3,null,null,null,"BURCU ASEL TUNCER (ÇRM)",null,null,null,null,null,null,null,null,null,null,null,null,null,null,null,null,null,null,null,null,null,null,null,null,null,null,null,null,null,null,null,null,null,null,null,null,null,null,null,null,null,null,null,null,null,18,"2025-04-11",null,null,null,{"$error":"#N/A"},{"$error":"#N/A"}]
[8,17,0,"",32,"FURKAN KONYALI (ÇRM)",null,null,null,null,null,null,null,null,null,null,null,null,null,null,null,null,null,null,null,null,null,null,null,null,null,null,null,null,null,null,null,null,null,null,null,null,null,null,null,null,null,null,null,null,null,null,null,null,null,null,null,null,19,"2025-04-11",null,null,null,"EYMEN SELİM YILMAZ (KNY)-EYLÜL ECE BECER (ÇRM)","CAN ÖZTÜRK (SNP)-MASAL ÇAYIR (SNP)",0,3]
[null,null,null,null,null,"BURCU ASEL TUNCER (ÇRM)",null,null,null,null,null,null,null,null,null,null,null,null,null,null,null,null,null,null,null,null,null,null,null,null,null,null,null,null,null,null,null,null,null,null,null,null,null,null,null,null,null,null,null,null,null,null,null,null,null,null,null,null,20,"2025-04-11",null,null,null,"HÜSEYİN EREN YILMAZ (ÇRM)-İPEK ÖZTÜRK (ÇRM)","METEHAN ŞAHİN (GZT)-ASMİN YAĞMAHAN (BTM)",3,1]
[9,17,0,"",17,"BEYAZIT BERK DEMİR (AMS)",null,null,null,null,null,null,null,null,null,null,null,null,null,null,null,null,null,null,null,null,null,null,null,null,null,null,null,null,null,null,null,null,null,null,null,null,null,null,null,null,null,null,null,null,null,null,null,null,null,null,null,null,21,"2025-04-11",null,null,null,"ENSAR AYDIN (İST)-İPEK UĞUR (İST)","TUNAY DENİZ SAKINÇ (ÇRM)-BEREN SU ZER (ÇRM)",3,0]
[null,null,null,"",null,"ESMA KAMER SÜT (KYS)",null,null,null,null,null,5,"BEYAZIT BERK DEMİR (AMS)",null,null,null,null,null,null,null,null,null,null,null,null,null,null,null,null,null,null,null,null,null,null,null,null,null,null,null,null,null,null,null,null,null,null,null,null,null,null,null,null,null,null,null,null,null,22,"2025-04-11",null,null,null,"AHMET AZİZ YETİM (ÇRM)-ÖZÜM ÖZEL (KKTC)","EYMEN YERDELEN (SNP)-DEFNE ANIK (SNP)",3,1]
[null,null,null,null,null,null,null,3,0,null,null,null,"ESMA KAMER SÜT (KYS)",null,null,null,null,null,null,null,null,null,null,null,null,null,null,null,null,null,null,null,null,null,null,null,null,null,null,null,null,null,null,null,null,null,null,null,null,null,null,null,null,null,null,null,null,null,23,"2025-04-11",null,null,null,"ÇINAR AYDINLIK (ADN)-ECE MASAL KAYA (ADN)","HAMZA ÖZBEK (KNY)-GÜLCE DEĞİŞLİ (KNY)",0,3]
[10,65,25,"E40",44,"AHMET URAZ KİRAZ (MĞL)",null,null,null,null,null,null,null,null,null,null,null,null,67,null,null,null,null,null,null,null,null,null,null,null,null,null,null,null,null,null,null,null,null,null,null,null,null,null,null,null,null,null,null,null,null,null,null,null,null,null,null,null,24,"2025-04-11",null,null,null,"GOKTUĞ BİÇER (ÇRM)-ÖYKÜ DENİZ ERKOÇ (ÇRM)","MUHAMMED EMİN KABADAYI (BRS)-EMİNE AYDINAY (BRS)",0,3]
[null,null,null,null,null,0,null,null,null,null,null,null,null,null,null,null,null,null,null,"KAYA ARSLAN (İST)",null,null,null,null,null,null,null,null,null,null,null,null,null,null,null,null,null,null,null,null,null,null,null,null,null,null,null,null,null,null,null,null,null,null,null,null,null,null,25,"2025-04-11",null,null,null,"MUSTAFA YILDIRIM (İST)-FEYZA KOÇER (KYS)","MUHAMMED EYMEN SOLAK (ÇRM)-LİVA ÇEVİK (KKTC)",3,0]
[11,65,57,"E8",45,"ŞEYHMUS KAPLAN (ÇRM)",null,null,null,null,null,null,null,null,0,3,null,null,null,"IRMAK PİŞKİNOĞLU (KRL)",null,null,null,null,null,null,null,null,null,null,null,null,null,null,null,null,null,null,null,null,null,null,null,null,null,null,null,null,null,null,null,null,null,null,null,null,null,null,26,"2025-04-11",null,null,null,"HASAN ÖZTEKİN (BTM)-HÜMEYRA ULUÇ (BTM)","KEREM URHAN (ÇRM)-EZGİ TÜŞEK (DYB)",3,0]
[null,null,null,"",null,"ZEYNEP ELA ÇELİK (ÇRM)",null,null,null,null,null,6,"KAYA ARSLAN (İST)",null,null,null,null,null,null,null,null,null,null,null,null,98,null,null,null,null,null,null,null,null,null,null,null,null,null,null,null,null,null,null,null,null,null,null,null,null,null,null,null,null,null,null,null,null,27,"2025-04-11",null,null,null,"MEHMET TATAR (VAN       )-NİHAN BERA KOÇER (NVŞ)","DEVRİM ÖZTEKİN (KRL)-TALİA VURAL (KRL)",3,0]
[null,null,null,null,null,null,null,0,3,null,null,null,"IRMAK PİŞKİNOĞLU (KRL)",null,null,null,null,null,null,null,null,null,null,null,null,null,null,null,null,null,null,null,null,null,null,null,null,null,null,null,null,null,null,null,null,null,null,null,null,null,null,null,null,null,null,null,null,null,28,"2025-04-11",null,null,null,"YUSUF İSLAM ÇİFTÇİ (HKR)-GÜLCE KARABIYIK (İZM)","ALİ BERKE GÜMÜŞ (KNY)-BURCU AL (KNY)",0,3]
[12,33,0,"",33,"KAYA ARSLAN (İST)",null,null,null,null,null,null,null,null,null,null,null,null,null,null,null,null,null,null,null,null,null,null,null,null,null,null,null,null,null,null,null,null,null,null,null,null,null,null,null,null,null,null,null,null,null,null,null,null,null,null,null,null,29,"2025-04-11",null,null,null,"MUHAMMED BARIŞ KALKAN (GZT)-ZEYNEP POLAT (GZT)","KAYA TEMİR (ÇRM)-ELİF SU ERKOÇAK (ÇRM)",3,0]
[null,null,null,null,null,"IRMAK PİŞKİNOĞLU (KRL)",null,null,null,null,null,null,null,null,null,null,null,null,null,null,null,null,null,null,null,null,"AHMET EFE YILMAZ (İST)",null,null,null,null,null,null,null,null,null,null,null,null,null,null,null,null,null,null,null,null,null,null,null,null,null,null,null,null,null,null,null,30,"2025-04-11",null,null,null,"YUNUS BURAK SULAK (KNY)-ELİF ASYA TAVAN (KNY)","ALİ KESKİN (YLV)-SEDEF YILDIRIM (YLV)",0,3]
[13,33,0,"",46,"MEHMET AKİF TORU (AMS)",null,null,null,null,null,null,null,null,null,null,null,null,null,null,null,0,3,null,null,null,"AYŞE NAR ALPTEKİN (İST)",null,null,null,null,null,null,null,null,null,null,null,null,null,null,null,null,null,null,null,null,null,null,null,null,null,null,null,null,null,null,null,31,"2025-04-11",null,null,null,{"$error":"#N/A"},{"$error":"#N/A"}]
[null,null,null,"",null,"DENİZ BERRA BAYRAM (KYS)",null,null,null,null,null,7,"MEHMET AKİF TORU (AMS)",null,null,null,null,null,null,null,null,null,null,null,null,null,null,null,null,null,null,null,null,null,null,null,null,null,null,null,null,null,null,null,null,null,null,null,null,null,null,null,null,null,null,null,null,null,32,"2025-04-11",null,null,null,{"$error":"#N/A"},"AHMET YİĞİT GÜLENLER (GZT)-MEDİNE İREM TÜRKAN (BTM)",null,3]
[null,null,null,null,null,null,null,3,0,null,null,null,"DENİZ BERRA BAYRAM (KYS)",null,null,null,null,null,null,null,null,null,null,null,null,null,null,null,null,null,null,null,null,null,null,null,null,null,null,null,null,null,null,null,null,null,null,null,null,null,null,null,null,null,null,null,null,null,33,"2025-04-11",null,null,null,"AHMET BERK TÜKENMEZ (İST)-ZEYNEP DURAN (İST)",{"$error":"#N/A"},3]
[14,65,41,"E24",47,"EGE BOLAT (ADN)",null,null,null,null,null,null,null,null,null,null,null,null,68,null,null,null,null,null,null,null,null,null,null,null,null,null,null,null,null,null,null,null,null,null,null,null,null,null,null,null,null,null,null,null,null,null,null,null,null,null,null,null,34,"2025-04-11",null,null,null,{"$error":"#N/A"},{"$error":"#N/A"}]
[null,null,null,null,null,"CEREN BUDAK (ADN)",null,null,null,null,null,null,null,null,null,null,null,null,null,"AHMET EFE YILMAZ (İST)",null,null,null,null,null,null,null,null,null,null,null,null,null,null,null,null,null,null,null,null,null,null,null,null,null,null,null,null,null,null,null,null,null,null,null,null,null,null,35,"2025-04-11",null,null,null,"MUHAMMED EMİN KARAKURT (KNY)-ADA GARİP (İST)","SARP ÇOLAK (TRB)-ZEHRA NİL DEMİRCAN (İST)",3,0]
[15,65,9,"E56",48,"TAHA DERELİ (İST)",null,null,null,null,null,null,null,null,0,3,null,null,null,"AYŞE NAR ALPTEKİN (İST)",null,null,null,null,null,null,null,null,null,null,null,null,null,null,null,null,null,null,null,null,null,null,null,null,null,null,null,null,null,null,null,null,null,null,null,null,null,null,36,"2025-04-11",null,null,null,"TOPRAK ÇALAKOĞLU (MĞL)-SİDELYA YILDIRIM (MUĞ)","AKİF EYMEN TURAN (İST)-EDA MORAL (İST)",0,3]
[null,null,null,"",null,"BERRA DEMİR (İST)",null,null,null,null,null,8,"AHMET EFE YILMAZ (İST)",null,null,null,null,null,null,null,null,null,null,null,null,null,null,null,null,null,null,null,null,null,null,null,null,null,null,null,null,null,null,null,null,null,null,null,null,null,null,null,null,null,null,null,null,null,37,"2025-04-11",null,null,null,"CANBERK SEVİNDİK (ÇRM)-ELİF NUR KOÇ (ÇRM)","ENSAR ERFİDAN (VAN       )-ELİF FATIMA DEMİRCİ (NVŞ)",2,3]
[null,null,null,null,null,null,null,0,3,null,null,null,"AYŞE NAR ALPTEKİN (İST)",null,null,null,null,null,null,null,null,null,null,null,null,null,null,null,null,null,null,null,null,null,null,null,null,null,null,null,null,null,null,null,null,null,null,null,null,null,null,null,null,null,null,null,null,null,38,"2025-04-11",null,null,null,"DEMİR SERT (YLV)-AZRA USTA (YLV)","BERK TURAN (YLV)-FİRDEVS NUR BİNGÖL (YLV)"]
[16,9,0,"",16,"AHMET EFE YILMAZ (İST)",null,null,null,null,null,null,null,null,null,null,null,null,null,null,null,null,null,null,null,null,null,null,null,null,null,null,null,null,null,null,null,null,null,null,null,null,null,null,null,null,null,null,null,null,null,null,null,null,null,null,null,null,39,"2025-04-11",null,null,null,"ALİ DUMAN (BTM)-MELİSA ALPAR (BTM)","ÖMER MALKUŞ (KRL)-ARNİSA ŞEKER (ÇRM)",3,0]
[null,null,null,null,null,"AYŞE NAR ALPTEKİN (İST)",null,null,null,null,null,null,null,null,null,null,null,null,null,null,null,null,null,null,null,null,null,null,null,null,null,null,null,null,null,null,null,null,null,null,null,null,null,null,null,null,null,null,null,null,null,null,null,null,null,null,null,null,40,"2025-04-11",null,null,null,"YUSUF EFE GÜL  (İST)-ELİS ŞAHAN (İST)","DURSUN AYAZ NARMAN (KRK)-ZEYNEP KALKAN (HTY)",0,3]
[17,9,0,"",9,"ALİ ENES SEREN (KNY)",null,null,null,null,null,null,null,null,null,null,null,null,null,null,null,null,null,null,null,null,null,null,null,null,null,null,null,null,null,null,null,null,null,null,null,null,null,null,null,null,null,null,null,null,null,null,null,null,null,null,null,null,41,"2025-04-11",null,null,null,"CEMAL AYAZ KARTAL (YLV)-DURU BERİL TOK (YLV)","MERT EMİR YİĞİT (SMS)-ESLEM BAYKUT (SMS)",3,0]
[null,null,null,"",null,"ASİYE TUĞÇE KENAR (KNY)",null,null,null,null,null,9,"ALİ ENES SEREN (KNY)",null,null,null,null,null,null,null,null,null,null,null,null,null,null,null,null,null,null,null,null,null,null,null,null,null,null,null,null,null,null,null,null,null,null,null,null,null,null,null,null,null,null,null,null,null,42,"2025-04-11",null,null,null,"TAHİR EFE ŞAHİN (KNY)-ASYA BOLAT (AMS)","MEHMET KARAVELİOĞLU (ÇRM)-ARMİN ŞEKER (ÇRM)",3,0]
[null,null,null,null,null,null,null,3,0,null,null,null,"ASİYE TUĞÇE KENAR (KNY)",null,null,null,null,null,null,null,null,null,null,null,null,null,null,null,null,null,null,null,null,null,null,null,null,null,null,null,null,null,null,null,null,null,null,null,null,null,null,null,null,null,null,null,null,null,43,"2025-04-11",null,null,null,"AHMET EMİR KALKAN (GZT)-ECRİN ATASEVER (MRD)","ALP TUĞRA DURUKAN (ORD)-ELİF ALAGÖZ (ORD)"]
[18,65,13,"E52",49,"EYMEN SAVCI (ADN)",null,null,null,null,null,null,null,null,null,null,null,null,69,null,null,null,null,null,null,null,null,null,null,null,null,null,null,null,null,null,null,null,null,null,null,null,null,null,null,null,null,null,null,null,null,null,null,null,null,null,null,null,44,"2025-04-11",null,null,null,"ARMANÇ RODİN ORAKÇI (HKR)-ZELAL ÖZER (HKR)","KEREM KÖSE (İST)-BERRA BAHTİYAR (SKR)",0,3]
[null,null,null,null,null,"BEREN BOZKURT (ADN)",null,null,null,null,null,null,null,null,null,null,null,null,null,"ALİ ENES SEREN (KNY)",null,null,null,null,null,null,null,null,null,null,null,null,null,null,null,null,null,null,null,null,null,null,null,null,null,null,null,null,null,null,null,null,null,null,null,null,null,null,45,"2025-04-11",null,null,null,"KERİM ESAT ODACI (KNY)-ELA TOPRAK TOKATLI (KNY)","MUHAMMED YASİR TORU (AMS)-ESLEM ÇAVŞAK (AMS)",3,1]
[19,65,45,"E20",50,"AHMET İLKER AY (KNY)",null,null,null,null,null,null,null,null,3,0,null,null,null,"ASİYE TUĞÇE KENAR (KNY)",null,null,null,null,null,null,null,null,null,null,null,null,null,null,null,null,null,null,null,null,null,null,null,null,null,null,null,null,null,null,null,null,null,null,null,null,null,null,46,"2025-04-11",null,null,null,"BARAN ERDEM (BTM)-YAĞMUR ALPAR (BTM)","OĞUZHAN ER (HKR)-0",3,0]
[null,null,null,"",null,"HAFSA TORBALI (KNY)",null,null,null,null,null,10,"AHMET İLKER AY (KNY)",null,null,null,null,null,null,null,null,null,null,null,null,99,null,null,null,null,null,null,null,null,null,null,null,null,null,null,null,null,null,null,null,null,null,null,null,null,null,null,null,null,null,null,null,null,47,"2025-04-11",null,null,null,{"$error":"#N/A"},{"$error":"#N/A"}]
[null,null,null,null,null,null,null,3,0,null,null,null,"HAFSA TORBALI (KNY)",null,null,null,null,null,null,null,null,null,null,null,null,null,null,null,null,null,null,null,null,null,null,null,null,null,null,null,null,null,null,null,null,null,null,null,null,null,null,null,null,null,null,null,null,null,48,"2025-04-11",null,null,null,{"$error":"#N/A"},"YİĞİT HÜSEYİN SUBAŞI (ÇRM)-ELİF DURU BECER (ÇRM)",null,3]
[20,33,0,"",51,"KUDRET GÜLMEZLER (DNZ)",null,null,null,null,null,null,null,null,null,null,null,null,null,null,null,null,null,null,null,null,null,null,null,null,null,null,null,null,null,null,null,null,null,null,null,null,null,null,null,null,null,null,null,null,null,null,null,null,null,null,null,null,49,"2025-04-11",null,null,null,"TAYİP YUSUF (BTM)-ŞEVVAL ALAŞ (BTM)",{"$error":"#N/A"},3]
[null,null,null,null,null,"FERİDE MELİKE HAMAL (DNZ)",null,null,null,null,null,null,null,null,null,null,null,null,null,null,null,null,null,null,null,null,"ALİ ENES SEREN (KNY)",null,null,null,null,null,null,null,null,null,null,null,null,null,null,null,null,null,null,null,null,null,null,null,null,null,null,null,null,null,null,null,50,"2025-04-11",null,null,null,{"$error":"#N/A"},{"$error":"#N/A"}]
[21,33,0,"",40,"MEHMET FATİH GEZER (İST)",null,null,null,null,null,null,null,null,null,null,null,null,null,null,null,3,0,null,null,null,"ASİYE TUĞÇE KENAR (KNY)",null,null,null,null,null,null,null,null,null,null,null,null,null,null,null,null,null,null,null,null,null,null,null,null,null,null,null,null,null,null,null,51,"2025-04-11",null,null,null,"BERAT DAĞTEKİN (GZT)-EDA ALAŞ (BTM)","YUSUF DURSUN KOCA (AMS)-SÜEDA SİVAS (AMS)",1,3]
[null,null,null,null,null,"CEMRE İPEK YÜTÜK (İST)",null,null,null,null,null,11,"MEHMET FATİH GEZER (İST)",null,null,null,null,null,null,null,null,null,null,null,null,null,null,null,null,null,null,null,null,null,null,null,null,null,null,null,null,null,null,null,null,null,null,null,null,null,null,null,null,null,null,null,null,null,52,"2025-04-11",null,null,null,"MUSTAFA YAĞIZ ÖZÇELİK (ÇRM)-ASLI ATEŞ (DYB)","YİĞİT BOLAT (ADN)-ATİYE ÖZER (ADN)",0,3]
[null,null,null,"",null,null,null,3,0,null,null,null,"CEMRE İPEK YÜTÜK (İST)",null,null,null,null,null,null,null,null,null,null,null,null,null,null,null,null,null,null,null,null,null,null,null,null,null,null,null,null,null,null,null,null,null,null,null,null,null,null,null,null,null,null,null,null,null,53,"2025-04-11",null,null,null,"HÜSEYİN UTKU KIRBAÇ  (İST)-BUĞLEM SENA ÇALIŞKAN (SKR)","EREN GÖKDEMİR (KRK)-ÖZÜM MİRAY ÖZ (KRK)",3,0]
[22,65,61,"E4",null,{"$error":"#N/A"},null,null,null,null,null,null,null,null,null,null,null,null,70,null,null,null,null,null,null,null,null,null,null,null,null,null,null,null,null,null,null,null,null,null,null,null,null,null,null,null,null,null,null,null,null,null,null,null,null,null,null,null,54,"2025-04-11",null,null,null,"ABDULLAH EYMEN KARMİL (ORD)-ELİF İKRA ÇAKIR (ORD)","M. BİLAL ARTUKOĞLU (MRD)-ŞEVVAL ÖZDEMİR (İST)",1,3]
[null,null,null,null,null,{"$error":"#N/A"},null,null,null,null,null,null,null,null,null,null,null,null,null,"MEHMET FATİH GEZER (İST)",null,null,null,null,null,null,null,null,null,null,null,null,null,null,null,null,null,null,null,null,null,null,null,null,null,null,null,null,null,null,null,null,null,null,null,null,null,null,55,"2025-04-11",null,null,null,"YİĞİT ALİ BALLAROĞLU (BYB)-ZEHRA ÖZBİLGİ (BYB)","MUHAMMED YUSUF ÖZTEKİN (BTM)-MERVE TUŞEK (DYB)",3,0]
[23,65,29,"E36",53,"AHMET ERDEM AYDIN (KNY)",null,null,null,null,null,null,null,null,3,0,null,null,null,"CEMRE İPEK YÜTÜK (İST)",null,null,null,null,null,null,null,null,null,null,null,null,null,null,null,null,null,null,null,null,null,null,null,null,null,null,null,null,null,null,null,null,null,null,null,null,null,null,56,"2025-04-11",null,null,null,"SEBAHATTİN SİRAÇ DURMUŞ (SMS)-BEREN NAZ ERGENÇ (SMS)","AHMET ÇELİK (ÇRM)-HAFSA YURTERİ (İZM)",3,0]
[null,null,null,"",null,"ZEYNEP ÖZÇELİK (İST)",null,null,null,null,null,12,"AHMET ERDEM AYDIN (KNY)",null,null,null,null,null,null,null,null,null,null,null,null,null,null,null,null,null,null,null,null,null,null,null,null,null,null,null,null,null,null,null,null,null,null,null,null,null,null,null,null,null,null,null,null,null,57,"2025-04-11",null,null,null,"ALİ SAİD AKDOĞAN (ÇRM)-ESMA SULTAN SARI (SKR)","AHMET TALHA ALSANCAK (KRK)-AYŞE YAREN KAŞKA (AMS)",3,0]
[null,null,null,null,null,null,null,3,0,null,null,null,"ZEYNEP ÖZÇELİK (İST)",null,null,null,null,null,null,null,null,null,null,null,null,null,null,null,null,null,null,null,null,null,null,null,null,null,null,null,null,null,null,null,null,null,null,null,null,null,null,null,null,null,null,null,null,null,58,"2025-04-11",null,null,null,"ZAHİD EMİR TEMEL (KNY)-DEFNE ZEYNEP KELES (AMS)","DEMİR YÖNÜ (İST)-ECE NAZ AÇIKGÖZ (KRL)",0,3]
[24,17,0,"",24,"TOLGAHAN PEKMEZ (AMS)",null,null,null,null,null,null,null,null,null,null,null,null,null,null,null,null,null,null,null,null,null,null,null,null,null,null,null,null,null,null,null,null,null,null,null,null,null,null,null,null,null,null,null,null,null,null,null,null,null,null,null,null,59,"2025-04-11",null,null,null,"KEREM GÜLLER (İST)-ADA MORAL (İST)","BERA AKİF KALKAN (AMS)-EBRAR TOZLU (AMS)",3,0]
[null,null,null,null,null,"ZÜMRA KALKAN (AMS)",null,null,null,null,null,null,null,null,null,null,null,null,null,null,null,null,null,null,null,null,null,null,null,null,null,null,null,null,null,null,null,null,null,null,null,null,null,null,null,null,null,null,null,null,null,null,null,null,null,null,null,null,60,"2025-04-11",null,null,null,"MUHAMMET SAİD OĞUZ (KNY)-ECRİN KAHRAMAN (KYS)","MUSTAFA KAYRA TURAN (KNY)-CEYDA DÖKMECİ (KNY)",3,1]
[25,17,0,"",25,"MUHAMMED BELLO (MRS)",null,null,null,null,null,null,null,null,null,null,null,null,null,null,null,null,null,null,null,null,null,null,null,null,null,null,null,null,null,null,null,null,null,null,null,null,null,null,null,null,null,null,null,null,null,null,null,null,null,null,null,null,61,"2025-04-11",null,null,null,"AKİF EFE ASLANPAY (MĞL)-ZEYNEP ÇAM (MĞL)","EYMEN YAZGAN (BRS)-ECRİN FİDAN (BRS)",1,3]
[null,null,null,"",null,"NİSA ÜZÜMCÜ (BTM)",null,null,null,null,null,13,"MUHAMMED BELLO (MRS)",null,null,null,null,null,null,null,null,null,null,null,null,null,null,null,null,null,null,null,null,null,null,null,null,null,null,null,null,null,null,null,null,null,null,null,null,null,null,null,null,null,null,null,null,null,62,"2025-04-11",null,null,null,"HALİM SANCAR (BYB)-ZEYNEP AKYÜZ (BYB)","MUHAMMED EMİR ÖZEN (AMS)-NİSA GÜN (AMS)",0,3]
[null,null,null,null,null,null,null,3,0,null,null,null,"NİSA ÜZÜMCÜ (BTM)",null,null,null,null,null,null,null,null,null,null,null,null,null,null,null,null,null,null,null,null,null,null,null,null,null,null,null,null,null,null,null,null,null,null,null,null,null,null,null,null,null,null,null,null,null,63,"2025-04-11",null,null,null,{"$error":"#N/A"},{"$error":"#N/A"}]
[26,65,21,"E44",54,"CAFER ASAF ÖZ (KRK)",null,null,null,null,null,null,null,null,null,null,null,null,71,null,null,null,null,null,null,null,null,null,null,null,null,null,null,null,null,null,null,null,null,null,null,null,null,null,null,null,null,null,null,null,null,null,null,null,null,null,null,null,64,"2025-04-11",null,null,null,{"$error":"#N/A"},"BERAT ÖZDEMİR (ÇRM)-BELİNAY DAVUŞ (KST)",null,3]
[null,null,null,null,null,"ZEYNEP ELİF ÜNSAL (AMS)",null,null,null,null,null,null,null,null,null,null,null,null,null,"MUHAMMED BELLO (MRS)",null,null,null,null,null,null,null,null,null,null,null,null,null,null,null,null,null,null,null,null,null,null,null,null,null,null,null,null,null,null,null,null,null,null,null,null,null,null,65,"2025-04-11",null,null,null,"ARAS AYDIN (İST)-ARMİN AYDIN (İST)","-",3]
[27,65,53,"E12",55,"ÖMER MUSAB TOY (BTM)",null,null,null,null,null,null,null,null,3,1,null,null,null,"NİSA ÜZÜMCÜ (BTM)",null,null,null,null,null,null,null,null,null,null,null,null,null,null,null,null,null,null,null,null,null,null,null,null,null,null,null,null,null,null,null,null,null,null,null,null,null,null,66,"2025-04-11",null,null,null,"İSMAİL TARHAN (MRD)-HAVİN MUTLU (MRD)","FURKAN KONYALI (ÇRM)-BURCU ASEL TUNCER (ÇRM)"]
[null,null,null,"",null,"IRMAK BURAKMAK (DYB)",null,null,null,null,null,14,"ÖMER MUSAB TOY (BTM)",null,null,null,null,null,null,null,null,null,null,null,null,100,null,null,null,null,null,null,null,null,null,null,null,null,null,null,null,null,null,null,null,null,null,null,null,null,null,null,null,null,null,null,null,null,67,"2025-04-11",null,null,null,"BEYAZIT BERK DEMİR (AMS)-ESMA KAMER SÜT (KYS)","KAYA ARSLAN (İST)-IRMAK PİŞKİNOĞLU (KRL)"]
[null,null,null,null,null,null,null,3,2,null,null,null,"IRMAK BURAKMAK (DYB)",null,null,null,null,null,null,null,null,null,null,null,null,null,null,null,null,null,null,null,null,null,null,null,null,null,null,null,null,null,null,null,null,null,null,null,null,null,null,null,null,null,null,null,null,null,68,"2025-04-11",null,null,null,"MEHMET AKİF TORU (AMS)-DENİZ BERRA BAYRAM (KYS)","AHMET EFE YILMAZ (İST)-AYŞE NAR ALPTEKİN (İST)"]
[28,33,0,"",56,"ALİ UYGAR YILDIRICI (İST)",null,null,null,null,null,null,null,null,null,null,null,null,null,null,null,null,null,null,null,null,null,null,null,null,null,null,null,null,null,null,null,null,null,null,null,null,null,null,null,null,null,null,null,null,null,null,null,null,null,null,null,null,69,"2025-04-11",null,null,null,"ALİ ENES SEREN (KNY)-ASİYE TUĞÇE KENAR (KNY)","AHMET İLKER AY (KNY)-HAFSA TORBALI (KNY)"]
[null,null,null,null,null,"UMAY ŞAHİN (İST)",null,null,null,null,null,null,null,null,null,null,null,null,null,null,null,null,null,null,null,null,"MUHAMMED EMRE KANTİK (ÇRM)",null,null,null,null,null,null,null,null,null,null,null,null,null,null,null,null,null,null,null,null,null,null,null,null,null,null,null,null,null,null,null,70,"2025-04-11",null,null,null,"MEHMET FATİH GEZER (İST)-MEHMET FATİH GEZER (İST)","AHMET ERDEM AYDIN (KNY)-ZEYNEP ÖZÇELİK (İST)"]
[29,33,0,"",999,{"$error":"#N/A"},null,null,null,null,null,null,null,null,null,null,null,null,null,null,null,1,3,null,null,null,"DERİN MÜLAZIM (ÇRM)",null,null,null,null,null,null,null,null,null,null,null,null,null,null,null,null,null,null,null,null,null,null,null,null,null,null,null,null,null,null,null,71,"2025-04-11",null,null,null,"MUHAMMED BELLO (MRS)-NİSA ÜZÜMCÜ (BTM)","ÖMER MUSAB TOY (BTM)-IRMAK BURAKMAK (DYB)"]
[null,null,null,"",null,{"$error":"#N/A"},null,null,null,null,null,15,"",null,null,null,null,null,null,null,null,null,null,null,null,null,null,null,null,null,null,null,null,null,null,null,null,null,null,null,null,null,null,null,null,null,null,null,null,null,null,null,null,null,null,null,null,null,72,"2025-04-11",null,null,null,"-","MUHAMMED EMRE KANTİK (ÇRM)-DERİN MÜLAZIM (ÇRM)"]
[null,null,null,null,null,null,null,0,0,null,null,null,"",null,null,null,null,null,null,null,null,null,null,null,null,null,null,null,null,null,null,null,null,null,null,null,null,null,null,null,null,null,null,null,null,null,null,null,null,null,null,null,null,null,null,null,null,null,73,"2025-04-11",null,null,null,"AKİF EMRE BUCAK (İST)-AYBİGE FERİDE ÜSTÜNDAĞ (MĞL)","-"]
[30,65,37,"E28",999,{"$error":"#N/A"},null,null,null,null,null,null,null,null,null,null,null,null,72,null,null,null,null,null,null,null,null,null,null,null,null,null,null,null,null,null,null,null,null,null,null,null,null,null,null,null,null,null,null,null,null,null,null,null,null,null,null,null,74,"2025-04-11",null,null,null,"CAN ÖZTÜRK (SNP)-MASAL ÇAYIR (SNP)","MEHMET FATİH GEZER (İST)-CEMRE İPEK YÜTÜK (İST)"]
[null,null,null,null,null,{"$error":"#N/A"},null,null,null,null,null,null,null,null,null,null,null,null,null,"MUHAMMED EMRE KANTİK (ÇRM)",null,null,null,null,null,null,null,null,null,null,null,null,null,null,null,null,null,null,null,null,null,null,null,null,null,null,null,null,null,null,null,null,null,null,null,null,null,null,75,"2025-04-11",null,null,null,"MEHMET FATİH GEZER (İST)-CEMRE İPEK YÜTÜK (İST)","HÜSEYİN EREN YILMAZ (ÇRM)-İPEK ÖZTÜRK (ÇRM)"]
[31,65,5,"E60",999,{"$error":"#N/A"},null,null,null,null,null,null,null,null,0,0,null,null,null,"DERİN MÜLAZIM (ÇRM)",null,null,null,null,null,null,null,null,null,null,null,null,null,null,null,null,null,null,null,null,null,null,null,null,null,null,null,null,null,null,null,null,null,null,null,null,null,null,76,"2025-04-11",null,null,null,"AHMET ERDEM AYDIN (KNY)-ZEYNEP ÖZÇELİK (İST)","MUHAMMED BELLO (MRS)-NİSA ÜZÜMCÜ (BTM)"]
[null,null,null,"",null,{"$error":"#N/A"},null,null,null,null,null,16,"MUHAMMED EMRE KANTİK (ÇRM)",null,null,null,null,null,null,null,null,null,null,null,null,null,null,null,null,null,null,null,null,null,null,null,null,null,null,null,null,null,null,null,null,null,null,null,null,null,null,null,null,null,null,null,null,null,77,"2025-04-11",null,null,null,"MUHAMMED BELLO (MRS)-NİSA ÜZÜMCÜ (BTM)","ÖMER MUSAB TOY (BTM)-IRMAK BURAKMAK (DYB)"]
[null,null,null,null,null,null,null,0,3,null,null,null,"DERİN MÜLAZIM (ÇRM)",null,null,null,null,null,null,null,null,null,null,null,null,null,null,null,null,null,null,null,null,null,null,null,null,null,null,null,null,null,null,null,null,null,null,null,null,null,null,null,null,null,null,null,null,null,78,"2025-04-11",null,null,null,"ÖMER MUSAB TOY (BTM)-IRMAK BURAKMAK (DYB)","-"]
[32,5,0,"",8,"MUHAMMED EMRE KANTİK (ÇRM)",null,null,null,null,null,null,null,null,null,null,null,null,null,null,null,null,null,null,null,null,null,null,null,null,null,null,null,null,null,null,null,null,null,null,null,null,null,null,null,null,null,null,null,null,null,null,null,null,null,null,null,null,79,"2025-04-11",null,null,null,"-","MUHAMMED EMRE KANTİK (ÇRM)-DERİN MÜLAZIM (ÇRM)"]
[null,null,null,null,null,"DERİN MÜLAZIM (ÇRM)",null,null,null,null,null,null,null,null,null,null,null,null,null,null,null,null,null,null,null,null,null,null,null,null,null,null,null,null,null,null,null,null,null,null,null,null,null,null,null,null,null,null,null,null,null,null,null,null,null,null,null,null,80,"2025-04-11",null,null,null,"MUHAMMED EMRE KANTİK (ÇRM)-DERİN MÜLAZIM (ÇRM)","AKİF EMRE BUCAK (İST)-AYBİGE FERİDE ÜSTÜNDAĞ (MĞL)"]
[33,5,0,"",5,"AKİF EMRE BUCAK (İST)",null,null,null,null,null,null,null,null,null,null,null,null,null,null,null,null,null,null,null,null,null,null,null,null,null,null,null,null,null,null,null,null,null,null,null,null,null,null,null,null,null,null,null,null,null,null,null,null,null,null,null,null,81,"2025-04-11",null,null,null,"AKİF EMRE BUCAK (İST)-AYBİGE FERİDE ÜSTÜNDAĞ (MĞL)","-"]
[null,null,null,"",null,"AYBİGE FERİDE ÜSTÜNDAĞ (MĞL)",null,null,null,null,null,17,"AKİF EMRE BUCAK (İST)",null,null,null,null,null,null,null,null,null,null,null,null,null,null,null,null,null,null,null,null,null,null,null,null,null,null,null,null,null,null,null,null,null,null,null,null,null,null,null,null,null,null,null,null,null,82,"2025-04-11",null,null,null,"-","CAN ÖZTÜRK (SNP)-MASAL ÇAYIR (SNP)"]
[null,null,null,null,null,null,null,3,0,null,null,null,"AYBİGE FERİDE ÜSTÜNDAĞ (MĞL)",null,null,null,null,null,null,null,null,null,null,null,null,null,null,null,null,null,null,null,null,null,null,null,null,null,null,null,null,null,null,null,null,null,null,null,null,null,null,null,null,null,null,null,null,null,83,"2025-04-11",null,null,null,"CAN ÖZTÜRK (SNP)-MASAL ÇAYIR (SNP)","HÜSEYİN EREN YILMAZ (ÇRM)-İPEK ÖZTÜRK (ÇRM)"]
[34,65,7,"E58",999,{"$error":"#N/A"},null,null,null,null,null,null,null,null,null,null,null,null,73,null,null,null,null,null,null,null,null,null,null,null,null,null,null,null,null,null,null,null,null,null,null,null,null,null,null,null,null,null,null,null,null,null,null,null,null,null,null,null,84,"2025-04-11",null,null,null,"HÜSEYİN EREN YILMAZ (ÇRM)-İPEK ÖZTÜRK (ÇRM)","ENSAR AYDIN (İST)-İPEK UĞUR (İST)"]
[null,null,null,null,null,{"$error":"#N/A"},null,null,null,null,null,null,null,null,null,null,null,null,null,"AKİF EMRE BUCAK (İST)",null,null,null,null,null,null,null,null,null,null,null,null,null,null,null,null,null,null,null,null,null,null,null,null,null,null,null,null,null,null,null,null,null,null,null,null,null,null,85,"2025-04-11",null,null,null,"ENSAR AYDIN (İST)-İPEK UĞUR (İST)","AHMET AZİZ YETİM (ÇRM)-ÖZÜM ÖZEL (KKTC)"]
[35,65,39,"E26",999,{"$error":"#N/A"},null,null,null,null,null,null,null,null,0,0,null,null,null,"AYBİGE FERİDE ÜSTÜNDAĞ (MĞL)",null,null,null,null,null,null,null,null,null,null,null,null,null,null,null,null,null,null,null,null,null,null,null,null,null,null,null,null,null,null,null,null,null,null,null,null,null,null,86,"2025-04-11",null,null,null,"AHMET AZİZ YETİM (ÇRM)-ÖZÜM ÖZEL (KKTC)","HAMZA ÖZBEK (KNY)-GÜLCE DEĞİŞLİ (KNY)"]
[null,null,null,"",null,{"$error":"#N/A"},null,null,null,null,null,18,"",null,null,null,null,null,null,null,null,null,null,null,null,101,null,null,null,null,null,null,null,null,null,null,null,null,null,null,null,null,null,null,null,null,null,null,null,null,null,null,null,null,null,null,null,null,87,"2025-04-11",null,null,null,"HAMZA ÖZBEK (KNY)-GÜLCE DEĞİŞLİ (KNY)","MUHAMMED EMİN KABADAYI (BRS)-EMİNE AYDINAY (BRS)"]
[null,null,null,null,null,null,null,0,0,null,null,null,"",null,null,null,null,null,null,null,null,null,null,null,null,null,null,null,null,null,null,null,null,null,null,null,null,null,null,null,null,null,null,null,null,null,null,null,null,null,null,null,null,null,null,null,null,null,88,"2025-04-11",null,null,null,"MUHAMMED EMİN KABADAYI (BRS)-EMİNE AYDINAY (BRS)","MUSTAFA YILDIRIM (İST)-FEYZA KOÇER (KYS)"]
[36,33,0,"",999,{"$error":"#N/A"},null,null,null,null,null,null,null,null,null,null,null,null,null,null,null,null,null,null,null,null,null,null,null,null,null,null,null,null,null,null,null,null,null,null,null,null,null,null,null,null,null,null,null,null,null,null,null,null,null,null,null,null,89,"2025-04-11",null,null,null,"MUSTAFA YILDIRIM (İST)-FEYZA KOÇER (KYS)","HASAN ÖZTEKİN (BTM)-HÜMEYRA ULUÇ (BTM)"]
[null,null,null,null,null,{"$error":"#N/A"},null,null,null,null,null,null,null,null,null,null,null,null,null,null,null,null,null,null,null,null,"AKİF EMRE BUCAK (İST)",null,null,null,null,null,null,null,null,null,null,null,null,null,null,null,null,null,null,null,null,null,null,null,null,null,null,null,null,null,null,null,90,"2025-04-11",null,null,null,"HASAN ÖZTEKİN (BTM)-HÜMEYRA ULUÇ (BTM)","MEHMET TATAR (VAN       )-NİHAN BERA KOÇER (NVŞ)"]
[37,33,0,"",57,"EYMEN SELİM YILMAZ (KNY)",null,null,null,null,null,null,null,null,null,null,null,null,null,null,null,3,0,null,null,null,"AYBİGE FERİDE ÜSTÜNDAĞ (MĞL)",null,null,null,null,null,null,null,null,null,null,null,null,null,null,null,null,null,null,null,null,null,null,null,null,null,null,null,null,null,null,null,91,"2025-04-11",null,null,null,"MEHMET TATAR (VAN       )-NİHAN BERA KOÇER (NVŞ)","ALİ BERKE GÜMÜŞ (KNY)-BURCU AL (KNY)"]
[null,null,null,"",null,"EYLÜL ECE BECER (ÇRM)",null,null,null,null,null,19,"CAN ÖZTÜRK (SNP)",null,null,null,null,null,null,null,null,null,null,null,null,null,null,null,null,null,null,null,null,null,null,null,null,null,null,null,null,null,null,null,null,null,null,null,null,null,null,null,null,null,null,null,null,null,92,"2025-04-11",null,null,null,"ALİ BERKE GÜMÜŞ (KNY)-BURCU AL (KNY)","MUHAMMED BARIŞ KALKAN (GZT)-ZEYNEP POLAT (GZT)"]
[null,null,null,null,null,null,null,0,3,null,null,null,"MASAL ÇAYIR (SNP)",null,null,null,null,null,null,null,null,null,null,null,null,null,null,null,null,null,null,null,null,null,null,null,null,null,null,null,null,null,null,null,null,null,null,null,null,null,null,null,null,null,null,null,null,null,93,"2025-04-11",null,null,null,"MUHAMMED BARIŞ KALKAN (GZT)-ZEYNEP POLAT (GZT)","ALİ KESKİN (YLV)-SEDEF YILDIRIM (YLV)"]
[38,65,55,"E10",58,"CAN ÖZTÜRK (SNP)",null,null,null,null,null,null,null,null,null,null,null,null,74,null,null,null,null,null,null,null,null,null,null,null,null,null,null,null,null,null,null,null,null,null,null,null,null,null,null,null,null,null,null,null,null,null,null,null,null,null,null,null,94,"2025-04-11",null,null,null,"ALİ KESKİN (YLV)-SEDEF YILDIRIM (YLV)","-"]
[null,null,null,null,null,"MASAL ÇAYIR (SNP)",null,null,null,null,null,null,null,null,null,null,null,null,null,"CAN ÖZTÜRK (SNP)",null,null,null,null,null,null,null,null,null,null,null,null,null,null,null,null,null,null,null,null,null,null,null,null,null,null,null,null,null,null,null,null,null,null,null,null,null,null,95,"2025-04-11",null,null,null,"-","AHMET YİĞİT GÜLENLER (GZT)-MEDİNE İREM TÜRKAN (BTM)"]
[39,65,23,"E42",59,"HÜSEYİN EREN YILMAZ (ÇRM)",null,null,null,null,null,null,null,null,3,1,null,null,null,"MASAL ÇAYIR (SNP)",null,null,null,null,null,null,null,null,null,null,null,null,null,null,null,null,null,null,null,null,null,null,null,null,null,null,null,null,null,null,null,null,null,null,null,null,null,null,96,"2025-04-11",null,null,null,"AHMET YİĞİT GÜLENLER (GZT)-MEDİNE İREM TÜRKAN (BTM)","AHMET BERK TÜKENMEZ (İST)-ZEYNEP DURAN (İST)"]
[null,null,null,"",null,"İPEK ÖZTÜRK (ÇRM)",null,null,null,null,null,20,"HÜSEYİN EREN YILMAZ (ÇRM)",null,null,null,null,null,null,null,null,null,null,null,null,null,null,null,null,null,null,null,null,null,null,null,null,null,null,null,null,null,null,null,null,null,null,null,null,null,null,null,null,null,null,null,null,null,97,null,null,null,null,"ARAS AYDIN (İST)-ARMİN AYDIN (İST)","FURKAN KONYALI (ÇRM)-BURCU ASEL TUNCER (ÇRM)"]
[null,null,null,null,null,null,null,3,1,null,null,null,"İPEK ÖZTÜRK (ÇRM)",null,null,null,null,null,null,null,null,null,null,null,null,null,null,null,null,null,null,null,null,null,null,null,null,null,null,null,null,null,null,null,null,null,null,null,null,null,null,null,null,null,null,null,null,null,98,null,null,null,null,"KAYA ARSLAN (İST)-IRMAK PİŞKİNOĞLU (KRL)","KAYA ARSLAN (İST)-IRMAK PİŞKİNOĞLU (KRL)"]
[40,17,0,"",28,"METEHAN ŞAHİN (GZT)",null,null,null,null,null,null,null,null,null,null,null,null,null,null,null,null,null,null,null,null,null,null,null,null,null,null,null,null,null,null,null,null,null,null,null,null,null,null,null,null,null,null,null,null,null,null,null,null,null,null,null,null,99,null,null,null,null,"ALİ ENES SEREN (KNY)-ASİYE TUĞÇE KENAR (KNY)","AHMET EFE YILMAZ (İST)-AYŞE NAR ALPTEKİN (İST)"]
[null,null,null,null,null,"ASMİN YAĞMAHAN (BTM)",null,null,null,null,null,null,null,null,null,null,null,null,null,null,null,null,null,null,null,null,null,null,null,null,null,null,null,null,null,null,null,null,null,null,null,null,null,null,null,null,null,null,null,null,null,null,null,null,null,null,null,null,100,null,null,null,null,"MUHAMMED BELLO (MRS)-NİSA ÜZÜMCÜ (BTM)","ALİ ENES SEREN (KNY)-ASİYE TUĞÇE KENAR (KNY)"]
[41,17,0,"",21,"ENSAR AYDIN (İST)",null,null,null,null,null,null,null,null,null,null,null,null,null,null,null,null,null,null,null,null,null,null,null,null,null,null,null,null,null,null,null,null,null,null,null,null,null,null,null,null,null,null,null,null,null,null,null,null,null,null,null,null,101,null,null,null,null,"AKİF EMRE BUCAK (İST)-AYBİGE FERİDE ÜSTÜNDAĞ (MĞL)","MEHMET FATİH GEZER (İST)-CEMRE İPEK YÜTÜK (İST)"]
[null,null,null,"",null,"İPEK UĞUR (İST)",null,null,null,null,null,21,"ENSAR AYDIN (İST)",null,null,null,null,null,null,null,null,null,null,null,null,null,null,null,null,null,null,null,null,null,null,null,null,null,null,null,null,null,null,null,null,null,null,null,null,null,null,null,null,null,null,null,null,null,102,null,null,null,null,"ENSAR AYDIN (İST)-İPEK UĞUR (İST)","MUHAMMED BELLO (MRS)-NİSA ÜZÜMCÜ (BTM)"]
[null,null,null,null,null,null,null,3,0,null,null,null,"İPEK UĞUR (İST)",null,null,null,null,null,null,null,null,null,null,null,null,null,null,null,null,null,null,null,null,null,null,null,null,null,null,null,null,null,null,null,null,null,null,null,null,null,null,null,null,null,null,null,null,null,103,null,null,null,null,"MUSTAFA YILDIRIM (İST)-FEYZA KOÇER (KYS)","MUHAMMED EMRE KANTİK (ÇRM)-DERİN MÜLAZIM (ÇRM)"]
[42,65,31,"E34",60,"TUNAY DENİZ SAKINÇ (ÇRM)",null,null,null,null,null,null,null,null,null,null,null,null,75,null,null,null,null,null,null,null,null,null,null,null,null,null,null,null,null,null,null,null,null,null,null,null,null,null,null,null,null,null,null,null,null,null,null,null,null,null,null,null,104,null,null,null,null,"ALİ KESKİN (YLV)-SEDEF YILDIRIM (YLV)","AKİF EMRE BUCAK (İST)-AYBİGE FERİDE ÜSTÜNDAĞ (MĞL)"]
[null,null,null,null,null,"BEREN SU ZER (ÇRM)",null,null,null,null,null,null,null,null,null,null,null,null,null,"ENSAR AYDIN (İST)",null,null,null,null,null,null,null,null,null,null,null,null,null,null,null,null,null,null,null,null,null,null,null,null,null,null,null,null,null,null,null,null,null,null,null,null,null,null,105,null,null,null,null,"AHMET BERK TÜKENMEZ (İST)-ZEYNEP DURAN (İST)","CAN ÖZTÜRK (SNP)-MASAL ÇAYIR (SNP)"]
[43,65,63,"E2",61,"AHMET AZİZ YETİM (ÇRM)",null,null,null,null,null,null,null,null,3,0,null,null,null,"İPEK UĞUR (İST)",null,null,null,null,null,null,null,null,null,null,null,null,null,null,null,null,null,null,null,null,null,null,null,null,null,null,null,null,null,null,null,null,null,null,null,null,null,null,106,null,null,null,null,"BERK TURAN (YLV)-FİRDEVS NUR BİNGÖL (YLV)","ENSAR AYDIN (İST)-İPEK UĞUR (İST)"]
[null,null,null,"",null,"ÖZÜM ÖZEL (KKTC)",null,null,null,null,null,22,"AHMET AZİZ YETİM (ÇRM)",null,null,null,null,null,null,null,null,null,null,null,null,102,null,null,null,null,null,null,null,null,null,null,null,null,null,null,null,null,null,null,null,null,null,null,null,null,null,null,null,null,null,null,null,null,107,null,null,null,null,"CEMAL AYAZ KARTAL (YLV)-DURU BERİL TOK (YLV)","MUHAMMED EMİN KABADAYI (BRS)-EMİNE AYDINAY (BRS)"]
[null,null,null,null,null,null,null,3,1,null,null,null,"ÖZÜM ÖZEL (KKTC)",null,null,null,null,null,null,null,null,null,null,null,null,null,null,null,null,null,null,null,null,null,null,null,null,null,null,null,null,null,null,null,null,null,null,null,null,null,null,null,null,null,null,null,null,null,108,null,null,null,null,"KERİM ESAT ODACI (KNY)-ELA TOPRAK TOKATLI (KNY)","MUSTAFA YILDIRIM (İST)-FEYZA KOÇER (KYS)"]
[44,33,0,"",37,"EYMEN YERDELEN (SNP)",null,null,null,null,null,null,null,null,null,null,null,null,null,null,null,null,null,null,null,null,null,null,null,null,null,null,null,null,null,null,null,null,null,null,null,null,null,null,null,null,null,null,null,null,null,null,null,null,null,null,null,null,109,null,null,null,null,"TAYİP YUSUF (BTM)-ŞEVVAL ALAŞ (BTM)","ALİ BERKE GÜMÜŞ (KNY)-BURCU AL (KNY)"]
[null,null,null,null,null,"DEFNE ANIK (SNP)",null,null,null,null,null,null,null,null,null,null,null,null,null,null,null,null,null,null,null,null,"MUHAMMED EMİN KABADAYI (BRS)",null,null,null,null,null,null,null,null,null,null,null,null,null,null,null,null,null,null,null,null,null,null,null,null,null,null,null,null,null,null,null,110,null,null,null,null,"HÜSEYİN UTKU KIRBAÇ  (İST)-BUĞLEM SENA ÇALIŞKAN (SKR)","ALİ KESKİN (YLV)-SEDEF YILDIRIM (YLV)"]
[45,33,0,"",62,"ÇINAR AYDINLIK (ADN)",null,null,null,null,null,null,null,null,null,null,null,null,null,null,null,0,3,null,null,null,"EMİNE AYDINAY (BRS)",null,null,null,null,null,null,null,null,null,null,null,null,null,null,null,null,null,null,null,null,null,null,null,null,null,null,null,null,null,null,null,111,null,null,null,null,"DEMİR YÖNÜ (İST)-ECE NAZ AÇIKGÖZ (KRL)","AHMET YİĞİT GÜLENLER (GZT)-MEDİNE İREM TÜRKAN (BTM)"]
[null,null,null,"",null,"ECE MASAL KAYA (ADN)",null,null,null,null,null,23,"HAMZA ÖZBEK (KNY)",null,null,null,null,null,null,null,null,null,null,null,null,null,null,null,null,null,null,null,null,null,null,null,null,null,null,null,null,null,null,null,null,null,null,null,null,null,null,null,null,null,null,null,null,null,112,null,null,null,null,"EYMEN YAZGAN (BRS)-ECRİN FİDAN (BRS)","AHMET BERK TÜKENMEZ (İST)-ZEYNEP DURAN (İST)"]
[null,null,null,null,null,null,null,0,3,null,null,null,"GÜLCE DEĞİŞLİ (KNY)"]
[46,65,47,"E18",63,"HAMZA ÖZBEK (KNY)",null,null,null,null,null,null,null,null,null,null,null,null,76]
[null,null,null,null,null,"GÜLCE DEĞİŞLİ (KNY)",null,null,null,null,null,null,null,null,null,null,null,null,null,"MUHAMMED EMİN KABADAYI (BRS)"]
[47,65,15,"E50",64,"GOKTUĞ BİÇER (ÇRM)",null,null,null,null,null,null,null,null,0,3,null,null,null,"EMİNE AYDINAY (BRS)"]
[null,null,null,"",null,"ÖYKÜ DENİZ ERKOÇ (ÇRM)",null,null,null,null,null,24,"MUHAMMED EMİN KABADAYI (BRS)"]
[null,null,null,null,null,null,null,0,3,null,null,null,"EMİNE AYDINAY (BRS)"]
[48,9,0,"",12,"MUHAMMED EMİN KABADAYI (BRS)"]
[null,null,null,null,null,"EMİNE AYDINAY (BRS)"]
[49,9,0,"",13,"MUSTAFA YILDIRIM (İST)"]
[null,null,null,"",null,"FEYZA KOÇER (KYS)",null,null,null,null,null,25,"MUSTAFA YILDIRIM (İST)"]
[null,null,null,null,null,null,null,3,0,null,null,null,"FEYZA KOÇER (KYS)"]
[50,65,11,"E54",65,"MUHAMMED EYMEN SOLAK (ÇRM)",null,null,null,null,null,null,null,null,null,null,null,null,77]
[null,null,null,null,null,"LİVA ÇEVİK (KKTC)",null,null,null,null,null,null,null,null,null,null,null,null,null,"MUSTAFA YILDIRIM (İST)"]
[51,65,43,"E22",66,"HASAN ÖZTEKİN (BTM)",null,null,null,null,null,null,null,null,3,0,null,null,null,"FEYZA KOÇER (KYS)"]
[null,null,null,"",null,"HÜMEYRA ULUÇ (BTM)",null,null,null,null,null,26,"HASAN ÖZTEKİN (BTM)",null,null,null,null,null,null,null,null,null,null,null,null,103]
[null,null,null,null,null,null,null,3,0,null,null,null,"HÜMEYRA ULUÇ (BTM)"]
[52,33,0,"",67,"KEREM URHAN (ÇRM)"]
[null,null,null,null,null,"EZGİ TÜŞEK (DYB)",null,null,null,null,null,null,null,null,null,null,null,null,null,null,null,null,null,null,null,null,"ALİ BERKE GÜMÜŞ (KNY)"]
[53,33,0,"",36,"MEHMET TATAR (VAN       )",null,null,null,null,null,null,null,null,null,null,null,null,null,null,null,2,3,null,null,null,"BURCU AL (KNY)"]
[null,null,null,"",null,"NİHAN BERA KOÇER (NVŞ)",null,null,null,null,null,27,"MEHMET TATAR (VAN       )"]
[null,null,null,null,null,null,null,3,0,null,null,null,"NİHAN BERA KOÇER (NVŞ)"]
[54,65,59,"E6",110,"DEVRİM ÖZTEKİN (KRL)",null,null,null,null,null,null,null,null,null,null,null,null,78]
[null,null,null,null,null,"TALİA VURAL (KRL)",null,null,null,null,null,null,null,null,null,null,null,null,null,"ALİ BERKE GÜMÜŞ (KNY)"]
[55,65,27,"E38",69,"YUSUF İSLAM ÇİFTÇİ (HKR)",null,null,null,null,null,null,null,null,0,1,3,null,null,"BURCU AL (KNY)"]
[null,null,null,"",null,"GÜLCE KARABIYIK (İZM)",null,null,null,null,null,28,"ALİ BERKE GÜMÜŞ (KNY)"]
[null,null,null,null,null,null,null,0,3,null,null,null,"BURCU AL (KNY)"]
[56,17,0,"",20,"ALİ BERKE GÜMÜŞ (KNY)"]
[null,null,null,null,null,"BURCU AL (KNY)"]
[57,17,0,"",29,"MUHAMMED BARIŞ KALKAN (GZT)"]
[null,null,null,"",null,"ZEYNEP POLAT (GZT)",null,null,null,null,null,29,"MUHAMMED BARIŞ KALKAN (GZT)"]
[null,null,null,null,null,null,null,3,0,null,null,null,"ZEYNEP POLAT (GZT)"]
[58,65,19,"E46",70,"KAYA TEMİR (ÇRM)",null,null,null,null,null,null,null,null,null,null,null,null,79]
[null,null,null,null,null,"ELİF SU ERKOÇAK (ÇRM)",null,null,null,null,null,null,null,null,null,null,null,null,null,"ALİ KESKİN (YLV)"]
[59,65,51,"E14",71,"YUNUS BURAK SULAK (KNY)",null,null,null,null,null,null,null,null,1,3,null,null,null,"SEDEF YILDIRIM (YLV)"]
[null,null,null,"",null,"ELİF ASYA TAVAN (KNY)",null,null,null,null,null,30,"ALİ KESKİN (YLV)",null,null,null,null,null,null,null,null,null,null,null,null,104]
[null,null,null,null,null,null,null,0,3,null,null,null,"SEDEF YILDIRIM (YLV)"]
[60,33,0,"",72,"ALİ KESKİN (YLV)"]
[null,null,null,null,null,"SEDEF YILDIRIM (YLV)",null,null,null,null,null,null,null,null,null,null,null,null,null,null,null,null,null,null,null,null,"AHMET YİĞİT GÜLENLER (GZT)"]
[61,33,0,"",999,{"$error":"#N/A"},null,null,null,null,null,null,null,null,null,null,null,null,null,null,null,0,3,null,null,null,"MEDİNE İREM TÜRKAN (BTM)"]
[null,null,null,"",null,{"$error":"#N/A"},null,null,null,null,null,31,""]
[null,null,null,null,null,null,null,0,0,null,null,null,""]
[62,65,35,"E30",999,{"$error":"#N/A"},null,null,null,null,null,null,null,null,null,null,null,null,80]
[null,null,null,null,null,{"$error":"#N/A"},null,null,null,null,null,null,null,null,null,null,null,null,null,"AHMET YİĞİT GÜLENLER (GZT)"]
[63,65,3,"E62",999,{"$error":"#N/A"},null,null,null,null,null,null,null,null,0,0,null,null,null,"MEDİNE İREM TÜRKAN (BTM)"]
[null,null,null,"",null,{"$error":"#N/A"},null,null,null,null,null,32,"AHMET YİĞİT GÜLENLER (GZT)"]
[null,null,null,null,null,null,null,0,3,null,null,null,"MEDİNE İREM TÜRKAN (BTM)"]
[64,3,0,"",4,"AHMET YİĞİT GÜLENLER (GZT)"]
[null,null,null,null,null,"MEDİNE İREM TÜRKAN (BTM)"]
[65,3,0,"",3,"AHMET BERK TÜKENMEZ (İST)"]
[null,null,null,"",null,"ZEYNEP DURAN (İST)",null,null,null,null,null,33,"AHMET BERK TÜKENMEZ (İST)"]
[null,null,null,null,null,null,null,3,0,null,null,null,"ZEYNEP DURAN (İST)"]
[66,65,4,"E61",999,{"$error":"#N/A"},null,null,null,null,null,null,null,null,null,null,null,null,81]
[null,null,null,null,null,{"$error":"#N/A"},null,null,null,null,null,null,null,null,null,null,null,null,null,"AHMET BERK TÜKENMEZ (İST)"]
[67,65,36,"E29",999,{"$error":"#N/A"},null,null,null,null,null,null,null,null,0,0,null,null,null,"ZEYNEP DURAN (İST)"]
[null,null,null,"",null,{"$error":"#N/A"},null,null,null,null,null,34,"",null,null,null,null,null,null,null,null,null,null,null,null,105]
[null,null,null,null,null,null,null,0,0,null,null,null,""]
[68,33,0,"",999,{"$error":"#N/A"}]
[null,null,null,null,null,{"$error":"#N/A"},null,null,null,null,null,null,null,null,null,null,null,null,null,null,null,null,null,null,null,null,"AHMET BERK TÜKENMEZ (İST)"]
[69,33,0,"",73,"MUHAMMED EMİN KARAKURT (KNY)",null,null,null,null,null,null,null,null,null,null,null,null,null,null,null,3,0,null,null,null,"ZEYNEP DURAN (İST)"]
[null,null,null,"",null,"ADA GARİP (İST)",null,null,null,null,null,35,"MUHAMMED EMİN KARAKURT (KNY)"]
[null,null,null,null,null,null,null,3,0,null,null,null,"ADA GARİP (İST)"]
[70,65,52,"E13",74,"SARP ÇOLAK (TRB)",null,null,null,null,null,null,null,null,null,null,null,null,82]
[null,null,null,null,null,"ZEHRA NİL DEMİRCAN (İST)",null,null,null,null,null,null,null,null,null,null,null,null,null,"AKİF EYMEN TURAN (İST)"]
[71,65,20,"E45",75,"TOPRAK ÇALAKOĞLU (MĞL)",null,null,null,null,null,null,null,null,0,3,null,null,null,"EDA MORAL (İST)"]
[null,null,null,"",null,"SİDELYA YILDIRIM (MUĞ)",null,null,null,null,null,36,"AKİF EYMEN TURAN (İST)"]
[null,null,null,null,null,null,null,0,3,null,null,null,"EDA MORAL (İST)"]
[72,17,0,"",30,"AKİF EYMEN TURAN (İST)"]
[null,null,null,null,null,"EDA MORAL (İST)"]
[73,17,0,"",19,"CANBERK SEVİNDİK (ÇRM)"]
[null,null,null,"",null,"ELİF NUR KOÇ (ÇRM)",null,null,null,null,null,37,"ENSAR ERFİDAN (VAN       )"]
[null,null,null,null,null,null,null,2,3,null,null,null,"ELİF FATIMA DEMİRCİ (NVŞ)"]
[74,65,28,"E37",76,"ENSAR ERFİDAN (VAN       )",null,null,null,null,null,null,null,null,null,null,null,null,83]
[null,null,null,null,null,"ELİF FATIMA DEMİRCİ (NVŞ)",null,null,null,null,null,null,null,null,null,null,null,null,null,"BERK TURAN (YLV)"]
[75,65,60,"E5",109,"DEMİR SERT (YLV)",null,null,null,null,null,null,null,null,0,3,null,null,null,"FİRDEVS NUR BİNGÖL (YLV)"]
[null,null,null,"",null,"AZRA USTA (YLV)",null,null,null,null,null,38,"BERK TURAN (YLV)",null,null,null,null,null,null,null,null,null,null,null,null,106]
[null,null,null,null,null,null,null,0,3,null,null,null,"FİRDEVS NUR BİNGÖL (YLV)"]
[76,33,0,"",35,"BERK TURAN (YLV)"]
[null,null,null,null,null,"FİRDEVS NUR BİNGÖL (YLV)",null,null,null,null,null,null,null,null,null,null,null,null,null,null,null,null,null,null,null,null,"DURSUN AYAZ NARMAN (KRK)"]
[77,33,0,"",78,"ALİ DUMAN (BTM)",null,null,null,null,null,null,null,null,null,null,null,null,null,null,null,2,3,null,null,null,"ZEYNEP KALKAN (HTY)"]
[null,null,null,"",null,"MELİSA ALPAR (BTM)",null,null,null,null,null,39,"ALİ DUMAN (BTM)"]
[null,null,null,null,null,null,null,3,0,null,null,null,"MELİSA ALPAR (BTM)"]
[78,65,44,"E21",79,"ÖMER MALKUŞ (KRL)",null,null,null,null,null,null,null,null,null,null,null,null,84]
[null,null,null,null,null,"ARNİSA ŞEKER (ÇRM)",null,null,null,null,null,null,null,null,null,null,null,null,null,"DURSUN AYAZ NARMAN (KRK)"]
[79,65,12,"E53",80,"YUSUF EFE GÜL  (İST)",null,null,null,null,null,null,null,null,0,3,null,null,null,"ZEYNEP KALKAN (HTY)"]
[null,null,null,"",null,"ELİS ŞAHAN (İST)",null,null,null,null,null,40,"DURSUN AYAZ NARMAN (KRK)"]
[null,null,null,null,null,null,null,0,3,null,null,null,"ZEYNEP KALKAN (HTY)"]
[80,9,0,"",14,"DURSUN AYAZ NARMAN (KRK)"]
[null,null,null,null,null,"ZEYNEP KALKAN (HTY)"]
[81,9,0,"",11,"CEMAL AYAZ KARTAL (YLV)"]
[null,null,null,"",null,"DURU BERİL TOK (YLV)",null,null,null,null,null,41,"CEMAL AYAZ KARTAL (YLV)"]
[null,null,null,null,null,null,null,3,0,null,null,null,"DURU BERİL TOK (YLV)"]
[82,65,16,"E49",81,"MERT EMİR YİĞİT (SMS)",null,null,null,null,null,null,null,null,null,null,null,null,85]
[null,null,null,null,null,"ESLEM BAYKUT (SMS)",null,null,null,null,null,null,null,null,null,null,null,null,null,"CEMAL AYAZ KARTAL (YLV)"]
[83,65,48,"E17",82,"TAHİR EFE ŞAHİN (KNY)",null,null,null,null,null,null,null,null,3,0,null,null,null,"DURU BERİL TOK (YLV)"]
[null,null,null,"",null,"ASYA BOLAT (AMS)",null,null,null,null,null,42,"TAHİR EFE ŞAHİN (KNY)",null,null,null,null,null,null,null,null,null,null,null,null,107]
[null,null,null,null,null,null,null,3,0,null,null,null,"ASYA BOLAT (AMS)"]
[84,33,0,"",83,"MEHMET KARAVELİOĞLU (ÇRM)"]
[null,null,null,null,null,"ARMİN ŞEKER (ÇRM)",null,null,null,null,null,null,null,null,null,null,null,null,null,null,null,null,null,null,null,null,"CEMAL AYAZ KARTAL (YLV)"]
[85,33,0,"",38,"AHMET EMİR KALKAN (GZT)",null,null,null,null,null,null,null,null,null,null,null,null,null,null,null,3,0,null,null,null,"DURU BERİL TOK (YLV)"]
[null,null,null,"",null,"ECRİN ATASEVER (MRD)",null,null,null,null,null,43,"AHMET EMİR KALKAN (GZT)"]
[null,null,null,null,null,null,null,3,0,null,null,null,"ECRİN ATASEVER (MRD)"]
[86,65,64,"E1",105,"ALP TUĞRA DURUKAN (ORD)",null,null,null,null,null,null,null,null,null,null,null,null,86]
[null,null,null,null,null,"ELİF ALAGÖZ (ORD)",null,null,null,null,null,null,null,null,null,null,null,null,null,"KEREM KÖSE (İST)"]
[87,65,32,"E33",85,"ARMANÇ RODİN ORAKÇI (HKR)",null,null,null,null,null,null,null,null,1,3,null,null,null,"BERRA BAHTİYAR (SKR)"]
[null,null,null,"",null,"ZELAL ÖZER (HKR)",null,null,null,null,null,44,"KEREM KÖSE (İST)"]
[null,null,null,null,null,null,null,0,3,null,null,null,"BERRA BAHTİYAR (SKR)"]
[88,17,0,"",22,"KEREM KÖSE (İST)"]
[null,null,null,null,null,"BERRA BAHTİYAR (SKR)"]
[89,17,0,"",27,"KERİM ESAT ODACI (KNY)"]
[null,null,null,"",null,"ELA TOPRAK TOKATLI (KNY)",null,null,null,null,null,45,"KERİM ESAT ODACI (KNY)"]
[null,null,null,null,null,null,null,3,1,null,null,null,"ELA TOPRAK TOKATLI (KNY)"]
[90,65,24,"E41",86,"MUHAMMED YASİR TORU (AMS)",null,null,null,null,null,null,null,null,null,null,null,null,87]
[null,null,null,null,null,"ESLEM ÇAVŞAK (AMS)",null,null,null,null,null,null,null,null,null,null,null,null,null,"KERİM ESAT ODACI (KNY)"]
[91,65,56,"E9",87,"BARAN ERDEM (BTM)",null,null,null,null,null,null,null,null,3,1,null,null,null,"ELA TOPRAK TOKATLI (KNY)"]
[null,null,null,"",null,"YAĞMUR ALPAR (BTM)",null,null,null,null,null,46,"BARAN ERDEM (BTM)",null,null,null,null,null,null,null,null,null,null,null,null,108]
[null,null,null,null,null,null,null,3,0,null,null,null,"YAĞMUR ALPAR (BTM)"]
[92,33,0,"",88,"OĞUZHAN ER (HKR)"]
[null,null,null,null,null,0,null,null,null,null,null,null,null,null,null,null,null,null,null,null,null,null,null,null,null,null,"YİĞİT HÜSEYİN SUBAŞI (ÇRM)"]
[93,33,0,"",999,{"$error":"#N/A"},null,null,null,null,null,null,null,null,null,null,null,null,null,null,null,0,3,null,null,null,"ELİF DURU BECER (ÇRM)"]
[null,null,null,"",null,{"$error":"#N/A"},null,null,null,null,null,47,""]
[null,null,null,null,null,null,null,0,0,null,null,null,""]
[94,65,40,"E25",999,{"$error":"#N/A"},null,null,null,null,null,null,null,null,null,null,null,null,88]
[null,null,null,null,null,{"$error":"#N/A"},null,null,null,null,null,null,null,null,null,null,null,null,null,"YİĞİT HÜSEYİN SUBAŞI (ÇRM)"]
[95,65,8,"E57",999,{"$error":"#N/A"},null,null,null,null,null,null,null,null,0,0,null,null,null,"ELİF DURU BECER (ÇRM)"]
[null,null,null,"",null,{"$error":"#N/A"},null,null,null,null,null,48,"YİĞİT HÜSEYİN SUBAŞI (ÇRM)"]
[null,null,null,null,null,null,null,0,3,null,null,null,"ELİF DURU BECER (ÇRM)"]
[96,5,0,"",6,"YİĞİT HÜSEYİN SUBAŞI (ÇRM)"]
[null,null,null,null,null,"ELİF DURU BECER (ÇRM)"]
[97,5,0,"",7,"TAYİP YUSUF (BTM)"]
[null,null,null,"",null,"ŞEVVAL ALAŞ (BTM)",null,null,null,null,null,49,"TAYİP YUSUF (BTM)"]
[null,null,null,null,null,null,null,3,0,null,null,null,"ŞEVVAL ALAŞ (BTM)"]
[98,65,6,"E59",999,{"$error":"#N/A"},null,null,null,null,null,null,null,null,null,null,null,null,89]
[null,null,null,null,null,{"$error":"#N/A"},null,null,null,null,null,null,null,null,null,null,null,null,null,"TAYİP YUSUF (BTM)"]
[99,65,38,"E27",999,{"$error":"#N/A"},null,null,null,null,null,null,null,null,0,0,null,null,null,"ŞEVVAL ALAŞ (BTM)"]
[null,null,null,"",null,{"$error":"#N/A"},null,null,null,null,null,50,"",null,null,null,null,null,null,null,null,null,null,null,null,109]
[null,null,null,null,null,null,null,0,0,null,null,null,""]
[100,33,0,"",999,{"$error":"#N/A"}]
[null,null,null,null,null,{"$error":"#N/A"},null,null,null,null,null,null,null,null,null,null,null,null,null,null,null,null,null,null,null,null,"TAYİP YUSUF (BTM)"]
[101,33,0,"",89,"BERAT DAĞTEKİN (GZT)",null,null,null,null,null,null,null,null,null,null,null,null,null,null,null,3,0,null,null,null,"ŞEVVAL ALAŞ (BTM)"]
[null,null,null,"",null,"EDA ALAŞ (BTM)",null,null,null,null,null,51,"YUSUF DURSUN KOCA (AMS)"]
[null,null,null,null,null,null,null,1,3,null,null,null,"SÜEDA SİVAS (AMS)"]
[102,65,54,"E11",90,"YUSUF DURSUN KOCA (AMS)",null,null,null,null,null,null,null,null,null,null,null,null,90]
[null,null,null,null,null,"SÜEDA SİVAS (AMS)",null,null,null,null,null,null,null,null,null,null,null,null,null,"YUSUF DURSUN KOCA (AMS)"]
[103,65,22,"E43",91,"MUSTAFA YAĞIZ ÖZÇELİK (ÇRM)",null,null,null,null,null,null,null,null,3,0,null,null,null,"SÜEDA SİVAS (AMS)"]
[null,null,null,"",null,"ASLI ATEŞ (DYB)",null,null,null,null,null,52,"YİĞİT BOLAT (ADN)"]
[null,null,null,null,null,null,null,0,3,null,null,null,"ATİYE ÖZER (ADN)"]
[104,17,0,"",26,"YİĞİT BOLAT (ADN)"]
[null,null,null,null,null,"ATİYE ÖZER (ADN)"]
[105,17,0,"",23,"HÜSEYİN UTKU KIRBAÇ  (İST)"]
[null,null,null,"",null,"BUĞLEM SENA ÇALIŞKAN (SKR)",null,null,null,null,null,53,"HÜSEYİN UTKU KIRBAÇ  (İST)"]
[null,null,null,null,null,null,null,3,0,null,null,null,"BUĞLEM SENA ÇALIŞKAN (SKR)"]
[106,65,30,"E35",92,"EREN GÖKDEMİR (KRK)",null,null,null,null,null,null,null,null,null,null,null,null,91]
[null,null,null,null,null,"ÖZÜM MİRAY ÖZ (KRK)",null,null,null,null,null,null,null,null,null,null,null,null,null,"HÜSEYİN UTKU KIRBAÇ  (İST)"]
[107,65,62,"E3",107,"ABDULLAH EYMEN KARMİL (ORD)",null,null,null,null,null,null,null,null,3,0,null,null,null,"BUĞLEM SENA ÇALIŞKAN (SKR)"]
[null,null,null,"",null,"ELİF İKRA ÇAKIR (ORD)",null,null,null,null,null,54,"M. BİLAL ARTUKOĞLU (MRD)",null,null,null,null,null,null,null,null,null,null,null,null,110]
[null,null,null,null,null,null,null,1,3,null,null,null,"ŞEVVAL ÖZDEMİR (İST)"]
[108,33,0,"",39,"M. BİLAL ARTUKOĞLU (MRD)"]
[null,null,null,null,null,"ŞEVVAL ÖZDEMİR (İST)",null,null,null,null,null,null,null,null,null,null,null,null,null,null,null,null,null,null,null,null,"AHMET ÇELİK (ÇRM)"]
[109,33,0,"",94,"YİĞİT ALİ BALLAROĞLU (BYB)",null,null,null,null,null,null,null,null,null,null,null,null,null,null,null,1,3,null,null,null,"HAFSA YURTERİ (İZM)"]
[null,null,null,"",null,"ZEHRA ÖZBİLGİ (BYB)",null,null,null,null,null,55,"MUHAMMED YUSUF ÖZTEKİN (BTM)"]
[null,null,null,null,null,null,null,0,3,null,null,null,"MERVE TUŞEK (DYB)"]
[110,65,46,"E19",95,"MUHAMMED YUSUF ÖZTEKİN (BTM)",null,null,null,null,null,null,null,null,null,null,null,null,92]
[null,null,null,null,null,"MERVE TUŞEK (DYB)",null,null,null,null,null,null,null,null,null,null,null,null,null,"AHMET ÇELİK (ÇRM)"]
[111,65,14,"E51",96,"SEBAHATTİN SİRAÇ DURMUŞ (SMS)",null,null,null,null,null,null,null,null,0,3,null,null,null,"HAFSA YURTERİ (İZM)"]
[null,null,null,"",null,"BEREN NAZ ERGENÇ (SMS)",null,null,null,null,null,56,"AHMET ÇELİK (ÇRM)"]
[null,null,null,null,null,null,null,0,3,null,null,null,"HAFSA YURTERİ (İZM)"]
[112,9,0,"",10,"AHMET ÇELİK (ÇRM)"]
[null,null,null,null,null,"HAFSA YURTERİ (İZM)"]
[113,9,0,"",15,"ALİ SAİD AKDOĞAN (ÇRM)"]
[null,null,null,"",null,"ESMA SULTAN SARI (SKR)",null,null,null,null,null,57,"ALİ SAİD AKDOĞAN (ÇRM)"]
[null,null,null,null,null,null,null,3,0,null,null,null,"ESMA SULTAN SARI (SKR)"]
[114,65,10,"E55",97,"AHMET TALHA ALSANCAK (KRK)",null,null,null,null,null,null,null,null,null,null,null,null,93]
[null,null,null,null,null,"AYŞE YAREN KAŞKA (AMS)",null,null,null,null,null,null,null,null,null,null,null,null,null,"DEMİR YÖNÜ (İST)"]
[115,65,42,"E23",98,"ZAHİD EMİR TEMEL (KNY)",null,null,null,null,null,null,null,null,2,3,null,null,null,"ECE NAZ AÇIKGÖZ (KRL)"]
[null,null,null,"",null,"DEFNE ZEYNEP KELES (AMS)",null,null,null,null,null,58,"DEMİR YÖNÜ (İST)",null,null,null,null,null,null,null,null,null,null,null,null,111]
[null,null,null,null,null,null,null,0,3,null,null,null,"ECE NAZ AÇIKGÖZ (KRL)"]
[116,33,0,"",99,"DEMİR YÖNÜ (İST)"]
[null,null,null,null,null,"ECE NAZ AÇIKGÖZ (KRL)",null,null,null,null,null,null,null,null,null,null,null,null,null,null,null,null,null,null,null,null,"DEMİR YÖNÜ (İST)"]
[117,33,0,"",34,"KEREM GÜLLER (İST)",null,null,null,null,null,null,null,null,null,null,null,null,null,null,null,3,2,null,null,null,"ECE NAZ AÇIKGÖZ (KRL)"]
[null,null,null,"",null,"ADA MORAL (İST)",null,null,null,null,null,59,"KEREM GÜLLER (İST)"]
[null,null,null,null,null,null,null,3,0,null,null,null,"ADA MORAL (İST)"]
[118,65,58,"E7",100,"BERA AKİF KALKAN (AMS)",null,null,null,null,null,null,null,null,null,null,null,null,94]
[null,null,null,null,null,"EBRAR TOZLU (AMS)",null,null,null,null,null,null,null,null,null,null,null,null,null,"MUHAMMET SAİD OĞUZ (KNY)"]
[119,65,26,"E39",101,"MUHAMMET SAİD OĞUZ (KNY)",null,null,null,null,null,null,null,null,0,3,null,null,null,"ECRİN KAHRAMAN (KYS)"]
[null,null,null,"",null,"ECRİN KAHRAMAN (KYS)",null,null,null,null,null,60,"MUHAMMET SAİD OĞUZ (KNY)"]
[null,null,null,null,null,null,null,3,1,null,null,null,"ECRİN KAHRAMAN (KYS)"]
[120,17,0,"",18,"MUSTAFA KAYRA TURAN (KNY)"]
[null,null,null,null,null,"CEYDA DÖKMECİ (KNY)"]
[121,17,0,"",31,"AKİF EFE ASLANPAY (MĞL)"]
[null,null,null,"",null,"ZEYNEP ÇAM (MĞL)",null,null,null,null,null,61,"EYMEN YAZGAN (BRS)"]
[null,null,null,null,null,null,null,1,3,null,null,null,"ECRİN FİDAN (BRS)"]
[122,65,18,"E47",102,"EYMEN YAZGAN (BRS)",null,null,null,null,null,null,null,null,null,null,null,null,95]
[null,null,null,null,null,"ECRİN FİDAN (BRS)",null,null,null,null,null,null,null,null,null,null,null,null,null,"EYMEN YAZGAN (BRS)"]
[123,65,50,"E15",103,"HALİM SANCAR (BYB)",null,null,null,null,null,null,null,null,3,0,null,null,null,"ECRİN FİDAN (BRS)"]
[null,null,null,"",null,"ZEYNEP AKYÜZ (BYB)",null,null,null,null,null,62,"MUHAMMED EMİR ÖZEN (AMS)",null,null,null,null,null,null,null,null,null,null,null,null,112]
[null,null,null,null,null,null,null,3,3,null,null,null,"NİSA GÜN (AMS)"]
[124,33,0,"",104,"MUHAMMED EMİR ÖZEN (AMS)"]
[null,null,null,null,null,"NİSA GÜN (AMS)",null,null,null,null,null,null,null,null,null,null,null,null,null,null,null,null,null,null,null,null,"BERAT ÖZDEMİR (ÇRM)"]
[125,33,0,"",999,{"$error":"#N/A"},null,null,null,null,null,null,null,null,null,null,null,null,null,null,null,1,3,null,null,null,"BELİNAY DAVUŞ (KST)"]
[null,null,null,"",null,{"$error":"#N/A"},null,null,null,null,null,63,""]
[null,null,null,null,null,null,null,0,0,null,null,null,""]
[126,65,34,"E31",999,{"$error":"#N/A"},null,null,null,null,null,null,null,null,null,null,null,null,96]
[null,null,null,null,null,{"$error":"#N/A"},null,null,null,null,null,null,null,null,null,null,null,null,null,"BERAT ÖZDEMİR (ÇRM)"]
[127,65,2,"E63",999,{"$error":"#N/A"},null,null,null,null,null,null,null,null,0,0,null,null,null,"BELİNAY DAVUŞ (KST)"]
[null,null,null,null,null,{"$error":"#N/A"},null,null,null,null,null,64,"BERAT ÖZDEMİR (ÇRM)"]
[null,null,null,null,null,null,null,0,3,null,null,null,"BELİNAY DAVUŞ (KST)"]
[128,2,0,0,2,"BERAT ÖZDEMİR (ÇRM)"]
[null,null,null,null,null,"BELİNAY DAVUŞ (KST)"]

{"sheet":"Ana Tablo","index":4,"n_rows":45,"n_cols":105,"rows_kept":45,"cut":false,"hidden":false,"merged":[[23,1,23,7],[23,29,23,35],[19,1,19,7],[19,15,19,21],[20,1,20,7],[20,15,20,21],[21,1,21,6],[21,8,21,14],[16,1,16,6],[16,8,16,14],[17,8,17,14],[18,1,18,7],[22,8,22,14],[29,15,29,21],[32,8,32,14],[33,1,33,7],[34,22,34,28],[43,1,43,7],[41,1,41,6],[39,1,39,7],[0,0,2,36],[37,29,37,35],[40,29,40,35],[25,1,25,7],[26,8,26,14],[24,1,24,7],[26,1,26,6],[3,0,4,36],[5,1,5,7],[6,1,6,6],[6,8,6,14],[7,8,7,14],[8,1,8,7],[9,1,9,7],[24,29,24,35],[30,15,30,21],[5,98,5,99],[5,88,5,89],[5,90,5,91],[5,92,5,93],[5,94,5,95],[5,96,5,97],[27,8,27,14],[31,8,31,14],[37,8,37,14],[41,8,41,14],[29,1,29,7],[31,1,31,6],[34,1,34,7],[36,1,36,6],[28,1,28,7],[30,1,30,7],[44,29,44,35],[39,15,39,21],[38,29,38,35],[35,1,35,7],[36,8,36,14],[38,1,38,7],[40,15,40,21],[35,22,35,28],[40,1,40,7],[44,1,44,7],[43,29,43,35],[42,8,42,14],[41,29,41,35],[9,15,9,21],[10,1,10,7],[10,15,10,21],[11,1,11,6],[11,8,11,14],[12,8,12,14],[13,1,13,7],[14,1,14,7],[14,22,14,28],[15,1,15,7],[15,22,15,28]]}
["TÜRKİYE MASA TENİSİ FEDERASYONU                                                                                                                                                                                                                                                                                   İsmail Eren ALICI Küçükler Ferdi-Takım Türkiye Şampiyonası",null,null,null,null,null,null,null,null,null,null,null,null,null,null,null,null,null,null,null,null,null,null,null,null,null,null,null,null,null,null,null,null,null,null,null,null,null,null,null,null,null,null,null,null,null,null,null,null,null,null,null,null,null,null,null,null,null,null,null,null,null,null,null,null,null,null,null,null,null,null,null,null,null,null,null,null,null,null,null,null,null,null,null,null,null,null,null,null,null,null,null,null,null,null,null,null,null,null,null,null,null,null,"1st Round",3]
[null,null,null,null,null,null,null,null,null,null,null,null,null,null,null,null,null,null,null,null,null,null,null,null,null,null,null,null,null,null,null,null,null,null,null,null,null,null,null,null,null,null,null,null,null,null,null,null,null,null,null,null,null,null,null,null,null,null,null,null,null,null,null,null,null,null,null,null,null,null,null,null,null,null,null,null,null,null,null,null,null,null,null,null,null,null,null,null,null,null,null,null,null,null,null,null,null,null,null,null,null,null,null,"2sn Round"]
[null,null,null,null,null,null,null,null,null,null,null,null,null,null,null,null,null,null,null,null,null,null,null,null,null,null,null,null,null,null,null,null,null,null,null,null,null,null,null,null,null,null,null,null,null,null,null,null,null,null,null,null,null,null,null,null,null,null,null,null,null,null,null,null,null,null,null,null,null,null,null,null,null,null,null,null,null,null,null,null,null,null,null,null,null,null,null,null,null,null,null,null,null,null,null,null,null,null,null,null,null,null,null,"3th Round"]
["KARMA [ 09-13 Nisan 2025 ÇORUM ] [ Ana Tablo ]",null,null,null,null,null,null,null,null,null,null,null,null,null,null,null,null,null,null,null,null,null,null,null,null,null,null,null,null,null,null,null,null,null,null,null,null,null,null,null,null,null,null,null,null,null,null,null,null,null,null,null,null,null,null,null,null,null,null,null,null,null,null,null,null,null,null,null,null,null,null,null,null,null,null,null,null,null,null,null,null,null,null,null,null,null,null,null,null,null,null,null,null,null,null,null,null,null,null,null,null,null,null,"4th Round"]
[]
[1,"ARAS AYDIN (İST)",null,null,null,null,null,null,null,null,null,null,null,null,null,null,null,null,null,null,null,null,null,null,null,null,null,null,null,"",null,null,null,null,null,null,null,null,null,null,null,null,null,null,null,null,null,null,null,null,null,null,null,null,null,null,null,null,null,null,null,null,null,null,null,null,null,null,null,null,null,null,null,null,null,null,null,null,null,null,null,"#",null,null,null,null,"Player A","Player B"]
[null,"ARMİN AYDIN (İST)",null,null,null,null,null,1,"ARAS AYDIN (İST)",null,null,null,null,null,null,null,null,null,null,null,null,null,null,null,null,null,null,null,null,null,null,null,null,null,null,null,null,null,null,null,null,null,null,null,null,null,null,null,null,null,null,null,null,null,null,null,null,null,null,null,null,null,null,null,null,null,null,null,null,null,null,null,null,null,null,null,null,null,null,null,null,1,"2025-04-11",null,null,null,"ARAS AYDIN (İST)-ARMİN AYDIN (İST)","AHMET EFE YILMAZ (İST)-AYŞE NAR ALPTEKİN (İST)",null,null,null,null,null,null,null,null,null,null,3,0]
[null,null,null,3,0,null,null,null,"ARMİN AYDIN (İST)",null,null,null,null,null,null,null,null,null,null,null,null,null,null,null,null,null,null,null,null,null,null,null,null,null,null,null,null,null,null,null,null,null,null,null,null,null,null,null,null,null,null,null,null,null,null,null,null,null,null,null,null,null,null,null,null,null,null,null,null,null,null,null,null,null,null,null,null,null,null,null,null,2,"2025-04-11",null,null,null,"ALİ ENES SEREN (KNY)-ASİYE TUĞÇE KENAR (KNY)","MUHAMMED EMRE KANTİK (ÇRM)-DERİN MÜLAZIM (ÇRM)",null,null,null,null,null,null,null,null,null,null,3,1]
[2,"AHMET EFE YILMAZ (İST)",null,null,null,null,null,null,null,null,null,null,null,null,9,null,null,null,null,null,null,null,null,null,null,null,null,null,null,null,null,null,null,null,null,null,null,null,null,null,null,null,null,null,null,null,null,null,null,null,null,null,null,null,null,null,null,null,null,null,null,null,null,null,null,null,null,null,null,null,null,null,null,null,null,null,null,null,null,null,null,3,"2025-04-11",null,null,null,"AKİF EMRE BUCAK (İST)-AYBİGE FERİDE ÜSTÜNDAĞ (MĞL)","MUHAMMED EMİN KABADAYI (BRS)-EMİNE AYDINAY (BRS)",null,null,null,null,null,null,null,null,null,null,3,0]
[null,"AYŞE NAR ALPTEKİN (İST)",null,null,null,null,null,null,null,null,3,0,null,null,null,"ARAS AYDIN (İST)",null,null,null,null,null,null,null,null,null,null,null,null,null,null,null,null,null,null,null,null,null,null,null,null,null,null,null,null,null,null,null,null,null,null,null,null,null,null,null,null,null,null,null,null,null,null,null,null,null,null,null,null,null,null,null,null,null,null,null,null,null,null,null,null,null,4,"2025-04-11",null,null,null,"ALİ BERKE GÜMÜŞ (KNY)-BURCU AL (KNY)","AHMET YİĞİT GÜLENLER (GZT)-MEDİNE İREM TÜRKAN (BTM)",null,null,null,null,null,null,null,null,null,null,1,3]
[3,"ALİ ENES SEREN (KNY)",null,null,null,null,null,null,null,null,null,null,null,null,null,"ARMİN AYDIN (İST)",null,null,null,null,null,null,null,null,null,null,null,null,null,null,null,null,null,null,null,null,null,null,null,null,null,null,null,null,null,null,null,null,null,null,null,null,null,null,null,null,null,null,null,null,null,null,null,null,null,null,null,null,null,null,null,null,null,null,null,null,null,null,null,null,null,5,"2025-04-11",null,null,null,"AHMET BERK TÜKENMEZ (İST)-ZEYNEP DURAN (İST)","DURSUN AYAZ NARMAN (KRK)-ZEYNEP KALKAN (HTY)",null,null,null,null,null,null,null,null,null,null,3,0]
[null,"ASİYE TUĞÇE KENAR (KNY)",null,null,null,null,null,2,"ALİ ENES SEREN (KNY)",null,null,null,null,null,null,null,null,null,null,null,null,13,null,null,null,null,null,null,null,null,null,null,null,null,null,null,null,null,null,null,null,null,null,null,null,null,null,null,null,null,null,null,null,null,null,null,null,null,null,null,null,null,null,null,null,null,null,null,null,null,null,null,null,null,null,null,null,null,null,null,null,6,"2025-04-11",null,null,null,"CEMAL AYAZ KARTAL (YLV)-DURU BERİL TOK (YLV)","YİĞİT HÜSEYİN SUBAŞI (ÇRM)-ELİF DURU BECER (ÇRM)",null,null,null,null,null,null,null,null,null,null,3,2]
[null,null,null,3,1,null,null,null,"ASİYE TUĞÇE KENAR (KNY)",null,null,null,null,null,null,null,null,null,null,null,null,null,null,null,null,null,null,null,null,null,null,null,null,null,null,null,null,null,null,null,null,null,null,null,null,null,null,null,null,null,null,null,null,null,null,null,null,null,null,null,null,null,null,null,null,null,null,null,null,null,null,null,null,null,null,null,null,null,null,null,null,7,"2025-04-11",null,null,null,"TAYİP YUSUF (BTM)-ŞEVVAL ALAŞ (BTM)","AHMET ÇELİK (ÇRM)-HAFSA YURTERİ (İZM)",null,null,null,null,null,null,null,null,null,null,1,3]
[4,"MUHAMMED EMRE KANTİK (ÇRM)",null,null,null,null,null,null,null,null,null,null,null,null,null,null,null,null,null,null,null,null,null,null,null,null,null,null,null,null,null,null,null,null,null,null,null,null,null,null,null,null,null,null,null,null,null,null,null,null,null,null,null,null,null,null,null,null,null,null,null,null,null,null,null,null,null,null,null,null,null,null,null,null,null,null,null,null,null,null,null,8,"2025-04-11",null,null,null,"DEMİR YÖNÜ (İST)-ECE NAZ AÇIKGÖZ (KRL)","BERAT ÖZDEMİR (ÇRM)-BELİNAY DAVUŞ (KST)",null,null,null,null,null,null,null,null,null,null,0,3]
[null,"DERİN MÜLAZIM (ÇRM)",null,null,null,null,null,null,null,null,null,null,null,null,null,null,null,null,null,null,null,null,"ARAS AYDIN (İST)",null,null,null,null,null,null,null,null,null,null,null,null,null,null,null,null,null,null,null,null,null,null,null,null,null,null,null,null,null,null,null,null,null,null,null,null,null,null,null,null,null,null,null,null,null,null,null,null,null,null,null,null,null,null,null,null,null,null,9,"2025-04-11",null,null,null,"ARAS AYDIN (İST)-ARMİN AYDIN (İST)","ALİ ENES SEREN (KNY)-ASİYE TUĞÇE KENAR (KNY)",null,null,null,null,null,null,null,null,null,null,3,0]
[5,"AKİF EMRE BUCAK (İST)",null,null,null,null,null,null,null,null,null,null,null,null,null,null,null,3,1,"Y1",null,null,"ARMİN AYDIN (İST)",null,null,null,null,null,null,null,null,null,null,null,null,null,null,null,null,null,null,null,null,null,null,null,null,null,null,null,null,null,null,null,null,null,null,null,null,null,null,null,null,null,null,null,null,null,null,null,null,null,null,null,null,null,null,null,null,null,null,10,"2025-04-11",null,null,null,"AKİF EMRE BUCAK (İST)-AYBİGE FERİDE ÜSTÜNDAĞ (MĞL)","AHMET YİĞİT GÜLENLER (GZT)-MEDİNE İREM TÜRKAN (BTM)",null,null,null,null,null,null,null,null,null,null,3,1]
[null,"AYBİGE FERİDE ÜSTÜNDAĞ (MĞL)",null,null,null,null,null,3,"AKİF EMRE BUCAK (İST)",null,null,null,null,null,null,null,null,null,null,null,null,null,null,null,null,null,null,null,15,null,null,null,null,null,null,null,null,null,null,null,null,null,null,null,null,null,null,null,null,null,null,null,null,null,null,null,null,null,null,null,null,null,null,null,null,null,null,null,null,null,null,null,null,null,null,null,null,null,null,null,null,11,"2025-04-11",null,null,null,"AHMET BERK TÜKENMEZ (İST)-ZEYNEP DURAN (İST)","CEMAL AYAZ KARTAL (YLV)-DURU BERİL TOK (YLV)",null,null,null,null,null,null,null,null,null,null,3,1]
[null,null,null,3,0,null,null,null,"AYBİGE FERİDE ÜSTÜNDAĞ (MĞL)",null,null,null,null,null,null,null,null,null,null,null,null,null,null,null,null,null,null,null,null,null,null,null,null,null,null,null,null,null,null,null,null,null,null,null,null,null,null,null,null,null,null,null,null,null,null,null,null,null,null,null,null,null,null,null,null,null,null,null,null,null,null,null,null,null,null,null,null,null,null,null,null,12,"2025-04-11",null,null,null,"AHMET ÇELİK (ÇRM)-HAFSA YURTERİ (İZM)","BERAT ÖZDEMİR (ÇRM)-BELİNAY DAVUŞ (KST)",null,null,null,null,null,null,null,null,null,null,1,3]
[6,"MUHAMMED EMİN KABADAYI (BRS)",null,null,null,null,null,null,null,null,null,null,null,null,10,null,null,null,null,null,null,null,null,null,null,null,null,null,null,null,null,null,null,null,null,null,null,null,null,null,null,null,null,null,null,null,null,null,null,null,null,null,null,null,null,null,null,null,null,null,null,null,null,null,null,null,null,null,null,null,null,null,null,null,null,null,null,null,null,null,null,13,"2025-04-11",null,null,null,"ARAS AYDIN (İST)-ARMİN AYDIN (İST)","AKİF EMRE BUCAK (İST)-AYBİGE FERİDE ÜSTÜNDAĞ (MĞL)",null,null,null,null,null,null,null,null,null,null,3,0]
[null,"EMİNE AYDINAY (BRS)",null,null,null,null,null,null,null,null,3,1,null,null,null,"AKİF EMRE BUCAK (İST)",null,null,null,null,null,null,null,null,null,null,null,null,null,null,null,null,null,null,null,null,null,null,null,null,null,null,null,null,null,null,null,null,null,null,null,null,null,null,null,null,null,null,null,null,null,null,null,null,null,null,null,null,null,null,null,null,null,null,null,null,null,null,null,null,null,14,"2025-04-11",null,null,null,"AHMET BERK TÜKENMEZ (İST)-ZEYNEP DURAN (İST)","AHMET ÇELİK (ÇRM)-HAFSA YURTERİ (İZM)",null,null,null,null,null,null,null,null,null,null,3,2]
[7,"ALİ BERKE GÜMÜŞ (KNY)",null,null,null,null,null,null,null,null,null,null,null,null,null,"AYBİGE FERİDE ÜSTÜNDAĞ (MĞL)",null,null,null,null,null,null,null,null,null,null,null,null,null,null,null,null,null,null,null,null,null,null,null,null,null,null,null,null,null,null,null,null,null,null,null,null,null,null,null,null,null,null,null,null,null,null,null,null,null,null,null,null,null,null,null,null,null,null,null,null,null,null,null,null,null,15,"2025-04-11",null,null,null,"ARAS AYDIN (İST)-ARMİN AYDIN (İST)","AHMET ÇELİK (ÇRM)-HAFSA YURTERİ (İZM)"]
[null,"BURCU AL (KNY)",null,null,null,null,null,4,"AHMET YİĞİT GÜLENLER (GZT)"]
[null,null,null,1,3,null,null,null,"MEDİNE İREM TÜRKAN (BTM)"]
[8,"AHMET YİĞİT GÜLENLER (GZT)",null,null,null,null,null,null,null,null,null,null,null,null,null,null,null,null,null,null,null,null,null,null,null,null,null,null,null,"ARAS AYDIN (İST)"]
[null,"MEDİNE İREM TÜRKAN (BTM)",null,null,null,null,null,null,null,null,null,null,null,null,null,null,null,null,null,null,null,null,null,null,null,null,null,null,null,"ARMİN AYDIN (İST)",null,null,null,null,null,null,"1."]
[9,"AHMET BERK TÜKENMEZ (İST)",null,null,null,null,null,null,null,null,null,null,null,null,null,null,null,null,null,null,null,null,null,null,null,3,2]
[null,"ZEYNEP DURAN (İST)",null,null,null,null,null,5,"AHMET BERK TÜKENMEZ (İST)"]
[null,null,null,3,0,null,null,null,"ZEYNEP DURAN (İST)"]
[10,"DURSUN AYAZ NARMAN (KRK)",null,null,null,null,null,null,null,null,null,null,null,null,11]
[null,"ZEYNEP KALKAN (HTY)",null,null,null,null,null,null,null,null,3,1,null,null,null,"AHMET BERK TÜKENMEZ (İST)"]
[11,"CEMAL AYAZ KARTAL (YLV)",null,null,null,null,null,null,null,null,null,null,null,null,null,"ZEYNEP DURAN (İST)"]
[null,"DURU BERİL TOK (YLV)",null,null,null,null,null,6,"CEMAL AYAZ KARTAL (YLV)",null,null,null,null,null,null,null,null,null,null,null,null,14]
[null,null,null,3,2,null,null,null,"DURU BERİL TOK (YLV)"]
[12,"YİĞİT HÜSEYİN SUBAŞI (ÇRM)"]
[null,"ELİF DURU BECER (ÇRM)",null,null,null,null,null,null,null,null,null,null,null,null,null,null,null,null,null,null,null,null,"AHMET BERK TÜKENMEZ (İST)"]
[13,"TAYİP YUSUF (BTM)",null,null,null,null,null,null,null,null,null,null,null,null,null,null,null,3,2,"Y2",null,null,"ZEYNEP DURAN (İST)"]
[null,"ŞEVVAL ALAŞ (BTM)",null,null,null,null,null,7,"AHMET ÇELİK (ÇRM)"]
[null,null,null,1,3,null,null,null,"HAFSA YURTERİ (İZM)",null,null,null,null,null,null,null,null,null,null,null,null,null,null,null,null,null,null,null,null,"AHMET BERK TÜKENMEZ (İST)"]
[14,"AHMET ÇELİK (ÇRM)",null,null,null,null,null,null,null,null,null,null,null,null,12,null,null,null,null,null,null,null,null,null,null,null,null,null,null,"ZEYNEP DURAN (İST)",null,null,null,null,null,null,"2."]
[null,"HAFSA YURTERİ (İZM)",null,null,null,null,null,null,null,null,1,3,null,null,null,"BERAT ÖZDEMİR (ÇRM)"]
[15,"DEMİR YÖNÜ (İST)",null,null,null,null,null,null,null,null,null,null,null,null,null,"BELİNAY DAVUŞ (KST)",null,null,null,null,null,null,null,null,null,null,null,null,null,"AKİF EMRE BUCAK (İST)"]
[null,"ECE NAZ AÇIKGÖZ (KRL)",null,null,null,null,null,8,"BERAT ÖZDEMİR (ÇRM)",null,null,null,null,null,null,null,null,null,null,null,null,null,null,null,null,null,null,null,null,"AYBİGE FERİDE ÜSTÜNDAĞ (MĞL)",null,null,null,null,null,null,"3."]
[null,null,null,0,3,null,null,null,"BELİNAY DAVUŞ (KST)"]
[16,"BERAT ÖZDEMİR (ÇRM)",null,null,null,null,null,null,null,null,null,null,null,null,null,null,null,null,null,null,null,null,null,null,null,null,null,null,null,"BERAT ÖZDEMİR (ÇRM)"]
[null,"BELİNAY DAVUŞ (KST)",null,null,null,null,null,null,null,null,null,null,null,null,null,null,null,null,null,null,null,null,null,null,null,null,null,null,null,"BELİNAY DAVUŞ (KST)",null,null,null,null,null,null,"3."]

{"sheet":"SIRALAMA","index":5,"n_rows":23,"n_cols":37,"rows_kept":23,"cut":false,"hidden":false,"merged":[[0,1,0,4],[1,1,1,4],[2,1,2,4]]}
[null,"TÜRKİYE MASA TENİSİ FEDERASYONU                                                                                                                                                                                                                                                                                   İsmail Eren ALICI Küçükler Ferdi-Takım Türkiye Şampiyonası"]
[null,"09-13 Nisan 2025 ÇORUM"]
[null,"KARMA SIRALAMA"]
[]
[null,null,"Derece",null,"Sporcu Adı-Soyadı",null,null,null,null,null,null,null,null,null,null,null,null,null,null,null,null,null,null,null,null,null,null,null,null,null,null,null,null,null,null,null,"2024-06-24"]
[null,null,null,null,null,null,null,null,null,null,null,null,null,null,null,null,null,null,null,null,null,null,null,null,null,null,null,null,null,null,null,null,null,null,null,null,"2024-06-24"]
[null,null,"1.",null,"ARAS AYDIN (İST) / ARMİN AYDIN (İST)",null,null,null,null,null,null,null,null,null,null,null,null,null,null,null,null,null,null,null,null,null,null,null,null,null,null,null,null,null,null,null,"2024-06-24"]
[null,null,"2.",null,"AHMET BERK TÜKENMEZ (İST) / ZEYNEP DURAN (İST)",null,null,null,null,null,null,null,null,null,null,null,null,null,null,null,null,null,null,null,null,null,null,null,null,null,null,null,null,null,null,null,"2024-06-24"]
[null,null,"3.",null,"AKİF EMRE BUCAK (İST) / AYBİGE FERİDE ÜSTÜNDAĞ (MĞL)",null,null,null,null,null,null,null,null,null,null,null,null,null,null,null,null,null,null,null,null,null,null,null,null,null,null,null,null,null,null,null,"2024-06-24"]
[null,null,"3.",null,"BERAT ÖZDEMİR (ÇRM) / BELİNAY DAVUŞ (KST)",null,null,null,null,null,null,null,null,null,null,null,null,null,null,null,null,null,null,null,null,null,null,null,null,null,null,null,null,null,null,null,"2024-06-24"]
[null,null,"5.",null,"ALİ ENES SEREN (KNY)-ASİYE TUĞÇE KENAR (KNY)",null,null,null,null,null,null,null,null,null,null,null,null,null,null,null,null,null,null,null,null,null,null,null,null,null,null,null,null,null,null,null,"2024-06-24"]
[null,null,"5.",null,"AHMET YİĞİT GÜLENLER (GZT)-MEDİNE İREM TÜRKAN (BTM)",null,null,null,null,null,null,null,null,null,null,null,null,null,null,null,null,null,null,null,null,null,null,null,null,null,null,null,null,null,null,null,"2024-06-24"]
[null,null,"5.",null,"CEMAL AYAZ KARTAL (YLV)-DURU BERİL TOK (YLV)",null,null,null,null,null,null,null,null,null,null,null,null,null,null,null,null,null,null,null,null,null,null,null,null,null,null,null,null,null,null,null,"2024-06-24"]
[null,null,"5.",null,"AHMET ÇELİK (ÇRM) / HAFSA YURTERİ (İZM)",null,null,null,null,null,null,null,null,null,null,null,null,null,null,null,null,null,null,null,null,null,null,null,null,null,null,null,null,null,null,null,"2024-06-24"]
[null,null,"9.",null,"AHMET EFE YILMAZ (İST)-AYŞE NAR ALPTEKİN (İST)",null,null,null,null,null,null,null,null,null,null,null,null,null,null,null,null,null,null,null,null,null,null,null,null,null,null,null,null,null,null,null,"2024-06-24"]
[null,null,"9.",null,"MUHAMMED EMRE KANTİK (ÇRM)-DERİN MÜLAZIM (ÇRM)",null,null,null,null,null,null,null,null,null,null,null,null,null,null,null,null,null,null,null,null,null,null,null,null,null,null,null,null,null,null,null,"2024-06-24"]
[null,null,"9.",null,"MUHAMMED EMİN KABADAYI (BRS)-EMİNE AYDINAY (BRS)",null,null,null,null,null,null,null,null,null,null,null,null,null,null,null,null,null,null,null,null,null,null,null,null,null,null,null,null,null,null,null,"2024-06-24"]
[null,null,"9.",null,"ALİ BERKE GÜMÜŞ (KNY)-BURCU AL (KNY)",null,null,null,null,null,null,null,null,null,null,null,null,null,null,null,null,null,null,null,null,null,null,null,null,null,null,null,null,null,null,null,"2024-06-24"]
[null,null,"9.",null,"DURSUN AYAZ NARMAN (KRK)-ZEYNEP KALKAN (HTY)",null,null,null,null,null,null,null,null,null,null,null,null,null,null,null,null,null,null,null,null,null,null,null,null,null,null,null,null,null,null,null,"2024-06-24"]
[null,null,"9.",null,"YİĞİT HÜSEYİN SUBAŞI (ÇRM)-ELİF DURU BECER (ÇRM)",null,null,null,null,null,null,null,null,null,null,null,null,null,null,null,null,null,null,null,null,null,null,null,null,null,null,null,null,null,null,null,"2024-06-24"]
[null,null,"9.",null,"TAYİP YUSUF (BTM)-ŞEVVAL ALAŞ (BTM)",null,null,null,null,null,null,null,null,null,null,null,null,null,null,null,null,null,null,null,null,null,null,null,null,null,null,null,null,null,null,null,"2024-06-24"]
[null,null,"9.",null,"DEMİR YÖNÜ (İST)-ECE NAZ AÇIKGÖZ (KRL)",null,null,null,null,null,null,null,null,null,null,null,null,null,null,null,null,null,null,null,null,null,null,null,null,null,null,null,null,null,null,null,"2024-06-24"]
[null,null,null,null,null,null,null,null,null,null,null,null,null,null,null,null,null,null,null,null,null,null,null,null,null,null,null,null,null,null,null,null,null,null,null,null,"2024-06-24"]