{"text_format":"1","workbook":"xlsx","n_sheets":11,"sheets":["Sablon","Kura","On_Eleme","Eleme","Ana_Tablo(128)","Ana_Tablo(128_16)","Ana_Tablo","Maclar","Mac_Foy","Match","Sıralama"],"not_rendered":{"charts":0,"images":10,"macros":1,"external_links":0,"defined_names":10,"comments":0,"pivot_tables":0},"unopened":[],"bounds":{"document_bytes":16777216,"sheet_cells":100000,"rows_first":2000,"rows_last":500,"rows_between":2000,"halvings":0,"cell_chars":16384,"cell_head_chars":4096},"cells_cut":0,"cells_raw":0,"read":"whole","date_system":"1900"}

{"sheet":"Sablon","index":0,"n_rows":193,"n_cols":97,"rows_kept":193,"cut":false,"hidden":false,"merged":[[0,1,0,28],[1,1,1,4],[1,7,1,10],[1,13,1,16],[1,19,1,22],[1,25,1,28]]}
[null,"FERDİ ŞABLON",null,null,null,null,null,null,null,null,null,null,null,null,null,null,null,null,null,null,null,null,null,null,null,null,null,null,null,null,null,null,null,null,null,null,null,null,null,null,null,null,null,null,null,null,null,null,null,null,null,"Y","S","B","Q",null,"Y","S","B","Q",null,"Y","S","B","Q",null,"Y","S","B","Q",null,"Y","S","B","Q",null,null,null,null,null,null,128,64,32,16,8,null,null,null,null,128,64,32,16,8,128,128]
[null,128,null,null,null,null,null,64,null,null,null,null,null,32,null,null,null,null,null,16,null,null,null,null,null,8,null,null,null,null,null,null,null,null,null,null,null,null,null,null,null,null,null,null,null,null,null,null,null,null,null,null,1,0,0,1,null,1,0," ",1,null,1,0,0,1,null,1,0,0,1,null,1,0,0,1,null,null,null,null,1,84,38,19,9,6,null,null,null,"E1",38,22,14,5,3,38,38]
[null,"Y","S","B","Q",null,null,"Y","S","B","Q",null,null,"Y",8,"B","Q",null,null,"Y","S","B","Q",null,null,"Y","S","B","Q",null,null,null,null,null,null,null,null,null,null,null,null,null,null,null,null,null,null,null,null,null,null,null,null,null,null,null,null,null,null,null,null,null,null,null,null,null,null,null,null,null,null,null,null,null,null,null,null,null,null,null,null,105,65,33,17,9,null,null,null,"E2",37,21,12,6,4,37,37]
[null,1,1,null,null,null,null,1,1,null," ",1,null,1,1,null,null,1,null,1,1,null,null,1,null,1,1,null,null,1,null,null,null,null,null,null,null,null,null,null,null,null,null,null,null,null,null,null,null,null,null,null,65,1,64,999,null,33,1,32,64,null,17,1,16,32,null,9,1,8,16,null,5,1,4,8,null,null,null,null,null,null,null,null,null,null,null,null,null,"E3",39,23,10,7,2,39,39]
[null,2,65,1,64,null,null,2,33,1,32,64,null,2,17,1,16,32,null,2,9,1,8,16,null,2,5,1,4,8,null,null,null,null,null,null,null,null,null,null,null,null,null,null,null,null,null,null,null,null,null,null,65,33,32,999,null,33,17,16,48,null,17,9,8,16,null,9,5,4,12,null,5,3,2,5,null,null,null,null,2,61,37,20,10,5,null,null,null,"E4",40,24,9,8,1,40,40]
[null,3,65,33,32,null,null,3,33,17,16,48,null,3,17,9,8,16,null,3,9,5,4,12,null,3,5,3,2,5,null,null,null,null,null,null,null,null,null,null,null,null,null,null,null,null,null,null,null,null,null,null,null,null,null,null,null,null,null,null,null,null,null,null,null,null,null,null,null,null,null,null,null,null,null,null,null,null,null,null,null,106,66,34,18,10,null,null,null,"E5",35,19,11,3,null,35,35]
[null,4,33,null,null,null,null,4,17,null," ",32,null,4,9,null,null,17,null,4,5,null,null,8,null,4,3,null,null,4,null,null,null,null,null,null,null,null,null,null,null,null,null,null,null,null,null,null,null,null,null,null,33,0,0,999,null,17,0," ",32,null,9,0,0,17,null,5,0,0,8,null,3,0,0,4,null,null,null,null,null,null,null,null,null,null,null,null,null,"E6",36,20,13,4,null,36,36]
[null,5,33,null,null,null,null,5,17,null," ",17,null,5,9,null,null,9,null,5,5,null,null,6,null,5,3,null,null,3,null,null,null,null,null,null,null,null,null,null,null,null,null,null,null,null,null,null,null,{"$f":"COUNTIF(BD:BD,999)","v":24},null,null,33,0,0,41,null,17,0," ",17,null,9,0,0,9,null,5,0,0,6,null,3,0,0,3,null,null,null,null,3,93,39,18,11,7,null,null,null,"E7",34,18,15,2,null,34,34]
[null,6,65,49,16,null,null,6,33,25,8,33,null,6,17,13,4,24,null,6,9,7,2,10,null,6,5,null,1,6,null,null,null,null,null,null,null,null,null,null,null,null,null,null,null,null,null,null,null,null,null,null,null,null,null,null,null,null,null,null,null,null,null,null,null,null,null,null,null,null,null,null,null,null,null,null,null,null,null,null,null,107,67,35,19,11,null,null,null,"E8",33,17,16,1,null,33,33]
[null,7,65,17,48,null,null,7,33,9,24,49,null,7,17,5,12,25,null,7,9,3,6,14,null,7,5,2,3,7,null,null,null,null,null,null,null,null,null,null,null,null,null,null,null,null,null,null,null,{"$f":"128-24","v":104},null,null,65,49,16,42,null,33,25,8,33,null,17,13,4,24,null,9,7,2,10,null,5,0,1,6,null,null,null,null,null,null,null,null,null,null,null,null,null,"E9",88,27,6,null,null,88,88]
[null,8,17,null,null,null,null,8,9," "," ",16,null,8,5,null,null,8,null,8,3,null,null,4,null,8,2,null,null,2,null,null,null,null,null,null,null,null,null,null,null,null,null,null,null,null,null,null,null,null,null,null,65,17,48,43,null,33,9,24,49,null,17,5,12,25,null,9,3,6,14,null,5,2,3,7,null,null,null,null,4,52,40,17,12,8,null,null,null,"E10",57,28,5,null,null,57,57]
[null,9,17,null,null,null,null,9,9,null," ",9,null,9,5,null,null,5,null,9,3,null,null,3,null,null,null,null,null,null,null,null,null,null,null,null,null,null,null,null,null,null,null,null,null,null,null,null,null,null,null,null,null,null,null,null,null,null,null,null,null,null,null,null,null,null,null,null,null,null,null,null,null,null,null,null,null,null,null,null,null,108,68,36,20,12,null,null,null,"E11",89,26,7,null,null,89,89]
[null,10,65,25,40,null,null,10,33,13,20,56,null,10,17,7,10,28,null,10,9,4,5,13,null,null,null,null,null,null,null,null,null,null,null,null,null,null,null,null,null,null,null,null,null,null,null,null,null,null,null,null,17,0,0,32,null,9," "," ",16,null,5,0,0,8,null,3,0,0,4,null,2,0,0,2,null,null,null,null,null,null,null,null,null,null,null,null,null,"E12",56,25,8,null,null,56,56]
[null,11,65,57,8,null,null,11,33,29,4,40,null,11,17,15,2,20,null,11,9,null,1,9,null,null,null,null,null,null,null,null,null,null,null,null,null,null,null,null,null,null,null,null,null,null,null,null,null,null,null,null,17,0,0,17,null,9,0," ",9,null,5,0,0,5,null,3,0,0,3,null,null,null,null,null,null,null,null,null,5,77,35,22,13,null,null,null,null,"E13",73,30,3,null,null,73,73]
[null,12,33,null,null,null,null,12,17,null," ",24,null,12,9,null,null,12,null,12,5,null,null,5,null,"Y","Fikstür yerleri",null,null,null,null,null,null,null,null,null,null,null,null,null,null,null,null,null,null,null,null,null,null,null,null,null,null,null,null,null,null,null,null,null,null,null,null,null,null,null,null,null,null,null,null,null,null,null,null,null,null,null,null,null,null,109,69,37,21,null,null,null,null,"E14",72,29,4,null,null,72,72]
[null,13,33,null,null,null,null,13,17,null," ",25,null,13,9,null,null,13,null,13,5,null,null,7,null,"S","Derece yerleri",null,null,null,null,null,null,null,null,null,null,null,null,null,null,null,null,null,null,null,null,null,null,null,null,null,65,25,40,44,null,33,13,20,56,null,17,7,10,28,null,9,4,5,13,null,null,null,null,null,null,null,null,null,null,null,null,null,null,null,null,null,null,"E15",104,31,2,null,null,104,104]
[null,14,65,41,24,null,null,14,33,21,12,41,null,14,17,11,6,21,null,14,9,6,3,11,null,"B","Bay yerleri",null,null,null,null,null,null,null,null,null,null,null,null,null,null,null,null,null,null,null,null,null,null,null,null,null,65,57,8,45,null,33,29,4,40,null,17,15,2,20,null,9,0,1,9,null,null,null,null,null,null,null,null,null,6,68,36,21,14,null,null,null,null,"E16",41,32,1,null,null,41,41]
[null,15,65,9,56,null,null,15,33,5,28,57,null,15,17,3,14,29,null,15,9,2,7,15,null,"Q","Ön Eleme yeri",null,null,null,null,null,null,null,null,null,null,null,null,null,null,null,null,null,null,null,null,null,null,null,null,null,null,null,null,null,null,null,null,null,null,null,null,null,null,null,null,null,null,null,null,null,null,null,null,null,null,null,null,null,null,110,70,38,22,null,null,null,null,"E17",83,11,null,null,null,83,83]
[null,16,9,null,null,null,null,16,5," "," ",8,null,16,3,null,null,4,null,16,2,null,null,2,null,null,null,null,null,null,null,null,null,null,null,null,null,null,null,null,null,null,null,null,null,null,null,null,null,null,null,null,33,0,0,33,null,17,0," ",24,null,9,0,0,12,null,5,0,0,5,null,null,null,null,null,null,null,null,null,null,null,null,null,null,null,null,null,null,"E18",62,12,null,null,null,62,62]
[null,17,9,null,null,null,null,17,5,null," ",5,null,17,3,null,null,3,null,null,null,null,null,null,null,null,null,null,null,null,null,null,null,null,null,null,null,null,null,null,null,null,null,null,null,null,null,null,null,null,null,null,33,0,0,46,null,17,0," ",25,null,9,0,0,13,null,5,0,0,7,null,null,null,null,null,null,null,null,null,7,100,34,23,15,null,null,null,null,"E19",94,10,null,null,null,94,94]
[null,18,65,13,52,null,null,18,33,7,26,60,null,18,17,4,13,30,null,null,null,null,null,null,null,null,null,null,null,null,null,null,null,null,null,null,null,null,null,null,null,null,null,null,null,null,null,null,null,null,null,null,null,null,null,null,null,null,null,null,null,null,null,null,null,null,null,null,null,null,null,null,null,null,null,null,null,null,null,null,null,111,71,39,23,null,null,null,null,"E20",51,9,null,null,null,51,51]
[null,19,65,45,20,null,null,19,33,23,10,44,null,19,17,12,5,22,null,null,null,null,null,null,null,null,null,null,null,null,null,null,null,null,null,null,null,null,null,null,null,null,null,null,null,null,null,null,null,null,null,null,65,41,24,47,null,33,21,12,41,null,17,11,6,21,null,9,6,3,11,null,null,null,null,null,null,null,null,null,null,null,null,null,null,null,null,null,null,"E21",78,14,null,null,null,78,78]
[null,20,33,null,null,null,null,20,17,null," ",28,null,20,9,null,null,11,null,null,null,null,null,null,null,null,null,null,null,null,null,null,null,null,null,null,null,null,null,null,null,null,null,null,null,null,null,null,null,null,null,null,65,9,56,48,null,33,5,28,57,null,17,3,14,29,null,9,2,7,15,null,null,null,null,null,null,null,null,null,8,45,33,24,16,null,null,null,null,"E22",67,13,null,null,null,67,67]
[null,21,33,null,null,null,null,21,17,null," ",21,null,21,9,null,null,14,null,null,null,null,null,null,null,null,null,null,null,null,null,null,null,null,null,null,null,null,null,null,null,null,null,null,null,null,null,null,null,null,null,null,null,null,null,null,null,null,null,null,null,null,null,null,null,null,null,null,null,null,null,null,null,null,null,null,null,null,null,null,null,112,72,40,24,null,null,null,null,"E23",99,15,null,null,null,99,99]
[null,22,65,61,4,null,null,22,33,31,2,37,null,22,17,null,1,19,null,null,null,null,null,null,null,null,null,null,null,null,null,null,null,null,null,null,null,null,null,null,null,null,null,null,null,null,null,null,null,null,null,null,9,0,0,16,null,5," "," ",8,null,3,0,0,4,null,2,0,0,2,null,null,null,null,null,null,null,null,null,null,null,null,null,null,null,null,null,null,"E24",46,16,null,null,null,46,46]
[null,23,65,29,36,null,null,23,33,15,18,53,null,23,17,8,9,27,null,null,null,null,null,null,null,null,null,null,null,null,null,null,null,null,null,null,null,null,null,null,null,null,null,null,null,null,null,null,null,null,null,null,9,0,0,9,null,5,0," ",5,null,3,0,0,3,null,null,null,null,null,null,null,null,null,null,null,null,null,null,9,87,43,27,null,null,null,null,null,"E25",999,6,null,null,null,999,999]
[null,24,17,null,null,null,null,24,9," "," ",12,null,24,5,null,null,6,null,null,null,null,null,null,null,null,null,null,null,null,null,null,null,null,null,null,null,null,null,null,null,null,null,null,null,null,null,null,null,null,null,null,null,null,null,null,null,null,null,null,null,null,null,null,null,null,null,null,null,null,null,null,null,null,null,null,null,null,null,null,null,113,73,41,null,null,null,null,null,"E26",999,5,null,null,null,999,999]
[null,25,17,null,null,null,null,25,9,null," ",13,null,25,5,null,null,7,null,null,null,null,null,null,null,null,null,null,null,null,null,null,null,null,null,null,null,null,null,null,null,null,null,null,null,null,null,null,null,null,null,null,65,13,52,49,null,33,7,26,60,null,17,4,13,30,null,null,null,null,null,null,null,null,null,null,null,null,null,null,null,null,null,null,null,null,null,null,null,"E27",999,7,null,null,null,999,999]
[null,26,65,21,44,null,null,26,33,11,22,52,null,26,17,6,11,26,null,null,null,null,null,null,null,null,null,null,null,null,null,null,null,null,null,null,null,null,null,null,null,null,null,null,null,null,null,null,null,null,null,null,65,45,20,50,null,33,23,10,44,null,17,12,5,22,null,null,null,null,null,null,null,null,null,null,null,null,null,null,10,58,44,28,null,null,null,null,null,"E28",999,8,null,null,null,999,999]
[null,27,65,53,12,null,null,27,33,27,6,36,null,27,17,14,3,18,null,null,null,null,null,null,null,null,null,null,null,null,null,null,null,null,null,null,null,null,null,null,null,null,null,null,null,null,null,null,null,null,null,null,null,null,null,null,null,null,null,null,null,null,null,null,null,null,null,null,null,null,null,null,null,null,null,null,null,null,null,null,null,114,74,42,null,null,null,null,null,"E29",999,3,null,null,null,999,999]
[null,28,33,null,null,null,null,28,17,null," ",20,null,28,9,null,null,10,null,null,null,null,null,null,null,null,null,null,null,null,null,null,null,null,null,null,null,null,null,null,null,null,null,null,null,null,null,null,null,null,null,null,33,0,0,51,null,17,0," ",28,null,9,0,0,11,null,null,null,null,null,null,null,null,null,null,null,null,null,null,null,null,null,null,null,null,null,null,null,"E30",999,4,null,null,null,999,999]
[null,29,33,null,null,null,null,29,17,null," ",29,null,29,9,null,null,15,null,null,null,null,null,null,null,null,null,null,null,null,null,null,null,null,null,null,null,null,null,null,null,null,null,null,null,null,null,null,null,null,null,null,33,0,0,40,null,17,0," ",21,null,9,0,0,14,null,null,null,null,null,null,null,null,null,null,null,null,null,null,11,90,42,26,null,null,null,null,null,"E31",999,2,null,null,null,999,999]
[null,30,65,37,28,null,null,30,33,19,14,45,null,30,17,10,7,23,null,null,null,null,null,null,null,null,null,null,null,null,null,null,null,null,null,null,null,null,null,null,null,null,null,null,null,null,null,null,null,null,null,null,null,null,null,null,null,null,null,null,null,null,null,null,null,null,null,null,null,null,null,null,null,null,null,null,null,null,null,null,null,115,75,43,null,null,null,null,null,"E32",999,1,null,null,null,999,999]
[null,31,65,5,60,null,null,31,33,3,30,61,null,31,17,2,15,31,null,null,null,null,null,null,null,null,null,null,null,null,null,null,null,null,null,null,null,null,null,null,null,null,null,null,null,null,null,null,null,null,null,null,65,61,4,52,null,33,31,2,37,null,17,0,1,19,null,null,null,null,null,null,null,null,null,null,null,null,null,null,null,null,null,null,null,null,null,null,null,"E33",22,null,null,null,null,22,22]
[null,32,5,null,null,null,null,32,3," "," ",4,null,32,2,null,null,2,null,null,null,null,null,null,null,null,null,null,null,null,null,null,null,null,null,null,null,null,null,null,null,null,null,null,null,null,null,null,null,null,null,null,65,29,36,53,null,33,15,18,53,null,17,8,9,27,null,null,null,null,null,null,null,null,null,null,null,null,null,null,12,55,41,25,null,null,null,null,null,"E34",21,null,null,null,null,21,21]
[null,33,5,null,null,null,null,33,3,null," ",3,null,null,null,null,null,null,null,null,null,null,null,null,null,null,null,null,null,null,null,null,null,null,null,null,null,null,null,null,null,null,null,null,null,null,null,null,null,null,null,null,null,null,null,null,null,null,null,null,null,null,null,null,null,null,null,null,null,null,null,null,null,null,null,null,null,null,null,null,null,116,76,44,null,null,null,null,null,"E35",23,null,null,null,null,23,23]
[null,34,65,7,58,null,null,34,33,4,29,62,null,null,null,null,null,null,null,null,null,null,null,null,null,null,null,null,null,null,null,null,null,null,null,null,null,null,null,null,null,null,null,null,null,null,null,null,null,null,null,null,17,0,0,24,null,9," "," ",12,null,5,0,0,6,null,null,null,null,null,null,null,null,null,null,null,null,null,null,null,null,null,null,null,null,null,null,null,"E36",24,null,null,null,null,24,24]
[null,35,65,39,26,null,null,35,33,20,13,46,null,null,null,null,null,null,null,null,null,null,null,null,null,null,null,null,null,null,null,null,null,null,null,null,null,null,null,null,null,null,null,null,null,null,null,null,null,null,null,null,17,0,0,25,null,9,0," ",13,null,5,0,0,7,null,null,null,null,null,null,null,null,null,null,null,null,null,null,13,74,46,30,null,null,null,null,null,"E37",19,null,null,null,null,19,19]
[null,36,33,null,null,null,null,36,17,null," ",30,null,null,null,null,null,null,null,null,null,null,null,null,null,null,null,null,null,null,null,null,null,null,null,null,null,null,null,null,null,null,null,null,null,null,null,null,null,null,null,null,null,null,null,null,null,null,null,null,null,null,null,null,null,null,null,null,null,null,null,null,null,null,null,null,null,null,null,null,null,117,77,45,null,null,null,null,null,"E38",20,null,null,null,null,20,20]
[null,37,33,null,null,null,null,37,17,null," ",19,null,null,null,null,null,null,null,null,null,null,null,null,null,null,null,null,null,null,null,null,null,null,null,null,null,null,null,null,null,null,null,null,null,null,null,null,null,null,null,null,65,21,44,54,null,33,11,22,52,null,17,6,11,26,null,null,null,null,null,null,null,null,null,null,null,null,null,null,null,null,null,null,null,null,null,null,null,"E39",18,null,null,null,null,18,18]
[null,38,65,55,10,null,null,38,33,28,5,35,null,null,null,null,null,null,null,null,null,null,null,null,null,null,null,null,null,null,null,null,null,null,null,null,null,null,null,null,null,null,null,null,null,null,null,null,null,null,null,null,65,53,12,55,null,33,27,6,36,null,17,14,3,18,null,null,null,null,null,null,null,null,null,null,null,null,null,null,14,71,45,29,null,null,null,null,null,"E40",17,null,null,null,null,17,17]
[null,39,65,23,42,null,null,39,33,12,21,61,null,null,null,null,null,null,null,null,null,null,null,null,null,null,null,null,null,null,null,null,null,null,null,null,null,null,null,null,null,null,null,null,null,null,null,null,null,null,null,null,null,null,null,null,null,null,null,null,null,null,null,null,null,null,null,null,null,null,null,null,null,null,null,null,null,null,null,null,null,118,78,46,null,null,null,null,null,"E41",27,null,null,null,null,27,27]
[null,40,17,null,null,null,null,40,9," "," ",14,null,null,null,null,null,null,null,null,null,null,null,null,null,null,null,null,null,null,null,null,null,null,null,null,null,null,null,null,null,null,null,null,null,null,null,null,null,null,null,null,33,0,0,56,null,17,0," ",20,null,9,0,0,10,null,null,null,null,null,null,null,null,null,null,null,null,null,null,null,null,null,null,null,null,null,null,null,"E42",28,null,null,null,null,28,28]
[null,41,17,null,null,null,null,41,9,null," ",11,null,null,null,null,null,null,null,null,null,null,null,null,null,null,null,null,null,null,null,null,null,null,null,null,null,null,null,null,null,null,null,null,null,null,null,null,null,null,null,null,33,0,0,999,null,17,0," ",29,null,9,0,0,15,null,null,null,null,null,null,null,null,null,null,null,null,null,null,15,103,47,31,null,null,null,null,null,"E43",26,null,null,null,null,26,26]
[null,42,65,31,34,null,null,42,33,16,17,54,null,null,null,null,null,null,null,null,null,null,null,null,null,null,null,null,null,null,null,null,null,null,null,null,null,null,null,null,null,null,null,null,null,null,null,null,null,null,null,null,null,null,null,null,null,null,null,null,null,null,null,null,null,null,null,null,null,null,null,null,null,null,null,null,null,null,null,null,null,119,79,47,null,null,null,null,null,"E44",25,null,null,null,null,25,25]
[null,43,65,63,2,null,null,43,33,null,1,38,null,null,null,null,null,null,null,null,null,null,null,null,null,null,null,null,null,null,null,null,null,null,null,null,null,null,null,null,null,null,null,null,null,null,null,null,null,null,null,null,65,37,28,999,null,33,19,14,45,null,17,10,7,23,null,null,null,null,null,null,null,null,null,null,null,null,null,null,null,null,null,null,null,null,null,null,null,"E45",30,null,null,null,null,30,30]
[null,44,33,null,null,null,null,44,17,null," ",22,null,null,null,null,null,null,null,null,null,null,null,null,null,null,null,null,null,null,null,null,null,null,null,null,null,null,null,null,null,null,null,null,null,null,null,null,null,null,null,null,65,5,60,999,null,33,3,30,61,null,17,2,15,31,null,null,null,null,null,null,null,null,null,null,null,null,null,null,16,42,48,32,null,null,null,null,null,"E46",29,null,null,null,null,29,29]
[null,45,33,null,null,null,null,45,17,null," ",27,null,null,null,null,null,null,null,null,null,null,null,null,null,null,null,null,null,null,null,null,null,null,null,null,null,null,null,null,null,null,null,null,null,null,null,null,null,null,null,null,null,null,null,null,null,null,null,null,null,null,null,null,null,null,null,null,null,null,null,null,null,null,null,null,null,null,null,null,null,120,80,48,null,null,null,null,null,"E47",31,null,null,null,null,31,31]
[null,46,65,47,18,null,null,46,33,24,9,43,null,null,null,null,null,null,null,null,null,null,null,null,null,null,null,null,null,null,null,null,null,null,null,null,null,null,null,null,null,null,null,null,null,null,null,null,null,null,null,null,5,0,0,8,null,3," "," ",4,null,2,0,0,2,null,null,null,null,null,null,null,null,null,null,null,null,null,null,null,null,null,null,null,null,null,null,null,"E48",32,null,null,null,null,32,32]
[null,47,65,15,50,null,null,47,33,8,25,59,null,null,null,null,null,null,null,null,null,null,null,null,null,null,null,null,null,null,null,null,null,null,null,null,null,null,null,null,null,null,null,null,null,null,null,null,null,null,null,null,5,0,0,5,null,3,0," ",3,null,null,null,null,null,null,null,null,null,null,null,null,null,null,null,null,null,null,null,17,82,54,null,null,null,null,null,null,"E49",11,null,null,null,null,11,11]
[null,48,9,null,null,null,null,48,5," "," ",6,null,null,null,null,null,null,null,null,null,null,null,null,null,null,null,null,null,null,null,null,null,null,null,null,null,null,null,null,null,null,null,null,null,null,null,null,null,null,null,null,null,null,null,null,null,null,null,null,null,null,null,null,null,null,null,null,null,null,null,null,null,null,null,null,null,null,null,null,null,121,81,null,null,null,null,null,null,"E50",12,null,null,null,null,12,12]
[null,49,9,null,null,null,null,49,5,null," ",7,null,null,null,null,null,null,null,null,null,null,null,null,null,null,null,null,null,null,null,null,null,null,null,null,null,null,null,null,null,null,null,null,null,null,null,null,null,null,null,null,65,7,58,999,null,33,4,29,62,null,null,null,null,null,null,null,null,null,null,null,null,null,null,null,null,null,null,null,null,null,null,null,null,null,null,null,null,"E51",10,null,null,null,null,10,10]
[null,50,65,11,54,null,null,50,33,6,27,58,null,null,null,null,null,null,null,null,null,null,null,null,null,null,null,null,null,null,null,null,null,null,null,null,null,null,null,null,null,null,null,null,null,null,null,null,null,null,null,null,65,39,26,999,null,33,20,13,46,null,null,null,null,null,null,null,null,null,null,null,null,null,null,null,null,null,null,null,18,63,53,null,null,null,null,null,null,"E52",9,null,null,null,null,9,9]
[null,51,65,43,22,null,null,51,33,22,11,42,null,null,null,null,null,null,null,null,null,null,null,null,null,null,null,null,null,null,null,null,null,null,null,null,null,null,null,null,null,null,null,null,null,null,null,null,null,null,null,null,null,null,null,null,null,null,null,null,null,null,null,null,null,null,null,null,null,null,null,null,null,null,null,null,null,null,null,null,null,122,82,null,null,null,null,null,null,"E53",14,null,null,null,null,14,14]
[null,52,33,null,null,null,null,52,17,null," ",26,null,null,null,null,null,null,null,null,null,null,null,null,null,null,null,null,null,null,null,null,null,null,null,null,null,null,null,null,null,null,null,null,null,null,null,null,null,null,null,null,33,0,0,999,null,17,0," ",30,null,null,null,null,null,null,null,null,null,null,null,null,null,null,null,null,null,null,null,null,null,null,null,null,null,null,null,null,"E54",13,null,null,null,null,13,13]
[null,53,33,null,null,null,null,53,17,null," ",23,null,null,null,null,null,null,null,null,null,null,null,null,null,null,null,null,null,null,null,null,null,null,null,null,null,null,null,null,null,null,null,null,null,null,null,null,null,null,null,null,33,0,0,57,null,17,0," ",19,null,null,null,null,null,null,null,null,null,null,null,null,null,null,null,null,null,null,null,19,95,55,null,null,null,null,null,null,"E55",15,null,null,null,null,15,15]
[null,54,65,59,6,null,null,54,33,14,3,39,null,null,null,null,null,null,null,null,null,null,null,null,null,null,null,null,null,null,null,null,null,null,null,null,null,null,null,null,null,null,null,null,null,null,null,null,null,null,null,null,null,null,null,null,null,null,null,null,null,null,null,null,null,null,null,null,null,null,null,null,null,null,null,null,null,null,null,null,null,123,83,null,null,null,null,null,null,"E56",16,null,null,null,null,16,16]
[null,55,65,27,38,null,null,55,33,8,19,55,null,null,null,null,null,null,null,null,null,null,null,null,null,null,null,null,null,null,null,null,null,null,null,null,null,null,null,null,null,null,null,null,null,null,null,null,null,null,null,null,65,55,10,58,null,33,28,5,35,null,null,null,null,null,null,null,null,null,null,null,null,null,null,null,null,null,null,null,null,null,null,null,null,null,null,null,null,"E57",6,null,null,null,null,6,6]
[null,56,17,null,null,null,null,56,9," "," ",10,null,null,null,null,null,null,null,null,null,null,null,null,null,null,null,null,null,null,null,null,null,null,null,null,null,null,null,null,null,null,null,null,null,null,null,null,null,null,null,null,65,23,42,59,null,33,12,21,61,null,null,null,null,null,null,null,null,null,null,null,null,null,null,null,null,null,null,null,20,50,56,null,null,null,null,null,null,"E58",5,null,null,null,null,5,5]
[null,57,17,null,null,null,null,57,9,null," ",15,null,null,null,null,null,null,null,null,null,null,null,null,null,null,null,null,null,null,null,null,null,null,null,null,null,null,null,null,null,null,null,null,null,null,null,null,null,null,null,null,null,null,null,null,null,null,null,null,null,null,null,null,null,null,null,null,null,null,null,null,null,null,null,null,null,null,null,null,null,124,84,null,null,null,null,null,null,"E59",7,null,null,null,null,7,7]
[null,58,65,19,46,null,null,58,33,10,23,50,null,null,null,null,null,null,null,null,null,null,null,null,null,null,null,null,null,null,null,null,null,null,null,null,null,null,null,null,null,null,null,null,null,null,null,null,null,null,null,null,17,0,0,28,null,9," "," ",14,null,null,null,null,null,null,null,null,null,null,null,null,null,null,null,null,null,null,null,null,null,null,null,null,null,null,null,null,"E60",8,null,null,null,null,8,8]
[null,59,65,51,14,null,null,59,33,26,7,34,null,null,null,null,null,null,null,null,null,null,null,null,null,null,null,null,null,null,null,null,null,null,null,null,null,null,null,null,null,null,null,null,null,null,null,null,null,null,null,null,17,0,0,21,null,9,0," ",11,null,null,null,null,null,null,null,null,null,null,null,null,null,null,null,null,null,null,null,21,79,61,null,null,null,null,null,null,"E61",3,null,null,null,null,3,3]
[null,60,33,null,null,null,null,60,17,null," ",18,null,null,null,null,null,null,null,null,null,null,null,null,null,null,null,null,null,null,null,null,null,null,null,null,null,null,null,null,null,null,null,null,null,null,null,null,null,null,null,null,null,null,null,null,null,null,null,null,null,null,null,null,null,null,null,null,null,null,null,null,null,null,null,null,null,null,null,null,null,125,85,null,null,null,null,null,null,"E62",4,null,null,null,null,4,4]
[null,61,33,null,null,null,null,61,17,null," ",31,null,null,null,null,null,null,null,null,null,null,null,null,null,null,null,null,null,null,null,null,null,null,null,null,null,null,null,null,null,null,null,null,null,null,null,null,null,null,null,null,65,31,34,60,null,33,16,17,54,null,null,null,null,null,null,null,null,null,null,null,null,null,null,null,null,null,null,null,null,null,null,null,null,null,null,null,null,"E63",2,null,null,null,null,2,2]
[null,62,65,35,30,null,null,62,33,18,15,47,null,null,null,null,null,null,null,null,null,null,null,null,null,null,null,null,null,null,null,null,null,null,null,null,null,null,null,null,null,null,null,null,null,null,null,null,null,null,null,null,65,63,2,61,null,33,0,1,38,null,null,null,null,null,null,null,null,null,null,null,null,null,null,null,null,null,null,null,22,66,52,null,null,null,null,null,null,"E64",1,null,null,null,null,1,1]
[null,63,65,3,62,null,null,63,33,2,31,63,null,null,null,null,null,null,null,null,null,null,null,null,null,null,null,null,null,null,null,null,null,null,null,null,null,null,null,null,null,null,null,null,null,null,null,null,null,null,null,null,null,null,null,null,null,null,null,null,null,null,null,null,null,null,null,null,null,null,null,null,null,null,null,null,null,null,null,null,null,126,86]
[null,64,3,null,null,null,null,64,2," "," ",2,null,null,null,null,null,null,null,null,null,null,null,null,null,null,null,null,null,null,null,null,null,null,null,null,null,null,null,null,null,null,null,null,null,null,null,null,null,null,null,null,33,0,0,37,null,17,0," ",22]
[null,65,3,null,null,null,null,null,null,null,null,null,null,null,null,null,null,null,null,null,null,null,null,null,null,null,null,null,null,null,null,null,null,null,null,null,null,null,null,null,null,null,null,null,null,null,null,null,null,null,null,null,33,0,0,62,null,17,0," ",27,null,null,null,null,null,null,null,null,null,null,null,null,null,null,null,null,null,null,null,23,98,50]
[null,66,65,4,61,null,null,null,null,null,null,null,null,null,null,null,null,null,null,null,null,null,null,null,null,null,null,null,null,null,null,null,null,null,null,null,null,null,null,null,null,null,null,null,null,null,null,null,null,null,null,null,null,null,null,null,null,null,null,null,null,null,null,null,null,null,null,null,null,null,null,null,null,null,null,null,null,null,null,null,null,127,87]
[null,67,65,36,29,null,null,null,null,null,null,null,null,null,null,null,null,null,null,null,null,null,null,null,null,null,null,null,null,null,null,null,null,null,null,null,null,null,null,null,null,null,null,null,null,null,null,null,null,null,null,null,65,47,18,63,null,33,24,9,43]
[null,68,33,null,null,null,null,null,null,null,null,null,null,null,null,null,null,null,null,null,null,null,null,null,null,null,null,null,null,null,null,null,null,null,null,null,null,null,null,null,null,null,null,null,null,null,null,null,null,null,null,null,65,15,50,64,null,33,8,25,59,null,null,null,null,null,null,null,null,null,null,null,null,null,null,null,null,null,null,null,24,47,49]
[null,69,33,null,null,null,null,null,null,null,null,null,null,null,null,null,null,null,null,null,null,null,null,null,null,null,null,null,null,null,null,null,null,null,null,null,null,null,null,null,null,null,null,null,null,null,null,null,null,null,null,null,null,null,null,null,null,null,null,null,null,null,null,null,null,null,null,null,null,null,null,null,null,null,null,null,null,null,null,null,null,128,88]
[null,70,65,52,13,null,null,null,null,null,null,null,null,null,null,null,null,null,null,null,null,null,null,null,null,null,null,null,null,null,null,null,null,null,null,null,null,null,null,null,null,null,null,null,null,null,null,null,null,null,null,null,9,0,0,12,null,5," "," ",6]
[null,71,65,20,45,null,null,null,null,null,null,null,null,null,null,null,null,null,null,null,null,null,null,null,null,null,null,null,null,null,null,null,null,null,null,null,null,null,null,null,null,null,null,null,null,null,null,null,null,null,null,null,9,0,0,13,null,5,0," ",7,null,null,null,null,null,null,null,null,null,null,null,null,null,null,null,null,null,null,null,25,91,59]
[null,72,17,null,null,null,null,null,null,null,null,null,null,null,null,null,null,null,null,null,null,null,null,null,null,null,null,null,null,null,null,null,null,null,null,null,null,null,null,null,null,null,null,null,null,null,null,null,null,null,null,null,null,null,null,null,null,null,null,null,null,null,null,null,null,null,null,null,null,null,null,null,null,null,null,null,null,null,null,null,null,129,89]
[null,73,17,null,null,null,null,null,null,null,null,null,null,null,null,null,null,null,null,null,null,null,null,null,null,null,null,null,null,null,null,null,null,null,null,null,null,null,null,null,null,null,null,null,null,null,null,null,null,null,null,null,65,11,54,65,null,33,6,27,58]
[null,74,65,28,37,null,null,null,null,null,null,null,null,null,null,null,null,null,null,null,null,null,null,null,null,null,null,null,null,null,null,null,null,null,null,null,null,null,null,null,null,null,null,null,null,null,null,null,null,null,null,null,65,43,22,66,null,33,22,11,42,null,null,null,null,null,null,null,null,null,null,null,null,null,null,null,null,null,null,null,26,54,60]
[null,75,65,60,5,null,null,null,null,null,null,null,null,null,null,null,null,null,null,null,null,null,null,null,null,null,null,null,null,null,null,null,null,null,null,null,null,null,null,null,null,null,null,null,null,null,null,null,null,null,null,null,null,null,null,null,null,null,null,null,null,null,null,null,null,null,null,null,null,null,null,null,null,null,null,null,null,null,null,null,null,130,90]
[null,76,33,null,null,null,null,null,null,null,null,null,null,null,null,null,null,null,null,null,null,null,null,null,null,null,null,null,null,null,null,null,null,null,null,null,null,null,null,null,null,null,null,null,null,null,null,null,null,null,null,null,33,0,0,67,null,17,0," ",26]
[null,77,33,null,null,null,null,null,null,null,null,null,null,null,null,null,null,null,null,null,null,null,null,null,null,null,null,null,null,null,null,null,null,null,null,null,null,null,null,null,null,null,null,null,null,null,null,null,null,null,null,null,33,0,0,36,null,17,0," ",23,null,null,null,null,null,null,null,null,null,null,null,null,null,null,null,null,null,null,null,27,65,58]
[null,78,65,44,21,null,null,null,null,null,null,null,null,null,null,null,null,null,null,null,null,null,null,null,null,null,null,null,null,null,null,null,null,null,null,null,null,null,null,null,null,null,null,null,null,null,null,null,null,null,null,null,null,null,null,null,null,null,null,null,null,null,null,null,null,null,null,null,null,null,null,null,null,null,null,null,null,null,null,null,null,131,91]
[null,79,65,12,53,null,null,null,null,null,null,null,null,null,null,null,null,null,null,null,null,null,null,null,null,null,null,null,null,null,null,null,null,null,null,null,null,null,null,null,null,null,null,null,null,null,null,null,null,null,null,null,65,59,6,68,null,33,14,3,39]
[null,80,9,null,null,null,null,null,null,null,null,null,null,null,null,null,null,null,null,null,null,null,null,null,null,null,null,null,null,null,null,null,null,null,null,null,null,null,null,null,null,null,null,null,null,null,null,null,null,null,null,null,65,27,38,69,null,33,8,19,55,null,null,null,null,null,null,null,null,null,null,null,null,null,null,null,null,null,null,null,28,76,57]
[null,81,9,null,null,null,null,null,null,null,null,null,null,null,null,null,null,null,null,null,null,null,null,null,null,null,null,null,null,null,null,null,null,null,null,null,null,null,null,null,null,null,null,null,null,null,null,null,null,null,null,null,null,null,null,null,null,null,null,null,null,null,null,null,null,null,null,null,null,null,null,null,null,null,null,null,null,null,null,null,null,132,92]
[null,82,65,16,49,null,null,null,null,null,null,null,null,null,null,null,null,null,null,null,null,null,null,null,null,null,null,null,null,null,null,null,null,null,null,null,null,null,null,null,null,null,null,null,null,null,null,null,null,null,null,null,17,0,0,20,null,9," "," ",10]
[null,83,65,48,17,null,null,null,null,null,null,null,null,null,null,null,null,null,null,null,null,null,null,null,null,null,null,null,null,null,null,null,null,null,null,null,null,null,null,null,null,null,null,null,null,null,null,null,null,null,null,null,17,0,0,29,null,9,0," ",15,null,null,null,null,null,null,null,null,null,null,null,null,null,null,null,null,null,null,null,29,43,62]
[null,84,33,null,null,null,null,null,null,null,null,null,null,null,null,null,null,null,null,null,null,null,null,null,null,null,null,null,null,null,null,null,null,null,null,null,null,null,null,null,null,null,null,null,null,null,null,null,null,null,null,null,null,null,null,null,null,null,null,null,null,null,null,null,null,null,null,null,null,null,null,null,null,null,null,null,null,null,null,null,null,133,93]
[null,85,33,null,null,null,null,null,null,null,null,null,null,null,null,null,null,null,null,null,null,null,null,null,null,null,null,null,null,null,null,null,null,null,null,null,null,null,null,null,null,null,null,null,null,null,null,null,null,null,null,null,65,19,46,70,null,33,10,23,50]
[null,86,65,64,1,null,null,null,null,null,null,null,null,null,null,null,null,null,null,null,null,null,null,null,null,null,null,null,null,null,null,null,null,null,null,null,null,null,null,null,null,null,null,null,null,null,null,null,null,null,null,null,65,51,14,71,null,33,26,7,34,null,null,null,null,null,null,null,null,null,null,null,null,null,null,null,null,null,null,null,30,60,61]
[null,87,65,32,33,null,null,null,null,null,null,null,null,null,null,null,null,null,null,null,null,null,null,null,null,null,null,null,null,null,null,null,null,null,null,null,null,null,null,null,null,null,null,null,null,null,null,null,null,null,null,null,null,null,null,null,null,null,null,null,null,null,null,null,null,null,null,null,null,null,null,null,null,null,null,null,null,null,null,null,null,134,94]
[null,88,17,null,null,null,null,null,null,null,null,null,null,null,null,null,null,null,null,null,null,null,null,null,null,null,null,null,null,null,null,null,null,null,null,null,null,null,null,null,null,null,null,null,null,null,null,null,null,null,null,null,33,0,0,72,null,17,0," ",18]
[null,89,17,null,null,null,null,null,null,null,null,null,null,null,null,null,null,null,null,null,null,null,null,null,null,null,null,null,null,null,null,null,null,null,null,null,null,null,null,null,null,null,null,null,null,null,null,null,null,null,null,null,33,0,0,999,null,17,0," ",31,null,null,null,null,null,null,null,null,null,null,null,null,null,null,null,null,null,null,null,31,80,63]
[null,90,65,24,41,null,null,null,null,null,null,null,null,null,null,null,null,null,null,null,null,null,null,null,null,null,null,null,null,null,null,null,null,null,null,null,null,null,null,null,null,null,null,null,null,null,null,null,null,null,null,null,null,null,null,null,null,null,null,null,null,null,null,null,null,null,null,null,null,null,null,null,null,null,null,null,null,null,null,null,null,135,95]
[null,91,65,56,9,null,null,null,null,null,null,null,null,null,null,null,null,null,null,null,null,null,null,null,null,null,null,null,null,null,null,null,null,null,null,null,null,null,null,null,null,null,null,null,null,null,null,null,null,null,null,null,65,35,30,999,null,33,18,15,47]
[null,92,33,null,null,null,null,null,null,null,null,null,null,null,null,null,null,null,null,null,null,null,null,null,null,null,null,null,null,null,null,null,null,null,null,null,null,null,null,null,null,null,null,null,null,null,null,null,null,null,null,null,65,3,62,999,null,33,2,31,63,null,null,null,null,null,null,null,null,null,null,null,null,null,null,null,null,null,null,null,32,97,64]
[null,93,33,null,null,null,null,null,null,null,null,null,null,null,null,null,null,null,null,null,null,null,null,null,null,null,null,null,null,null,null,null,null,null,null,null,null,null,null,null,null,null,null,null,null,null,null,null,null,null,null,null,null,null,null,null,null,null,null,null,null,null,null,null,null,null,null,null,null,null,null,null,null,null,null,null,null,null,null,null,null,136,96]
[null,94,65,40,25,null,null,null,null,null,null,null,null,null,null,null,null,null,null,null,null,null,null,null,null,null,null,null,null,null,null,null,null,null,null,null,null,null,null,null,null,null,null,null,null,null,null,null,null,null,null,null,3,0,0,4,null,2," "," ",2]
[null,95,65,8,57,null,null,null,null,null,null,null,null,null,null,null,null,null,null,null,null,null,null,null,null,null,null,null,null,null,null,null,null,null,null,null,null,null,null,null,null,null,null,null,null,null,null,null,null,null,null,null,3,0,0,3,null,null,null,null,null,null,null,null,null,null,null,null,null,null,null,null,null,null,null,null,null,null,null,null,33,102]
[null,96,5,null,null,null,null,null,null,null,null,null,null,null,null,null,null,null,null,null,null,null,null,null,null,null,null,null,null,null,null,null,null,null,null,null,null,null,null,null,null,null,null,null,null,null,null,null,null,null,null,null,null,null,null,null,null,null,null,null,null,null,null,null,null,null,null,null,null,null,null,null,null,null,null,null,null,null,null,null,null,137]
[null,97,5,null,null,null,null,null,null,null,null,null,null,null,null,null,null,null,null,null,null,null,null,null,null,null,null,null,null,null,null,null,null,null,null,null,null,null,null,null,null,null,null,null,null,null,null,null,null,null,null,null,65,4,61,999]
[null,98,65,6,59,null,null,null,null,null,null,null,null,null,null,null,null,null,null,null,null,null,null,null,null,null,null,null,null,null,null,null,null,null,null,null,null,null,null,null,null,null,null,null,null,null,null,null,null,null,null,null,65,36,29,999,null,null,null,null,null,null,null,null,null,null,null,null,null,null,null,null,null,null,null,null,null,null,null,null,34,64]
[null,99,65,38,27,null,null,null,null,null,null,null,null,null,null,null,null,null,null,null,null,null,null,null,null,null,null,null,null,null,null,null,null,null,null,null,null,null,null,null,null,null,null,null,null,null,null,null,null,null,null,null,null,null,null,null,null,null,null,null,null,null,null,null,null,null,null,null,null,null,null,null,null,null,null,null,null,null,null,null,null,138]
[null,100,33,null,null,null,null,null,null,null,null,null,null,null,null,null,null,null,null,null,null,null,null,null,null,null,null,null,null,null,null,null,null,null,null,null,null,null,null,null,null,null,null,null,null,null,null,null,null,null,null,null,33,0,0,999]
[null,101,33,null,null,null,null,null,null,null,null,null,null,null,null,null,null,null,null,null,null,null,null,null,null,null,null,null,null,null,null,null,null,null,null,null,null,null,null,null,null,null,null,null,null,null,null,null,null,null,null,null,33,0,0,73,null,null,null,null,null,null,null,null,null,null,null,null,null,null,null,null,null,null,null,null,null,null,null,null,35,59]
[null,102,65,54,11,null,null,null,null,null,null,null,null,null,null,null,null,null,null,null,null,null,null,null,null,null,null,null,null,null,null,null,null,null,null,null,null,null,null,null,null,null,null,null,null,null,null,null,null,null,null,null,null,null,null,null,null,null,null,null,null,null,null,null,null,null,null,null,null,null,null,null,null,null,null,null,null,null,null,null,null,139]
[null,103,65,22,43,null,null,null,null,null,null,null,null,null,null,null,null,null,null,null,null,null,null,null,null,null,null,null,null,null,null,null,null,null,null,null,null,null,null,null,null,null,null,null,null,null,null,null,null,null,null,null,65,52,13,74]
[null,104,17,null,null,null,null,null,null,null,null,null,null,null,null,null,null,null,null,null,null,null,null,null,null,null,null,null,null,null,null,null,null,null,null,null,null,null,null,null,null,null,null,null,null,null,null,null,null,null,null,null,65,20,45,75,null,null,null,null,null,null,null,null,null,null,null,null,null,null,null,null,null,null,null,null,null,null,null,null,36,75]
[null,105,17,null,null,null,null,null,null,null,null,null,null,null,null,null,null,null,null,null,null,null,null,null,null,null,null,null,null,null,null,null,null,null,null,null,null,null,null,null,null,null,null,null,null,null,null,null,null,null,null,null,null,null,null,null,null,null,null,null,null,null,null,null,null,null,null,null,null,null,null,null,null,null,null,null,null,null,null,null,null,140]
[null,106,65,30,35,null,null,null,null,null,null,null,null,null,null,null,null,null,null,null,null,null,null,null,null,null,null,null,null,null,null,null,null,null,null,null,null,null,null,null,null,null,null,null,null,null,null,null,null,null,null,null,17,0,0,30]
[null,107,65,62,3,null,null,null,null,null,null,null,null,null,null,null,null,null,null,null,null,null,null,null,null,null,null,null,null,null,null,null,null,null,null,null,null,null,null,null,null,null,null,null,null,null,null,null,null,null,null,null,17,0,0,19,null,null,null,null,null,null,null,null,null,null,null,null,null,null,null,null,null,null,null,null,null,null,null,null,37,48]
[null,108,33,null,null,null,null,null,null,null,null,null,null,null,null,null,null,null,null,null,null,null,null,null,null,null,null,null,null,null,null,null,null,null,null,null,null,null,null,null,null,null,null,null,null,null,null,null,null,null,null,null,null,null,null,null,null,null,null,null,null,null,null,null,null,null,null,null,null,null,null,null,null,null,null,null,null,null,null,null,null,141]
[null,109,33,null,null,null,null,null,null,null,null,null,null,null,null,null,null,null,null,null,null,null,null,null,null,null,null,null,null,null,null,null,null,null,null,null,null,null,null,null,null,null,null,null,null,null,null,null,null,null,null,null,65,28,37,76]
[null,110,65,46,19,null,null,null,null,null,null,null,null,null,null,null,null,null,null,null,null,null,null,null,null,null,null,null,null,null,null,null,null,null,null,null,null,null,null,null,null,null,null,null,null,null,null,null,null,null,null,null,65,60,5,77,null,null,null,null,null,null,null,null,null,null,null,null,null,null,null,null,null,null,null,null,null,null,null,null,38,49]
[null,111,65,14,51,null,null,null,null,null,null,null,null,null,null,null,null,null,null,null,null,null,null,null,null,null,null,null,null,null,null,null,null,null,null,null,null,null,null,null,null,null,null,null,null,null,null,null,null,null,null,null,null,null,null,null,null,null,null,null,null,null,null,null,null,null,null,null,null,null,null,null,null,null,null,null,null,null,null,null,null,142]
[null,112,9,null,null,null,null,null,null,null,null,null,null,null,null,null,null,null,null,null,null,null,null,null,null,null,null,null,null,null,null,null,null,null,null,null,null,null,null,null,null,null,null,null,null,null,null,null,null,null,null,null,33,0,0,35]
[null,113,9,null,null,null,null,null,null,null,null,null,null,null,null,null,null,null,null,null,null,null,null,null,null,null,null,null,null,null,null,null,null,null,null,null,null,null,null,null,null,null,null,null,null,null,null,null,null,null,null,null,33,0,0,78,null,null,null,null,null,null,null,null,null,null,null,null,null,null,null,null,null,null,null,null,null,null,null,null,39,53]
[null,114,65,10,55,null,null,null,null,null,null,null,null,null,null,null,null,null,null,null,null,null,null,null,null,null,null,null,null,null,null,null,null,null,null,null,null,null,null,null,null,null,null,null,null,null,null,null,null,null,null,null,null,null,null,null,null,null,null,null,null,null,null,null,null,null,null,null,null,null,null,null,null,null,null,null,null,null,null,null,null,143]
[null,115,65,42,23,null,null,null,null,null,null,null,null,null,null,null,null,null,null,null,null,null,null,null,null,null,null,null,null,null,null,null,null,null,null,null,null,null,null,null,null,null,null,null,null,null,null,null,null,null,null,null,65,44,21,79]
[null,116,33,null,null,null,null,null,null,null,null,null,null,null,null,null,null,null,null,null,null,null,null,null,null,null,null,null,null,null,null,null,null,null,null,null,null,null,null,null,null,null,null,null,null,null,null,null,null,null,null,null,65,12,53,80,null,null,null,null,null,null,null,null,null,null,null,null,null,null,null,null,null,null,null,null,null,null,null,null,40,70]
[null,117,33,null,null,null,null,null,null,null,null,null,null,null,null,null,null,null,null,null,null,null,null,null,null,null,null,null,null,null,null,null,null,null,null,null,null,null,null,null,null,null,null,null,null,null,null,null,null,null,null,null,null,null,null,null,null,null,null,null,null,null,null,null,null,null,null,null,null,null,null,null,null,null,null,null,null,null,null,null,null,144]
[null,118,65,58,7,null,null,null,null,null,null,null,null,null,null,null,null,null,null,null,null,null,null,null,null,null,null,null,null,null,null,null,null,null,null,null,null,null,null,null,null,null,null,null,null,null,null,null,null,null,null,null,9,0,0,14]
[null,119,65,26,39,null,null,null,null,null,null,null,null,null,null,null,null,null,null,null,null,null,null,null,null,null,null,null,null,null,null,null,null,null,null,null,null,null,null,null,null,null,null,null,null,null,null,null,null,null,null,null,9,0,0,11,null,null,null,null,null,null,null,null,null,null,null,null,null,null,null,null,null,null,null,null,null,null,null,null,41,86]
[null,120,17,null,null,null,null,null,null,null,null,null,null,null,null,null,null,null,null,null,null,null,null,null,null,null,null,null,null,null,null,null,null,null,null,null,null,null,null,null,null,null,null,null,null,null,null,null,null,null,null,null,null,null,null,null,null,null,null,null,null,null,null,null,null,null,null,null,null,null,null,null,null,null,null,null,null,null,null,null,null,145]
[null,121,17,null,null,null,null,null,null,null,null,null,null,null,null,null,null,null,null,null,null,null,null,null,null,null,null,null,null,null,null,null,null,null,null,null,null,null,null,null,null,null,null,null,null,null,null,null,null,null,null,null,65,16,49,81]
[null,122,65,18,47,null,null,null,null,null,null,null,null,null,null,null,null,null,null,null,null,null,null,null,null,null,null,null,null,null,null,null,null,null,null,null,null,null,null,null,null,null,null,null,null,null,null,null,null,null,null,null,65,48,17,82,null,null,null,null,null,null,null,null,null,null,null,null,null,null,null,null,null,null,null,null,null,null,null,null,42,85]
[null,123,65,50,15,null,null,null,null,null,null,null,null,null,null,null,null,null,null,null,null,null,null,null,null,null,null,null,null,null,null,null,null,null,null,null,null,null,null,null,null,null,null,null,null,null,null,null,null,null,null,null,null,null,null,null,null,null,null,null,null,null,null,null,null,null,null,null,null,null,null,null,null,null,null,null,null,null,null,null,null,146]
[null,124,33,null,null,null,null,null,null,null,null,null,null,null,null,null,null,null,null,null,null,null,null,null,null,null,null,null,null,null,null,null,null,null,null,null,null,null,null,null,null,null,null,null,null,null,null,null,null,null,null,null,33,0,0,83]
[null,125,33,null,null,null,null,null,null,null,null,null,null,null,null,null,null,null,null,null,null,null,null,null,null,null,null,null,null,null,null,null,null,null,null,null,null,null,null,null,null,null,null,null,null,null,null,null,null,null,null,null,33,0,0,38,null,null,null,null,null,null,null,null,null,null,null,null,null,null,null,null,null,null,null,null,null,null,null,null,43,96]
[null,126,65,34,31,null,null,null,null,null,null,null,null,null,null,null,null,null,null,null,null,null,null,null,null,null,null,null,null,null,null,null,null,null,null,null,null,null,null,null,null,null,null,null,null,null,null,null,null,null,null,null,null,null,null,null,null,null,null,null,null,null,null,null,null,null,null,null,null,null,null,null,null,null,null,null,null,null,null,null,null,147]
[null,127,65,2,63,null,null,null,null,null,null,null,null,null,null,null,null,null,null,null,null,null,null,null,null,null,null,null,null,null,null,null,null,null,null,null,null,null,null,null,null,null,null,null,null,null,null,null,null,null,null,null,65,64,1,84]
[null,128,2,null,null,null,null,null,null,null,null,null,null,null,null,null,null,null,null,null,null,null,null,null,null,null,null,null,null,null,null,null,null,null,null,null,null,null,null,null,null,null,null,null,null,null,null,null,null,null,null,null,65,32,33,85,null,null,null,null,null,null,null,null,null,null,null,null,null,null,null,null,null,null,null,null,null,null,null,null,44,92]
[null,null,null,null,null,null,null,null,null,null,null,null,null,null,null,null,null,null,null,null,null,null,null,null,null,null,null,null,null,null,null,null,null,null,null,null,null,null,null,null,null,null,null,null,null,null,null,null,null,null,null,null,null,null,null,null,null,null,null,null,null,null,null,null,null,null,null,null,null,null,null,null,null,null,null,null,null,null,null,null,null,148]
[null,null,null,null,null,null,null,null,null,null,null,null,null,null,null,null,null,null,null,null,null,null,null,null,null,null,null,null,null,null,null,null,null,null,null,null,null,null,null,null,null,null,null,null,null,null,null,null,null,null,null,null,17,0,0,22]
[null,null,null,null,null,null,null,null,null,null,null,null,null,null,null,null,null,null,null,null,null,null,null,null,null,null,null,null,null,null,null,null,null,null,null,null,null,null,null,null,null,null,null,null,null,null,null,null,null,null,null,null,17,0,0,27,null,null,null,null,null,null,null,null,null,null,null,null,null,null,null,null,null,null,null,null,null,null,null,null,45,44]
[null,null,null,null,null,null,null,null,null,null,null,null,null,null,null,null,null,null,null,null,null,null,null,null,null,null,null,null,null,null,null,null,null,null,null,null,null,null,null,null,null,null,null,null,null,null,null,null,null,null,null,null,null,null,null,null,null,null,null,null,null,null,null,null,null,null,null,null,null,null,null,null,null,null,null,null,null,null,null,null,null,149]
[null,null,null,null,null,null,null,null,null,null,null,null,null,null,null,null,null,null,null,null,null,null,null,null,null,null,null,null,null,null,null,null,null,null,null,null,null,null,null,null,null,null,null,null,null,null,null,null,null,null,null,null,65,24,41,86]
[null,null,null,null,null,null,null,null,null,null,null,null,null,null,null,null,null,null,null,null,null,null,null,null,null,null,null,null,null,null,null,null,null,null,null,null,null,null,null,null,null,null,null,null,null,null,null,null,null,null,null,null,65,56,9,87,null,null,null,null,null,null,null,null,null,null,null,null,null,null,null,null,null,null,null,null,null,null,null,null,46,69]
[null,null,null,null,null,null,null,null,null,null,null,null,null,null,null,null,null,null,null,null,null,null,null,null,null,null,null,null,null,null,null,null,null,null,null,null,null,null,null,null,null,null,null,null,null,null,null,null,null,null,null,null,null,null,null,null,null,null,null,null,null,null,null,null,null,null,null,null,null,null,null,null,null,null,null,null,null,null,null,null,null,150]
[null,null,null,null,null,null,null,null,null,null,null,null,null,null,null,null,null,null,null,null,null,null,null,null,null,null,null,null,null,null,null,null,null,null,null,null,null,null,null,null,null,null,null,null,null,null,null,null,null,null,null,null,33,0,0,88]
[null,null,null,null,null,null,null,null,null,null,null,null,null,null,null,null,null,null,null,null,null,null,null,null,null,null,null,null,null,null,null,null,null,null,null,null,null,null,null,null,null,null,null,null,null,null,null,null,null,null,null,null,33,0,0,999,null,null,null,null,null,null,null,null,null,null,null,null,null,null,null,null,null,null,null,null,null,null,null,null,47,101]
[null,null,null,null,null,null,null,null,null,null,null,null,null,null,null,null,null,null,null,null,null,null,null,null,null,null,null,null,null,null,null,null,null,null,null,null,null,null,null,null,null,null,null,null,null,null,null,null,null,null,null,null,null,null,null,null,null,null,null,null,null,null,null,null,null,null,null,null,null,null,null,null,null,null,null,null,null,null,null,null,null,151]
[null,null,null,null,null,null,null,null,null,null,null,null,null,null,null,null,null,null,null,null,null,null,null,null,null,null,null,null,null,null,null,null,null,null,null,null,null,null,null,null,null,null,null,null,null,null,null,null,null,null,null,null,65,40,25,999]
[null,null,null,null,null,null,null,null,null,null,null,null,null,null,null,null,null,null,null,null,null,null,null,null,null,null,null,null,null,null,null,null,null,null,null,null,null,null,null,null,null,null,null,null,null,null,null,null,null,null,null,null,65,8,57,999,null,null,null,null,null,null,null,null,null,null,null,null,null,null,null,null,null,null,null,null,null,null,null,null,48,81]
[null,null,null,null,null,null,null,null,null,null,null,null,null,null,null,null,null,null,null,null,null,null,null,null,null,null,null,null,null,null,null,null,null,null,null,null,null,null,null,null,null,null,null,null,null,null,null,null,null,null,null,null,null,null,null,null,null,null,null,null,null,null,null,null,null,null,null,null,null,null,null,null,null,null,null,null,null,null,null,null,null,152]
[null,null,null,null,null,null,null,null,null,null,null,null,null,null,null,null,null,null,null,null,null,null,null,null,null,null,null,null,null,null,null,null,null,null,null,null,null,null,null,null,null,null,null,null,null,null,null,null,null,null,null,null,5,0,0,6]
[null,null,null,null,null,null,null,null,null,null,null,null,null,null,null,null,null,null,null,null,null,null,null,null,null,null,null,null,null,null,null,null,null,null,null,null,null,null,null,null,null,null,null,null,null,null,null,null,null,null,null,null,5,0,0,7,null,null,null,null,null,null,null,null,null,null,null,null,null,null,null,null,null,null,null,null,null,null,null,null,49,41]
[null,null,null,null,null,null,null,null,null,null,null,null,null,null,null,null,null,null,null,null,null,null,null,null,null,null,null,null,null,null,null,null,null,null,null,null,null,null,null,null,null,null,null,null,null,null,null,null,null,null,null,null,null,null,null,null,null,null,null,null,null,null,null,null,null,null,null,null,null,null,null,null,null,null,null,null,null,null,null,null,null,153]
[null,null,null,null,null,null,null,null,null,null,null,null,null,null,null,null,null,null,null,null,null,null,null,null,null,null,null,null,null,null,null,null,null,null,null,null,null,null,null,null,null,null,null,null,null,null,null,null,null,null,null,null,65,6,59,999]
[null,null,null,null,null,null,null,null,null,null,null,null,null,null,null,null,null,null,null,null,null,null,null,null,null,null,null,null,null,null,null,null,null,null,null,null,null,null,null,null,null,null,null,null,null,null,null,null,null,null,null,null,65,38,27,999,null,null,null,null,null,null,null,null,null,null,null,null,null,null,null,null,null,null,null,null,null,null,null,null,50,99]
[null,null,null,null,null,null,null,null,null,null,null,null,null,null,null,null,null,null,null,null,null,null,null,null,null,null,null,null,null,null,null,null,null,null,null,null,null,null,null,null,null,null,null,null,null,null,null,null,null,null,null,null,null,null,null,null,null,null,null,null,null,null,null,null,null,null,null,null,null,null,null,null,null,null,null,null,null,null,null,null,null,154]
[null,null,null,null,null,null,null,null,null,null,null,null,null,null,null,null,null,null,null,null,null,null,null,null,null,null,null,null,null,null,null,null,null,null,null,null,null,null,null,null,null,null,null,null,null,null,null,null,null,null,null,null,33,0,0,999]
[null,null,null,null,null,null,null,null,null,null,null,null,null,null,null,null,null,null,null,null,null,null,null,null,null,null,null,null,null,null,null,null,null,null,null,null,null,null,null,null,null,null,null,null,null,null,null,null,null,null,null,null,33,0,0,89,null,null,null,null,null,null,null,null,null,null,null,null,null,null,null,null,null,null,null,null,null,null,null,null,51,78]
[null,null,null,null,null,null,null,null,null,null,null,null,null,null,null,null,null,null,null,null,null,null,null,null,null,null,null,null,null,null,null,null,null,null,null,null,null,null,null,null,null,null,null,null,null,null,null,null,null,null,null,null,null,null,null,null,null,null,null,null,null,null,null,null,null,null,null,null,null,null,null,null,null,null,null,null,null,null,null,null,null,155]
[null,null,null,null,null,null,null,null,null,null,null,null,null,null,null,null,null,null,null,null,null,null,null,null,null,null,null,null,null,null,null,null,null,null,null,null,null,null,null,null,null,null,null,null,null,null,null,null,null,null,null,null,65,54,11,90]
[null,null,null,null,null,null,null,null,null,null,null,null,null,null,null,null,null,null,null,null,null,null,null,null,null,null,null,null,null,null,null,null,null,null,null,null,null,null,null,null,null,null,null,null,null,null,null,null,null,null,null,null,65,22,43,91,null,null,null,null,null,null,null,null,null,null,null,null,null,null,null,null,null,null,null,null,null,null,null,null,52,57]
[null,null,null,null,null,null,null,null,null,null,null,null,null,null,null,null,null,null,null,null,null,null,null,null,null,null,null,null,null,null,null,null,null,null,null,null,null,null,null,null,null,null,null,null,null,null,null,null,null,null,null,null,null,null,null,null,null,null,null,null,null,null,null,null,null,null,null,null,null,null,null,null,null,null,null,null,null,null,null,null,null,156]
[null,null,null,null,null,null,null,null,null,null,null,null,null,null,null,null,null,null,null,null,null,null,null,null,null,null,null,null,null,null,null,null,null,null,null,null,null,null,null,null,null,null,null,null,null,null,null,null,null,null,null,null,17,0,0,26]
[null,null,null,null,null,null,null,null,null,null,null,null,null,null,null,null,null,null,null,null,null,null,null,null,null,null,null,null,null,null,null,null,null,null,null,null,null,null,null,null,null,null,null,null,null,null,null,null,null,null,null,null,17,0,0,23,null,null,null,null,null,null,null,null,null,null,null,null,null,null,null,null,null,null,null,null,null,null,null,null,53,73]
[null,null,null,null,null,null,null,null,null,null,null,null,null,null,null,null,null,null,null,null,null,null,null,null,null,null,null,null,null,null,null,null,null,null,null,null,null,null,null,null,null,null,null,null,null,null,null,null,null,null,null,null,null,null,null,null,null,null,null,null,null,null,null,null,null,null,null,null,null,null,null,null,null,null,null,null,null,null,null,null,null,157]
[null,null,null,null,null,null,null,null,null,null,null,null,null,null,null,null,null,null,null,null,null,null,null,null,null,null,null,null,null,null,null,null,null,null,null,null,null,null,null,null,null,null,null,null,null,null,null,null,null,null,null,null,65,30,35,92]
[null,null,null,null,null,null,null,null,null,null,null,null,null,null,null,null,null,null,null,null,null,null,null,null,null,null,null,null,null,null,null,null,null,null,null,null,null,null,null,null,null,null,null,null,null,null,null,null,null,null,null,null,65,62,3,93,null,null,null,null,null,null,null,null,null,null,null,null,null,null,null,null,null,null,null,null,null,null,null,null,54,37]
[null,null,null,null,null,null,null,null,null,null,null,null,null,null,null,null,null,null,null,null,null,null,null,null,null,null,null,null,null,null,null,null,null,null,null,null,null,null,null,null,null,null,null,null,null,null,null,null,null,null,null,null,null,null,null,null,null,null,null,null,null,null,null,null,null,null,null,null,null,null,null,null,null,null,null,null,null,null,null,null,null,158]
[null,null,null,null,null,null,null,null,null,null,null,null,null,null,null,null,null,null,null,null,null,null,null,null,null,null,null,null,null,null,null,null,null,null,null,null,null,null,null,null,null,null,null,null,null,null,null,null,null,null,null,null,33,0,0,39]
[null,null,null,null,null,null,null,null,null,null,null,null,null,null,null,null,null,null,null,null,null,null,null,null,null,null,null,null,null,null,null,null,null,null,null,null,null,null,null,null,null,null,null,null,null,null,null,null,null,null,null,null,33,0,0,94,null,null,null,null,null,null,null,null,null,null,null,null,null,null,null,null,null,null,null,null,null,null,null,null,55,51]
[null,null,null,null,null,null,null,null,null,null,null,null,null,null,null,null,null,null,null,null,null,null,null,null,null,null,null,null,null,null,null,null,null,null,null,null,null,null,null,null,null,null,null,null,null,null,null,null,null,null,null,null,null,null,null,null,null,null,null,null,null,null,null,null,null,null,null,null,null,null,null,null,null,null,null,null,null,null,null,null,null,159]
[null,null,null,null,null,null,null,null,null,null,null,null,null,null,null,null,null,null,null,null,null,null,null,null,null,null,null,null,null,null,null,null,null,null,null,null,null,null,null,null,null,null,null,null,null,null,null,null,null,null,null,null,65,46,19,95]
[null,null,null,null,null,null,null,null,null,null,null,null,null,null,null,null,null,null,null,null,null,null,null,null,null,null,null,null,null,null,null,null,null,null,null,null,null,null,null,null,null,null,null,null,null,null,null,null,null,null,null,null,65,14,51,96,null,null,null,null,null,null,null,null,null,null,null,null,null,null,null,null,null,null,null,null,null,null,null,null,56,56]
[null,null,null,null,null,null,null,null,null,null,null,null,null,null,null,null,null,null,null,null,null,null,null,null,null,null,null,null,null,null,null,null,null,null,null,null,null,null,null,null,null,null,null,null,null,null,null,null,null,null,null,null,null,null,null,null,null,null,null,null,null,null,null,null,null,null,null,null,null,null,null,null,null,null,null,null,null,null,null,null,null,160]
[null,null,null,null,null,null,null,null,null,null,null,null,null,null,null,null,null,null,null,null,null,null,null,null,null,null,null,null,null,null,null,null,null,null,null,null,null,null,null,null,null,null,null,null,null,null,null,null,null,null,null,null,9,0,0,10]
[null,null,null,null,null,null,null,null,null,null,null,null,null,null,null,null,null,null,null,null,null,null,null,null,null,null,null,null,null,null,null,null,null,null,null,null,null,null,null,null,null,null,null,null,null,null,null,null,null,null,null,null,9,0,0,15,null,null,null,null,null,null,null,null,null,null,null,null,null,null,null,null,null,null,null,null,null,null,null,null,57,88]
[null,null,null,null,null,null,null,null,null,null,null,null,null,null,null,null,null,null,null,null,null,null,null,null,null,null,null,null,null,null,null,null,null,null,null,null,null,null,null,null,null,null,null,null,null,null,null,null,null,null,null,null,null,null,null,null,null,null,null,null,null,null,null,null,null,null,null,null,null,null,null,null,null,null,null,null,null,null,null,null,null,161]
[null,null,null,null,null,null,null,null,null,null,null,null,null,null,null,null,null,null,null,null,null,null,null,null,null,null,null,null,null,null,null,null,null,null,null,null,null,null,null,null,null,null,null,null,null,null,null,null,null,null,null,null,65,10,55,97]
[null,null,null,null,null,null,null,null,null,null,null,null,null,null,null,null,null,null,null,null,null,null,null,null,null,null,null,null,null,null,null,null,null,null,null,null,null,null,null,null,null,null,null,null,null,null,null,null,null,null,null,null,65,42,23,98,null,null,null,null,null,null,null,null,null,null,null,null,null,null,null,null,null,null,null,null,null,null,null,null,58,38]
[null,null,null,null,null,null,null,null,null,null,null,null,null,null,null,null,null,null,null,null,null,null,null,null,null,null,null,null,null,null,null,null,null,null,null,null,null,null,null,null,null,null,null,null,null,null,null,null,null,null,null,null,null,null,null,null,null,null,null,null,null,null,null,null,null,null,null,null,null,null,null,null,null,null,null,null,null,null,null,null,null,162]
[null,null,null,null,null,null,null,null,null,null,null,null,null,null,null,null,null,null,null,null,null,null,null,null,null,null,null,null,null,null,null,null,null,null,null,null,null,null,null,null,null,null,null,null,null,null,null,null,null,null,null,null,33,0,0,99]
[null,null,null,null,null,null,null,null,null,null,null,null,null,null,null,null,null,null,null,null,null,null,null,null,null,null,null,null,null,null,null,null,null,null,null,null,null,null,null,null,null,null,null,null,null,null,null,null,null,null,null,null,33,0,0,34,null,null,null,null,null,null,null,null,null,null,null,null,null,null,null,null,null,null,null,null,null,null,null,null,59,62]
[null,null,null,null,null,null,null,null,null,null,null,null,null,null,null,null,null,null,null,null,null,null,null,null,null,null,null,null,null,null,null,null,null,null,null,null,null,null,null,null,null,null,null,null,null,null,null,null,null,null,null,null,null,null,null,null,null,null,null,null,null,null,null,null,null,null,null,null,null,null,null,null,null,null,null,null,null,null,null,null,null,163]
[null,null,null,null,null,null,null,null,null,null,null,null,null,null,null,null,null,null,null,null,null,null,null,null,null,null,null,null,null,null,null,null,null,null,null,null,null,null,null,null,null,null,null,null,null,null,null,null,null,null,null,null,65,58,7,100]
[null,null,null,null,null,null,null,null,null,null,null,null,null,null,null,null,null,null,null,null,null,null,null,null,null,null,null,null,null,null,null,null,null,null,null,null,null,null,null,null,null,null,null,null,null,null,null,null,null,null,null,null,65,26,39,101,null,null,null,null,null,null,null,null,null,null,null,null,null,null,null,null,null,null,null,null,null,null,null,null,60,89]
[null,null,null,null,null,null,null,null,null,null,null,null,null,null,null,null,null,null,null,null,null,null,null,null,null,null,null,null,null,null,null,null,null,null,null,null,null,null,null,null,null,null,null,null,null,null,null,null,null,null,null,null,null,null,null,null,null,null,null,null,null,null,null,null,null,null,null,null,null,null,null,null,null,null,null,null,null,null,null,null,null,164]
[null,null,null,null,null,null,null,null,null,null,null,null,null,null,null,null,null,null,null,null,null,null,null,null,null,null,null,null,null,null,null,null,null,null,null,null,null,null,null,null,null,null,null,null,null,null,null,null,null,null,null,null,17,0,0,18]
[null,null,null,null,null,null,null,null,null,null,null,null,null,null,null,null,null,null,null,null,null,null,null,null,null,null,null,null,null,null,null,null,null,null,null,null,null,null,null,null,null,null,null,null,null,null,null,null,null,null,null,null,17,0,0,31,null,null,null,null,null,null,null,null,null,null,null,null,null,null,null,null,null,null,null,null,null,null,null,null,61,35]
[null,null,null,null,null,null,null,null,null,null,null,null,null,null,null,null,null,null,null,null,null,null,null,null,null,null,null,null,null,null,null,null,null,null,null,null,null,null,null,null,null,null,null,null,null,null,null,null,null,null,null,null,null,null,null,null,null,null,null,null,null,null,null,null,null,null,null,null,null,null,null,null,null,null,null,null,null,null,null,null,null,165]
[null,null,null,null,null,null,null,null,null,null,null,null,null,null,null,null,null,null,null,null,null,null,null,null,null,null,null,null,null,null,null,null,null,null,null,null,null,null,null,null,null,null,null,null,null,null,null,null,null,null,null,null,65,18,47,102]
[null,null,null,null,null,null,null,null,null,null,null,null,null,null,null,null,null,null,null,null,null,null,null,null,null,null,null,null,null,null,null,null,null,null,null,null,null,null,null,null,null,null,null,null,null,null,null,null,null,null,null,null,65,50,15,103,null,null,null,null,null,null,null,null,null,null,null,null,null,null,null,null,null,null,null,null,null,null,null,null,62,39]
[null,null,null,null,null,null,null,null,null,null,null,null,null,null,null,null,null,null,null,null,null,null,null,null,null,null,null,null,null,null,null,null,null,null,null,null,null,null,null,null,null,null,null,null,null,null,null,null,null,null,null,null,null,null,null,null,null,null,null,null,null,null,null,null,null,null,null,null,null,null,null,null,null,null,null,null,null,null,null,null,null,166]
[null,null,null,null,null,null,null,null,null,null,null,null,null,null,null,null,null,null,null,null,null,null,null,null,null,null,null,null,null,null,null,null,null,null,null,null,null,null,null,null,null,null,null,null,null,null,null,null,null,null,null,null,33,0,0,104]
[null,null,null,null,null,null,null,null,null,null,null,null,null,null,null,null,null,null,null,null,null,null,null,null,null,null,null,null,null,null,null,null,null,null,null,null,null,null,null,null,null,null,null,null,null,null,null,null,null,null,null,null,33,0,0,999,null,null,null,null,null,null,null,null,null,null,null,null,null,null,null,null,null,null,null,null,null,null,null,null,63,83]
[null,null,null,null,null,null,null,null,null,null,null,null,null,null,null,null,null,null,null,null,null,null,null,null,null,null,null,null,null,null,null,null,null,null,null,null,null,null,null,null,null,null,null,null,null,null,null,null,null,null,null,null,null,null,null,null,null,null,null,null,null,null,null,null,null,null,null,null,null,null,null,null,null,null,null,null,null,null,null,null,null,167]
[null,null,null,null,null,null,null,null,null,null,null,null,null,null,null,null,null,null,null,null,null,null,null,null,null,null,null,null,null,null,null,null,null,null,null,null,null,null,null,null,null,null,null,null,null,null,null,null,null,null,null,null,65,34,31,999]
[null,null,null,null,null,null,null,null,null,null,null,null,null,null,null,null,null,null,null,null,null,null,null,null,null,null,null,null,null,null,null,null,null,null,null,null,null,null,null,null,null,null,null,null,null,null,null,null,null,null,null,null,65,2,63,999,null,null,null,null,null,null,null,null,null,null,null,null,null,null,null,null,null,null,null,null,null,null,null,null,64,72]
[null,null,null,null,null,null,null,null,null,null,null,null,null,null,null,null,null,null,null,null,null,null,null,null,null,null,null,null,null,null,null,null,null,null,null,null,null,null,null,null,null,null,null,null,null,null,null,null,null,null,null,null,null,null,null,null,null,null,null,null,null,null,null,null,null,null,null,null,null,null,null,null,null,null,null,null,null,null,null,null,null,168]
[null,null,null,null,null,null,null,null,null,null,null,null,null,null,null,null,null,null,null,null,null,null,null,null,null,null,null,null,null,null,null,null,null,null,null,null,null,null,null,null,null,null,null,null,null,null,null,null,null,null,null,null,2,0,0,2]

{"sheet":"Kura","index":1,"n_rows":259,"n_cols":50,"rows_kept":259,"cut":false,"hidden":false,"merged":[[0,0,0,6],[1,0,1,6],[1,34,2,35]]}
["TÜRKİYE MASA TENİSİ FEDERASYONU\nKÜÇÜKLER FEDERASYON KUPASI",null,null,null,null,null,null,null,null,null,null,null,null,null,null,null,null,null,null,null,null,null,null,null,null,null,null,null,{"$f":"A1","v":"TÜRKİYE MASA TENİSİ FEDERASYONU\nKÜÇÜKLER FEDERASYON KUPASI"},null,null,null,null,null,null,null,null,null,null,null,null,null,null,null,null,null,null,"Eleme (128)",7,2]
["TEK KIZ [15-16 Nisan Amasya]",null,null,null,null,null,null,null,null,null,null,null,null,null,null,null,null,null,null,null,null,null,null,null,null,null,null,null,{"$f":"A2","v":"TEK KIZ [15-16 Nisan Amasya]"},null,null,null,null,null,null,null,null,null,null,null,null,null,null,null,null,null,null,"Eleme (64)",{"$f":"LOOKUP(AW1,{1,2,3,4,5,6},{128,64,32,16,8,128})","v":128}]
["No","Puan","Sporcu Adı","İl","Takım Adı","İl","D.Tarihi",null,null,null,null,null,null,null,null,null,null,null,null,null,null,null,null,null,null,null,null,null,"[ Ön Eleme ]","[ Eleme ]","[ Ana Tablo ]",null,null,null,null,null,null,null,null,null,null,null,null,null,null,null,null,"Eleme (32)"]
[1,360,"NİL BAŞARAN","İST","PENDİK BELEDİYESPOR","İSTANBUL","2010-09-26",null,null,null,null,null,null,null,null,null,null,null,null,null,null,null,null,null,null,{"$f":"IF(C4=\"\",0,C4&\" (\"&D4&\")\")","v":"NİL BAŞARAN (İST)"},null,null,null,null,null,null,null,null,null,null,null,null,null,null,null,null,null,null,null,null,null,"Eleme (16)"]
[2,291,"GÜLCE DÖNMEZ","KNY","SELÇUKLU BELEDİYE SPOR KULÜBÜ","KONYA","2010-02-05",null,null,null,null,null,null,null,null,null,null,null,null,null,null,null,null,null,null,"GÜLCE DÖNMEZ (KNY)",null,null,null,null,null,null,null,null,null,null,null,null,null,null,null,null,null,null,null,null,null,"Eleme (8)"]
[3,286,"ELİF ECE AKYÜREK","ADN","ÇİLTAR MTİ","ADANA","2010-07-01",null,0.22686600685119629,null,null,null,null,null,null,null,null,null,null,null,null,null,null,null,null,"ELİF ECE AKYÜREK (ADN)",null,null,null,null,null,null,null,null,null,null,null,null,null,null,null,null,null,null,null,null,null,"Eleme (128_Çift)"]
[4,279,"HATİCE ELİF GÜVELİ","İST","PENDİK BELEDİYESPOR","İSTANBUL","2010-01-28",null,0.2439313530921936,null,null,null,null,null,null,null,null,null,null,null,null,null,null,null,null,"HATİCE ELİF GÜVELİ (İST)",null,null,null,null,null,null,null,null,null,null,null,null,null,null,null,null,null,null,null,null,null,"Eleme (128_Çift16)"]
[5,273,"EYLÜL ŞEVVAL AYDIN","İST","PENDİK BELEDİYESPOR","İSTANBUL","2010-09-22",null,0.53387308120727539,null,null,null,null,null,null,null,null,null,null,null,null,null,null,null,null,"EYLÜL ŞEVVAL AYDIN (İST)"]
[6,261,"DURU KIRBAÇ","İST","PENDİK BELEDİYESPOR","İSTANBUL","2010-02-19",null,0.58916300535202026,null,null,null,null,null,null,null,null,null,null,null,null,null,null,null,null,"DURU KIRBAÇ (İST)"]
[7,250,"ZEYNEP ADA ER","ANK","AFAD SPOR KULUBÜ","ANKARA","27.02.2010",null,0.69511550664901733,null,null,null,null,null,null,null,null,null,null,null,null,null,null,null,null,"ZEYNEP ADA ER (ANK)"]
[8,247,"DURU ŞENDOĞAN","RİZ","ÇAYKUR RİZESPOR","RİZE","2010-09-03",null,0.91096431016921997,null,null,null,null,null,null,null,null,null,null,null,null,null,null,null,null,"DURU ŞENDOĞAN (RİZ)"]
[9,241,"ELİZAN BAŞAR","ANK","AFAD SPOR KULUBÜ","ANKARA","23.08.2010",null,0.30194801092147827,null,null,null,null,null,null,null,null,null,null,null,null,null,null,null,null,"ELİZAN BAŞAR (ANK)"]
[10,241,"BUSE KOÇAK","ANK","ŞAFAKTEPE GSK","ANKARA","2011-01-19",null,0.77474009990692139,null,null,null,null,null,null,null,null,null,null,null,null,null,null,null,null,"BUSE KOÇAK (ANK)"]
[11,238,"AYTEN CEREN KAHRAMAN","KYS","KOCASİNAN BELEDİYESİ SPOR","KAYSERİ","2011-02-16",null,null,null,null,null,null,null,null,null,null,null,null,null,null,null,null,null,null,"AYTEN CEREN KAHRAMAN (KYS)"]
[12,225,"ZEYNEP NAZ EKER","KRL","ZİRVE GSK","KIRKLARELİ","03.12.2010",null,null,null,null,null,null,null,null,null,null,null,null,null,null,null,null,null,null,"ZEYNEP NAZ EKER (KRL)"]
[13,224,"İPEK ERTUNA","ANK","AFAD SPOR KULUBÜ","ANKARA","11.02.2011",null,0.79048001766204834,null,null,null,null,null,null,null,null,null,null,null,null,null,null,null,null,"İPEK ERTUNA (ANK)"]
[14,224,"NEHİR DUYURAN","ANK","KARİYER EĞİTİM SPOR KULÜBÜ ","ANKARA","2010-07-18",null,0.86261934041976929,null,null,null,null,null,null,null,null,null,null,null,null,null,null,null,null,"NEHİR DUYURAN (ANK)"]
[15,220,"ÖZLEM KÖSEOĞLU","RİZ","ÇAYKUR RİZESPOR","RİZE","2010-04-22",null,null,null,null,null,null,null,null,null,null,null,null,null,null,null,null,null,null,"ÖZLEM KÖSEOĞLU (RİZ)"]
[16,219,"CEYLİN AKDANALI","ÇRM","GENÇLİKSPOR ","ÇORUM","03.02.2010",null,null,null,null,null,null,null,null,null,null,null,null,null,null,null,null,null,null,"CEYLİN AKDANALI (ÇRM)"]
[17,217,"ELA SU YÖNTER","ANK","ŞAFAKTEPE GSK","ANKARA","2012-02-21",null,null,null,null,null,null,null,null,null,null,null,null,null,null,null,null,null,null,"ELA SU YÖNTER (ANK)"]
[18,217,"MERVE MENGENE","RİZ","ÇAYKUR RİZESPOR","RİZE","2011-11-23",null,null,null,null,null,null,null,null,null,null,null,null,null,null,null,null,null,null,"MERVE MENGENE (RİZ)"]
[19,216,"NAZLI ŞAHAN","ÇRM","GENÇLİKSPOR ","ÇORUM","03.09.2010",null,0.22686600685119629,null,null,null,null,null,null,null,null,null,null,null,null,null,null,null,null,"NAZLI ŞAHAN (ÇRM)"]
[20,216,"MASAL ERYILMAZ","İST","GİRİŞİM SPOR KULÜBÜ","İSTANBUL","18.09.2011",null,0.2439313530921936,null,null,null,null,null,null,null,null,null,null,null,null,null,null,null,null,"MASAL ERYILMAZ (İST)"]
[21,216,"DİLAY BALABAN","RİZ","ÇAYKUR RİZESPOR","RİZE","2011-07-21",null,0.69511550664901733,null,null,null,null,null,null,null,null,null,null,null,null,null,null,null,null,"DİLAY BALABAN (RİZ)"]
[22,216,"IRMAK BÜŞRA UNCU","KST","KASTAMONU MASATENİSİ SK","KASTAMONU","2011-03-01",null,0.91096431016921997,null,null,null,null,null,null,null,null,null,null,null,null,null,null,null,null,"IRMAK BÜŞRA UNCU (KST)"]
[23,216,"DAMLA AVŞAR","VAN","GENÇLİK VE SPOR","VAN","2010-12-07",null,0.9800032377243042,null,null,null,null,null,null,null,null,null,null,null,null,null,null,null,null,"DAMLA AVŞAR (VAN)"]
[24,208,"NİSA ÜZÜMCÜ","BTM","1955 BATMAN BELEDİYE SPOR ","BATMAN","2012-01-24",null,0.32620620727539063,null,null,null,null,null,null,null,null,null,null,null,null,null,null,null,null,"NİSA ÜZÜMCÜ (BTM)"]
[25,208,"ESİLA SU YALÇIN","SKR","SAKARYA BÜYÜKŞEHİR BELEDİYE SPOR KULÜBÜ","SAKARYA","2011-08-03",null,0.41007322072982788,null,null,null,null,null,null,null,null,null,null,null,null,null,null,null,null,"ESİLA SU YALÇIN (SKR)"]
[26,208,"ELVİN KALE","YLV","YALOVA BLD. GENÇLİK SPOR","YALOVA","2011-10-20",null,0.41276681423187256,null,null,null,null,null,null,null,null,null,null,null,null,null,null,null,null,"ELVİN KALE (YLV)"]
[27,208,"ECEMSU ÇİÇEK","İZM","İZGEM SPOR","İZMİR","2011-08-05",null,0.64658713340759277,null,null,null,null,null,null,null,null,null,null,null,null,null,null,null,null,"ECEMSU ÇİÇEK (İZM)"]
[28,208,"AYŞE DURU DOĞAN","ANK","MASA-DER","ANKARA","2011-01-01",null,0.71273046731948853,null,null,null,null,null,null,null,null,null,null,null,null,null,null,null,null,"AYŞE DURU DOĞAN (ANK)"]
[29,203,"ZEYNEP DURAN","İST","FENERBAHÇE SPOR KULÜBÜ","İSTANBUL","2013-06-04",null,null,null,null,null,null,null,null,null,null,null,null,null,null,null,null,null,null,"ZEYNEP DURAN (İST)"]
[30,202,"ELİF ÇELİK","MLT","MALATYA B. ŞEH. BLD. SPOR","MALATYA","2012-06-12",null,8.0714643001556396E-2,null,null,null,null,null,null,null,null,null,null,null,null,null,null,null,null,"ELİF ÇELİK (MLT)"]
[31,202,"ARMİN AYDIN","İST","FENERBAHÇE SPOR KULÜBÜ","İSTANBUL","2012-01-23",null,0.45797145366668701,null,null,null,null,null,null,null,null,null,null,null,null,null,null,null,null,"ARMİN AYDIN (İST)"]
[32,148,"HATİCE RAVZA GÜLCE","KYS","SPOR A.Ş GENÇLİK VE S.K DERNEĞİ","KAYSERİ","2011-03-17",null,null,null,null,null,null,null,null,null,null,null,null,null,null,null,null,null,null,"HATİCE RAVZA GÜLCE (KYS)"]
[33,146,"EMİNE AYDINAY","BRS","BURSA BÜYÜKŞEHİR BELEDİYESPOR","BURSA ","2012-04-13",null,null,null,null,null,null,null,null,null,null,null,null,null,null,null,null,null,null,"EMİNE AYDINAY (BRS)"]
[34,144,"ELİF BEYZA AKDEMİR","BTM","1955 BATMAN BELEDİYE SPOR ","BATMAN","2011-03-22",null,null,null,null,null,null,null,null,null,null,null,null,null,null,null,null,null,null,"ELİF BEYZA AKDEMİR (BTM)"]
[35,143,"ESMA SULTAN SARI","SKR","SAKARYA BÜYÜKŞEHİR BELEDİYE SPOR KULÜBÜ","SAKARYA","2012-02-28",null,3.026425838470459E-2,null,null,null,null,null,null,null,null,null,null,null,null,null,null,null,null,"ESMA SULTAN SARI (SKR)"]
[36,142,"DURU BERİL TOK","YLV","YALOVA BELEDİYE G.S.K.","YALOVA","2012-03-07",null,3.2038450241088867E-2,null,null,null,null,null,null,null,null,null,null,null,null,null,null,null,null,"DURU BERİL TOK (YLV)"]
[37,135,"ESMA KAMER SÜT","KYS","SPOR A.Ş GENÇLİK VE S.K DERNEĞİ","KAYSERİ","2012-01-01",null,3.819197416305542E-2,null,null,null,null,null,null,null,null,null,null,null,null,null,null,null,null,"ESMA KAMER SÜT (KYS)"]
[38,129,"BERRA BAHTİYAR","SKR","SAKARYA BÜYÜKŞEHİR BELEDİYE SPOR KULÜBÜ","SAKARYA","2012-10-13",null,6.0976266860961914E-2,null,null,null,null,null,null,null,null,null,null,null,null,null,null,null,null,"BERRA BAHTİYAR (SKR)"]
[39,125,"ECRİN FİDAN","BRS","BURSA BÜYÜKŞEHİR BELEDİYESPOR","BURSA ","2012-07-28",null,0.28966504335403442,null,null,null,null,null,null,null,null,null,null,null,null,null,null,null,null,"ECRİN FİDAN (BRS)"]
[40,125,"AYÇA SAVAŞ","KST","KASTAMONU MASATENİSİ SK","KASTAMONU","2011-02-02",null,0.91937708854675293,null,null,null,null,null,null,null,null,null,null,null,null,null,null,null,null,"AYÇA SAVAŞ (KST)"]
[41,123,"ŞEVVAL ALAŞ","BTM","1955 BATMAN BELEDİYE SPOR ","BATMAN","2012-12-18",null,9.5585167407989502E-2,null,null,null,null,null,null,null,null,null,null,null,null,null,null,null,null,"ŞEVVAL ALAŞ (BTM)"]
[42,120,"FİRDEVSNUR BİNGÖL","YLV","YALOVA BLD. GENÇLİK SPOR","YALOVA","2012-01-01",null,0.11724323034286499,null,null,null,null,null,null,null,null,null,null,null,null,null,null,null,null,"FİRDEVSNUR BİNGÖL (YLV)"]
[43,119,"FATMANUR DEMİRCİ","KMŞ","GENÇLİK SPOR","K.MARAŞ","2011-04-09",null,0.13563632965087891,null,null,null,null,null,null,null,null,null,null,null,null,null,null,null,null,"FATMANUR DEMİRCİ (KMŞ)"]
[44,118,"MEDİNE İREM TÜRKAN","BTM","BATMAN GENÇLİK SPOR KULÜBÜ","BATMAN","2013-03-11",null,0.1376880407333374,null,null,null,null,null,null,null,null,null,null,null,null,null,null,null,null,"MEDİNE İREM TÜRKAN (BTM)"]
[45,117,"SÜEDA SİVAS","AMS","MESA SPOR KULÜBÜ","AMASYA","2012-01-22",null,0.83481717109680176,null,null,null,null,null,null,null,null,null,null,null,null,null,null,null,null,"SÜEDA SİVAS (AMS)"]
[46,117,"BERRA ARIKAN","ADN","ÇİLTAR MTİ","ADANA","2011-10-14",null,0.91371756792068481,null,null,null,null,null,null,null,null,null,null,null,null,null,null,null,null,"BERRA ARIKAN (ADN)"]
[47,108,"AYNUR CANGİR","BTM","1955 BATMAN BELEDİYE SPOR ","BATMAN","2011-11-15",null,0.17354333400726318,null,null,null,null,null,null,null,null,null,null,null,null,null,null,null,null,"AYNUR CANGİR (BTM)"]
[48,108,"ELİF KABAAHMETOĞLU","KST","KASTAMONU MASATENİSİ SK","KASTAMONU","2011-03-15",null,0.17439699172973633,null,null,null,null,null,null,null,null,null,null,null,null,null,null,null,null,"ELİF KABAAHMETOĞLU (KST)"]
[49,108,"TUANA GÜLER","KRL","TRAKER","KIRKLARELİ","2011-02-07",null,0.18710774183273315,null,null,null,null,null,null,null,null,null,null,null,null,null,null,null,null,"TUANA GÜLER (KRL)"]
[50,108,"ZEYNEP BERRA GÜLOĞLU","VAN","GENÇLİK VE SPOR","VAN","2011-01-02",null,6.0916244983673096E-2,null,null,null,null,null,null,null,null,null,null,null,null,null,null,null,null,"ZEYNEP BERRA GÜLOĞLU (VAN)"]
[51,null,"KAREN GÜRBÜZ","ADN","ÇİLTAR MTİ","ADANA","2011-03-16",null,0.24384516477584839,null,null,null,null,null,null,null,null,null,null,null,null,null,null,null,null,"KAREN GÜRBÜZ (ADN)"]
[52,"","HİLALSU SAĞLAM","VAN","GENÇLİK VE SPOR","VAN","2010-04-20",null,9.4184279441833496E-3,null,null,null,null,null,null,null,null,null,null,null,null,null,null,null,null,"HİLALSU SAĞLAM (VAN)"]
[53,"","KÜBRA YERLİKAYA","AMS","MESA SPOR KULÜBÜ","AMASYA","2010-12-06",null,1.4581799507141113E-2,null,null,null,null,null,null,null,null,null,null,null,null,null,null,null,null,"KÜBRA YERLİKAYA (AMS)"]
[54,"","İDİL TOSUN","ADN","ÇİLTAR MTİ","ADANA","2010-01-27",null,1.8808901309967041E-2,null,null,null,null,null,null,null,null,null,null,null,null,null,null,null,null,"İDİL TOSUN (ADN)"]
[55,"","ELİF ASYA HOCAOĞLU","RİZ","ÇAYKUR RİZESPOR","RİZE","2010-10-01",null,3.544008731842041E-2,null,null,null,null,null,null,null,null,null,null,null,null,null,null,null,null,"ELİF ASYA HOCAOĞLU (RİZ)"]
[56,"","MİRAÇ DENİZ AKAR","TKD","ÇERKEZKÖY BELEDİYESİ GENÇLİK VE SPOR KULÜBÜ ","TEKİRDAĞ","2011-06-29",null,4.2947709560394287E-2,null,null,null,null,null,null,null,null,null,null,null,null,null,null,null,null,"MİRAÇ DENİZ AKAR (TKD)"]
[57,"","ELANUR YILMAZ","BRS","BURSA BÜYÜKŞEHİR BELEDİYESPOR","BURSA ","2011-10-11",null,5.8991491794586182E-2,null,null,null,null,null,null,null,null,null,null,null,null,null,null,null,null,"ELANUR YILMAZ (BRS)"]
[58,"","ECRİN ZEYNEP ERCİYAS","ORD","ORDU GENÇLİK VE SPOR KULÜBÜ","ORDU","2011-08-05",null,5.961686372756958E-2,null,null,null,null,null,null,null,null,null,null,null,null,null,null,null,null,"ECRİN ZEYNEP ERCİYAS (ORD)"]
[59,"","MERYEM ECRİN ŞENTÜRK","KCL","B.B.KAĞITSPOR KULÜBÜ","KOCAELİ","2010-02-11",null,7.3634207248687744E-2,null,null,null,null,null,null,null,null,null,null,null,null,null,null,null,null,"MERYEM ECRİN ŞENTÜRK (KCL)"]
[60,"","NAZLISU OKKAN","KRL","GENCLİK SPOR KULÜBÜ KIRKLARELİ","KIRKLARELİ","2011-04-16",null,8.9153528213500977E-2,null,null,null,null,null,null,null,null,null,null,null,null,null,null,null,null,"NAZLISU OKKAN (KRL)"]
[61,"","ECE ECRİN MELEN","VAN","GENÇLİK VE SPOR","VAN","2010-06-07",null,0.15259981155395508,null,null,null,null,null,null,null,null,null,null,null,null,null,null,null,null,"ECE ECRİN MELEN (VAN)"]
[62,"","BERRA AKICI","SKR","SAKARYA BÜYÜKŞEHİR BELEDİYE SPOR KULÜBÜ","SAKARYA","2010-05-14",null,0.16294205188751221,null,null,null,null,null,null,null,null,null,null,null,null,null,null,null,null,"BERRA AKICI (SKR)"]
[63,"","ŞEVVAL CİMBEK","AMS","MESA SPOR KULÜBÜ","AMASYA","2011-07-01",null,0.18442481756210327,null,null,null,null,null,null,null,null,null,null,null,null,null,null,null,null,"ŞEVVAL CİMBEK (AMS)"]
[64,"","ECEM SUNA KALDIRIM","ANK","ANKARA GENÇLİK MERKEZLERİ GSKD","ANKARA","2010-05-18",null,0.20649856328964233,null,null,null,null,null,null,null,null,null,null,null,null,null,null,null,null,"ECEM SUNA KALDIRIM (ANK)"]
[65,"","RÜYA EMİR","SMS","YAKAKENT GENÇLİKGÜCÜ SK ","SAMSUN","2011-10-28",null,0.24331068992614746,null,null,null,null,null,null,null,null,null,null,null,null,null,null,null,null,{"$f":"IF(C68=\"\",0,C68&\" (\"&D68&\")\")","v":"RÜYA EMİR (SMS)"}]
[66,"","ASUDE AKSOY","GZT","GENÇLİK SPOR KULÜBÜ ","GAZİANTEP","2011-02-22",null,0.28355967998504639,null,null,null,null,null,null,null,null,null,null,null,null,null,null,null,null,"ASUDE AKSOY (GZT)"]
[67,"","BAHAR GÜL","ZNG","ÖZEL İDARE YOLSPOR","ZONGULDAK","2010-03-31",null,0.29329967498779297,null,null,null,null,null,null,null,null,null,null,null,null,null,null,null,null,"BAHAR GÜL (ZNG)"]
[68,"","BERİL ECE ÇARKÇI","ORD","ORDU GENÇLİK VE SPOR KULÜBÜ","ORDU","2010-11-10",null,0.31183719635009766,null,null,null,null,null,null,null,null,null,null,null,null,null,null,null,null,"BERİL ECE ÇARKÇI (ORD)"]
[69,"","AYŞE MELİS ÖZER","TKD","ÇERKEZKÖY BELEDİYESİ GENÇLİK VE SPOR KULÜBÜ ","TEKİRDAĞ","2011-09-10",null,0.32962536811828613,null,null,null,null,null,null,null,null,null,null,null,null,null,null,null,null,"AYŞE MELİS ÖZER (TKD)"]
[70,"","ECEM DEMİR","KRL","GENCLİK SPOR KULÜBÜ KIRKLARELİ","KIRKLARELİ","2011-08-11",null,0.34533506631851196,null,null,null,null,null,null,null,null,null,null,null,null,null,null,null,null,"ECEM DEMİR (KRL)"]
[71,"","İLGİ İPEK TUNÇ","ANK","KARİYER EĞİTİM SPOR KULÜBÜ ","ANKARA","2011-09-17",null,0.40574491024017334,null,null,null,null,null,null,null,null,null,null,null,null,null,null,null,null,"İLGİ İPEK TUNÇ (ANK)"]
[72,"","ÖZGE ARI","KRL","ZİRVE GSK","KIRKLARELİ","14.01.2011",null,0.42011135816574097,null,null,null,null,null,null,null,null,null,null,null,null,null,null,null,null,"ÖZGE ARI (KRL)"]
[73,"","ESLEM SENA ERCİYAS","ORD","ORDU GENÇLİK VE SPOR KULÜBÜ","ORDU","2011-06-30",null,0.43160009384155273,null,null,null,null,null,null,null,null,null,null,null,null,null,null,null,null,"ESLEM SENA ERCİYAS (ORD)"]
[74,"","EYLÜL KENANOĞLU","KST","KASTAMONU MASATENİSİ SK","KASTAMONU","2011-09-08",null,0.48348832130432129,null,null,null,null,null,null,null,null,null,null,null,null,null,null,null,null,"EYLÜL KENANOĞLU (KST)"]
[75,"","MİYASE ESLEM ÖZDEN","KNY","SELÇUKLU BELEDİYE SPOR KULÜBÜ","KONYA","2011-06-27",null,0.5176931619644165,null,null,null,null,null,null,null,null,null,null,null,null,null,null,null,null,"MİYASE ESLEM ÖZDEN (KNY)"]
[76,"","RÜMEYSA MAYDA","BRS","BURSA BÜYÜKŞEHİR BELEDİYESPOR","BURSA ","2011-09-16",null,0.5484238862991333,null,null,null,null,null,null,null,null,null,null,null,null,null,null,null,null,"RÜMEYSA MAYDA (BRS)"]
[77,"","CEREN KOÇAK","KYS","SPOR A.Ş GENÇLİK VE S.K DERNEĞİ","KAYSERİ","2011-06-15",null,0.5584447979927063,null,null,null,null,null,null,null,null,null,null,null,null,null,null,null,null,"CEREN KOÇAK (KYS)"]
[78,"","ESMA ÇUKUR","RİZ","ÇAYKUR RİZESPOR","RİZE","2011-12-16",null,0.57587391138076782,null,null,null,null,null,null,null,null,null,null,null,null,null,null,null,null,"ESMA ÇUKUR (RİZ)"]
[79,"","ELANUR ALAÇAM","AMS","AMASYA GENÇLİK VE SPOR","AMASYA","2010-04-22",null,0.59643775224685669,null,null,null,null,null,null,null,null,null,null,null,null,null,null,null,null,"ELANUR ALAÇAM (AMS)"]
[80,"","HAZAL ERSOY","AMS","KUTLUBEY OKULLARI SPOR KULÜBÜ","AMASYA","2010-01-15",null,0.6021040678024292,null,null,null,null,null,null,null,null,null,null,null,null,null,null,null,null,"HAZAL ERSOY (AMS)"]
[81,"","NEHİR GÖHER SALTÜRK","BRS","BURSA BÜYÜKŞEHİR BELEDİYESPOR","BURSA ","2011-09-28",null,0.60304373502731323,null,null,null,null,null,null,null,null,null,null,null,null,null,null,null,null,"NEHİR GÖHER SALTÜRK (BRS)"]
[82,"","NİSANUR AYTEN","VAN","GENÇLİK VE SPOR","VAN","2010-07-02",null,0.61507159471511841,null,null,null,null,null,null,null,null,null,null,null,null,null,null,null,null,"NİSANUR AYTEN (VAN)"]
[83,"","ELANUR DEMİR","İST","İSTANBUL BÜYÜKŞEHİR BELEDİYE","İSTANBUL","2010-12-29",null,0.65339726209640503,null,null,null,null,null,null,null,null,null,null,null,null,null,null,null,null,"ELANUR DEMİR (İST)"]
[84,"","NİSA GÜN","AMS","MESA SPOR KULÜBÜ","AMASYA","2012",null,0.66192418336868286,null,null,null,null,null,null,null,null,null,null,null,null,null,null,null,null,"NİSA GÜN (AMS)"]
[85,"","EBRAR NİSA TORU","AMS","KUTLUBEY OKULLARI SPOR KULÜBÜ","AMASYA","2010-04-20",null,0.68425178527832031,null,null,null,null,null,null,null,null,null,null,null,null,null,null,null,null,"EBRAR NİSA TORU (AMS)"]
[86,"","ELİF DURU BECER","ÇRM","GENÇLİKSPOR ","ÇORUM","26.01.2012",null,0.732524573802948,null,null,null,null,null,null,null,null,null,null,null,null,null,null,null,null,"ELİF DURU BECER (ÇRM)"]
[87,"","ZEYNEB KOÇ","ZNG","ÖZEL İDARE YOLSPOR","ZONGULDAK","2010-08-24",null,0.75857442617416382,null,null,null,null,null,null,null,null,null,null,null,null,null,null,null,null,"ZEYNEB KOÇ (ZNG)"]
[88,"","NAZLINUR AKGÜN","ANT","ANTALYASPOR","ANTALYA","2011-03-14",null,0.77007186412811279,null,null,null,null,null,null,null,null,null,null,null,null,null,null,null,null,"NAZLINUR AKGÜN (ANT)"]
[89,"","HİLAL ECEM MUSLU","ZNG","ÖZEL İDARE YOLSPOR","ZONGULDAK","2011-07-09",null,0.7810065746307373,null,null,null,null,null,null,null,null,null,null,null,null,null,null,null,null,"HİLAL ECEM MUSLU (ZNG)"]
[90,"","ASLINUR USLU","BRS","BURSA BÜYÜKŞEHİR BELEDİYESPOR","BURSA ","2010-02-03",null,0.79146403074264526,null,null,null,null,null,null,null,null,null,null,null,null,null,null,null,null,"ASLINUR USLU (BRS)"]
[91,"","ZEYNEP HÜMA YILMAZ","SMS","YAKAKENT GENÇLİKGÜCÜ SK ","SAMSUN"," 04. 02.2011",null,0.79417353868484497,null,null,null,null,null,null,null,null,null,null,null,null,null,null,null,null,"ZEYNEP HÜMA YILMAZ (SMS)"]
[92,"","AYSEL SENA GÜN","AMS","KUTLUBEY OKULLARI SPOR KULÜBÜ","AMASYA","2010-10-05",null,0.9088788628578186,null,null,null,null,null,null,null,null,null,null,null,null,null,null,null,null,"AYSEL SENA GÜN (AMS)"]
[93,"","BUSE NUR ÖNDER","BTM","BATMAN GENÇLİK SPOR KLÜBÜ","BATMAN","2010-12-15",null,0.9092983603477478,null,null,null,null,null,null,null,null,null,null,null,null,null,null,null,null,"BUSE NUR ÖNDER (BTM)"]
[94,"","NEVA NUR KALKAN","AMS","KUTLUBEY OKULLARI SPOR KULÜBÜ","AMASYA","2010-05-14",null,0.94528055191040039,null,null,null,null,null,null,null,null,null,null,null,null,null,null,null,null,"NEVA NUR KALKAN (AMS)"]
[95,"","BAHAR TUNÇOK","ANK","KARİYER EĞİTİM SPOR KULÜBÜ ","ANKARA","2011-06-01",null,0.95124757289886475,null,null,null,null,null,null,null,null,null,null,null,null,null,null,null,null,"BAHAR TUNÇOK (ANK)"]
[96,"","EDA TUNA","ANT","ANTALYASPOR","ANTALYA","2011-02-18",null,0.95359838008880615,null,null,null,null,null,null,null,null,null,null,null,null,null,null,null,null,"EDA TUNA (ANT)"]
[97,"","DEFNE DEMİR","ORD","ORDU GENÇLİK VE SPOR KULÜBÜ","ORDU","2011-11-16",null,0.96470904350280762,null,null,null,null,null,null,null,null,null,null,null,null,null,null,null,null,"DEFNE DEMİR (ORD)"]
[98,null,null,null,null,null,null,null,0.64092308282852173,null,null,null,null,null,null,null,null,null,null,null,null,null,null,null,null,0]
[99,null,null,null,null,null,null,null,0.64779531955718994,null,null,null,null,null,null,null,null,null,null,null,null,null,null,null,null,0]
[100,null,null,null,null,null,null,null,0.65417772531509399,null,null,null,null,null,null,null,null,null,null,null,null,null,null,null,null,0]
[101,null,null,null,null,null,null,null,0.67394924163818359,null,null,null,null,null,null,null,null,null,null,null,null,null,null,null,null,0]
[102,null,null,null,null,null,null,null,0.68710905313491821,null,null,null,null,null,null,null,null,null,null,null,null,null,null,null,null,0]
[103,null,null,null,null,null,null,null,0.70240634679794312,null,null,null,null,null,null,null,null,null,null,null,null,null,null,null,null,0]
[104,null,null,null,null,null,null,null,0.714927077293396,null,null,null,null,null,null,null,null,null,null,null,null,null,null,null,null,0]
[105,null,null,null,null,null,null,null,0.7198331356048584,null,null,null,null,null,null,null,null,null,null,null,null,null,null,null,null,0]
[106,null,null,null,null,null,null,null,0.74757301807403564,null,null,null,null,null,null,null,null,null,null,null,null,null,null,null,null,0]
[107,null,null,null,null,null,null,null,0.76001036167144775,null,null,null,null,null,null,null,null,null,null,null,null,null,null,null,null,0]
[108,null,null,null,null,null,null,null,0.76049232482910156,null,null,null,null,null,null,null,null,null,null,null,null,null,null,null,null,0]
[109,null,null,null,null,null,null,null,0.76703542470932007,null,null,null,null,null,null,null,null,null,null,null,null,null,null,null,null,0]
[110,null,null,null,null,null,null,null,0.76936984062194824,null,null,null,null,null,null,null,null,null,null,null,null,null,null,null,null,0]
[111,null,null,null,null,null,null,null,0.77159649133682251,null,null,null,null,null,null,null,null,null,null,null,null,null,null,null,null,0]
[112,null,null,null,null,null,null,null,0.79539734125137329,null,null,null,null,null,null,null,null,null,null,null,null,null,null,null,null,0]
[113,null,null,null,null,null,null,null,0.82767146825790405,null,null,null,null,null,null,null,null,null,null,null,null,null,null,null,null,0]
[114,null,null,null,null,null,null,null,0.83855807781219482,null,null,null,null,null,null,null,null,null,null,null,null,null,null,null,null,0]
[115,null,null,null,null,null,null,null,0.85230964422225952,null,null,null,null,null,null,null,null,null,null,null,null,null,null,null,null,0]
[116,null,null,null,null,null,null,null,0.89949065446853638,null,null,null,null,null,null,null,null,null,null,null,null,null,null,null,null,0]
[117,null,null,null,null,null,null,null,0.90199631452560425,null,null,null,null,null,null,null,null,null,null,null,null,null,null,null,null,0]
[118,null,null,null,null,null,null,null,0.96360516548156738,null,null,null,null,null,null,null,null,null,null,null,null,null,null,null,null,0]
[119,null,null,null,null,null,null,null,0.97196054458618164,null,null,null,null,null,null,null,null,null,null,null,null,null,null,null,null,0]
[120,null,null,null,null,null,null,null,0.97313100099563599,null,null,null,null,null,null,null,null,null,null,null,null,null,null,null,null,0]
[121,null,null,null,null,null,null,null,0.97893160581588745,null,null,null,null,null,null,null,null,null,null,null,null,null,null,null,null,0]
[122,null,null,null,null,null,null,null,null,null,null,null,null,null,null,null,null,null,null,null,null,null,null,null,null,0]
[123,null,null,null,null,null,null,null,null,null,null,null,null,null,null,null,null,null,null,null,null,null,null,null,null,0]
[124,null,null,null,null,null,null,null,null,null,null,null,null,null,null,null,null,null,null,null,null,null,null,null,null,0]
[125,null,null,null,null,null,null,null,null,null,null,null,null,null,null,null,null,null,null,null,null,null,null,null,null,0]
[126,null,null,null,null,null,null,null,null,null,null,null,null,null,null,null,null,null,null,null,null,null,null,null,null,0]
[127,null,null,null,null,null,null,null,null,null,null,null,null,null,null,null,null,null,null,null,null,null,null,null,null,0]
[128,null,null,null,null,null,null,null,null,null,null,null,null,null,null,null,null,null,null,null,null,null,null,null,null,0]
[129,null,null,null,null,null,null,null,null,null,null,null,null,null,null,null,null,null,null,null,null,null,null,null,null,{"$f":"IF(C132=\"\",0,C132&\" (\"&D132&\")\")","v":0}]
[130,null,null,null,null,null,null,null,null,null,null,null,null,null,null,null,null,null,null,null,null,null,null,null,null,0]
[131,null,null,null,null,null,null,null,null,null,null,null,null,null,null,null,null,null,null,null,null,null,null,null,null,0]
[132,null,null,null,null,null,null,null,null,null,null,null,null,null,null,null,null,null,null,null,null,null,null,null,null,0]
[133,null,null,null,null,null,null,null,null,null,null,null,null,null,null,null,null,null,null,null,null,null,null,null,null,0]
[134,null,null,null,null,null,null,null,null,null,null,null,null,null,null,null,null,null,null,null,null,null,null,null,null,0]
[135,null,null,null,null,null,null,null,null,null,null,null,null,null,null,null,null,null,null,null,null,null,null,null,null,0]
[136,null,null,null,null,null,null,null,null,null,null,null,null,null,null,null,null,null,null,null,null,null,null,null,null,0]
[137,null,null,null,null,null,null,null,null,null,null,null,null,null,null,null,null,null,null,null,null,null,null,null,null,0]
[138,null,null,null,null,null,null,null,null,null,null,null,null,null,null,null,null,null,null,null,null,null,null,null,null,0]
[139,null,null,null,null,null,null,null,null,null,null,null,null,null,null,null,null,null,null,null,null,null,null,null,null,0]
[140,null,null,null,null,null,null,null,null,null,null,null,null,null,null,null,null,null,null,null,null,null,null,null,null,0]
[141,null,null,null,null,null,null,null,null,null,null,null,null,null,null,null,null,null,null,null,null,null,null,null,null,0]
[142,null,null,null,null,null,null,null,null,null,null,null,null,null,null,null,null,null,null,null,null,null,null,null,null,0]
[143,null,null,null,null,null,null,null,null,null,null,null,null,null,null,null,null,null,null,null,null,null,null,null,null,0]
[144,null,null,null,null,null,null,null,null,null,null,null,null,null,null,null,null,null,null,null,null,null,null,null,null,0]
[145,null,null,null,null,null,null,null,null,null,null,null,null,null,null,null,null,null,null,null,null,null,null,null,null,0]
[146,null,null,null,null,null,null,null,null,null,null,null,null,null,null,null,null,null,null,null,null,null,null,null,null,0]
[147,null,null,null,null,null,null,null,null,null,null,null,null,null,null,null,null,null,null,null,null,null,null,null,null,0]
[148,null,null,null,null,null,null,null,null,null,null,null,null,null,null,null,null,null,null,null,null,null,null,null,null,0]
[149,null,null,null,null,null,null,null,null,null,null,null,null,null,null,null,null,null,null,null,null,null,null,null,null,0]
[150,null,null,null,null,null,null,null,null,null,null,null,null,null,null,null,null,null,null,null,null,null,null,null,null,0]
[151,null,null,null,null,null,null,null,null,null,null,null,null,null,null,null,null,null,null,null,null,null,null,null,null,0]
[152,null,null,null,null,null,null,null,null,null,null,null,null,null,null,null,null,null,null,null,null,null,null,null,null,0]
[153,null,null,null,null,null,null,null,null,null,null,null,null,null,null,null,null,null,null,null,null,null,null,null,null,0]
[154,null,null,null,null,null,null,null,null,null,null,null,null,null,null,null,null,null,null,null,null,null,null,null,null,0]
[155,null,null,null,null,null,null,null,null,null,null,null,null,null,null,null,null,null,null,null,null,null,null,null,null,0]
[156,null,null,null,null,null,null,null,null,null,null,null,null,null,null,null,null,null,null,null,null,null,null,null,null,0]
[157,null,null,null,null,null,null,null,null,null,null,null,null,null,null,null,null,null,null,null,null,null,null,null,null,0]
[158,null,null,null,null,null,null,null,null,null,null,null,null,null,null,null,null,null,null,null,null,null,null,null,null,0]
[159,null,null,null,null,null,null,null,null,null,null,null,null,null,null,null,null,null,null,null,null,null,null,null,null,0]
[160,null,null,null,null,null,null,null,null,null,null,null,null,null,null,null,null,null,null,null,null,null,null,null,null,0]
[161,null,null,null,null,null,null,null,null,null,null,null,null,null,null,null,null,null,null,null,null,null,null,null,null,0]
[162,null,null,null,null,null,null,null,null,null,null,null,null,null,null,null,null,null,null,null,null,null,null,null,null,0]
[163,null,null,null,null,null,null,null,null,null,null,null,null,null,null,null,null,null,null,null,null,null,null,null,null,0]
[164,null,null,null,null,null,null,null,null,null,null,null,null,null,null,null,null,null,null,null,null,null,null,null,null,0]
[165,null,null,null,null,null,null,null,null,null,null,null,null,null,null,null,null,null,null,null,null,null,null,null,null,0]
[166,null,null,null,null,null,null,null,null,null,null,null,null,null,null,null,null,null,null,null,null,null,null,null,null,0]
[167,null,null,null,null,null,null,null,null,null,null,null,null,null,null,null,null,null,null,null,null,null,null,null,null,0]
[168,null,null,null,null,null,null,null,null,null,null,null,null,null,null,null,null,null,null,null,null,null,null,null,null,0]
[169,null,null,null,null,null,null,null,null,null,null,null,null,null,null,null,null,null,null,null,null,null,null,null,null,0]
[170,null,null,null,null,null,null,null,null,null,null,null,null,null,null,null,null,null,null,null,null,null,null,null,null,0]
[171,null,null,null,null,null,null,null,null,null,null,null,null,null,null,null,null,null,null,null,null,null,null,null,null,0]
[172,null,null,null,null,null,null,null,null,null,null,null,null,null,null,null,null,null,null,null,null,null,null,null,null,0]
[173,null,null,null,null,null,null,null,null,null,null,null,null,null,null,null,null,null,null,null,null,null,null,null,null,0]
[174,null,null,null,null,null,null,null,null,null,null,null,null,null,null,null,null,null,null,null,null,null,null,null,null,0]
[175,null,null,null,null,null,null,null,null,null,null,null,null,null,null,null,null,null,null,null,null,null,null,null,null,0]
[176,null,null,null,null,null,null,null,null,null,null,null,null,null,null,null,null,null,null,null,null,null,null,null,null,0]
[177,null,null,null,null,null,null,null,null,null,null,null,null,null,null,null,null,null,null,null,null,null,null,null,null,0]
[178,null,null,null,null,null,null,null,null,null,null,null,null,null,null,null,null,null,null,null,null,null,null,null,null,0]
[179,null,null,null,null,null,null,null,null,null,null,null,null,null,null,null,null,null,null,null,null,null,null,null,null,0]
[180,null,null,null,null,null,null,null,null,null,null,null,null,null,null,null,null,null,null,null,null,null,null,null,null,0]
[181,null,null,null,null,null,null,null,null,null,null,null,null,null,null,null,null,null,null,null,null,null,null,null,null,0]
[182,null,null,null,null,null,null,null,null,null,null,null,null,null,null,null,null,null,null,null,null,null,null,null,null,0]
[183,null,null,null,null,null,null,null,null,null,null,null,null,null,null,null,null,null,null,null,null,null,null,null,null,0]
[184,null,null,null,null,null,null,null,null,null,null,null,null,null,null,null,null,null,null,null,null,null,null,null,null,0]
[185,null,null,null,null,null,null,null,null,null,null,null,null,null,null,null,null,null,null,null,null,null,null,null,null,0]
[186,null,null,null,null,null,null,null,null,null,null,null,null,null,null,null,null,null,null,null,null,null,null,null,null,0]
[187,null,null,null,null,null,null,null,null,null,null,null,null,null,null,null,null,null,null,null,null,null,null,null,null,0]
[188,null,null,null,null,null,null,null,null,null,null,null,null,null,null,null,null,null,null,null,null,null,null,null,null,0]
[189,null,null,null,null,null,null,null,null,null,null,null,null,null,null,null,null,null,null,null,null,null,null,null,null,0]
[190,null,null,null,null,null,null,null,null,null,null,null,null,null,null,null,null,null,null,null,null,null,null,null,null,0]
[191,null,null,null,null,null,null,null,null,null,null,null,null,null,null,null,null,null,null,null,null,null,null,null,null,0]
[192,null,null,null,null,null,null,null,null,null,null,null,null,null,null,null,null,null,null,null,null,null,null,null,null,0]
[193,null,null,null,null,null,null,null,null,null,null,null,null,null,null,null,null,null,null,null,null,null,null,null,null,{"$f":"IF(C196=\"\",0,C196&\" (\"&D196&\")\")","v":0}]
[194,null,null,null,null,null,null,null,null,null,null,null,null,null,null,null,null,null,null,null,null,null,null,null,null,0]
[195,null,null,null,null,null,null,null,null,null,null,null,null,null,null,null,null,null,null,null,null,null,null,null,null,0]
[196,null,null,null,null,null,null,null,null,null,null,null,null,null,null,null,null,null,null,null,null,null,null,null,null,0]
[197,null,null,null,null,null,null,null,null,null,null,null,null,null,null,null,null,null,null,null,null,null,null,null,null,0]
[198,null,null,null,null,null,null,null,null,null,null,null,null,null,null,null,null,null,null,null,null,null,null,null,null,0]
[199,null,null,null,null,null,null,null,null,null,null,null,null,null,null,null,null,null,null,null,null,null,null,null,null,0]
[200,null,null,null,null,null,null,null,null,null,null,null,null,null,null,null,null,null,null,null,null,null,null,null,null,0]
[201,null,null,null,null,null,null,null,null,null,null,null,null,null,null,null,null,null,null,null,null,null,null,null,null,0]
[202,null,null,null,null,null,null,null,null,null,null,null,null,null,null,null,null,null,null,null,null,null,null,null,null,0]
[203,null,null,null,null,null,null,null,null,null,null,null,null,null,null,null,null,null,null,null,null,null,null,null,null,0]
[204,null,null,null,null,null,null,null,null,null,null,null,null,null,null,null,null,null,null,null,null,null,null,null,null,0]
[205,null,null,null,null,null,null,null,null,null,null,null,null,null,null,null,null,null,null,null,null,null,null,null,null,0]
[206,null,null,null,null,null,null,null,null,null,null,null,null,null,null,null,null,null,null,null,null,null,null,null,null,0]
[207,null,null,null,null,null,null,null,null,null,null,null,null,null,null,null,null,null,null,null,null,null,null,null,null,0]
[208,null,null,null,null,null,null,null,null,null,null,null,null,null,null,null,null,null,null,null,null,null,null,null,null,0]
[209,null,null,null,null,null,null,null,null,null,null,null,null,null,null,null,null,null,null,null,null,null,null,null,null,0]
[210,null,null,null,null,null,null,null,null,null,null,null,null,null,null,null,null,null,null,null,null,null,null,null,null,0]
[211,null,null,null,null,null,null,null,null,null,null,null,null,null,null,null,null,null,null,null,null,null,null,null,null,0]
[212,null,null,null,null,null,null,null,null,null,null,null,null,null,null,null,null,null,null,null,null,null,null,null,null,0]
[213,null,null,null,null,null,null,null,null,null,null,null,null,null,null,null,null,null,null,null,null,null,null,null,null,0]
[214,null,null,null,null,null,null,null,null,null,null,null,null,null,null,null,null,null,null,null,null,null,null,null,null,0]
[215,null,null,null,null,null,null,null,null,null,null,null,null,null,null,null,null,null,null,null,null,null,null,null,null,0]
[216,null,null,null,null,null,null,null,null,null,null,null,null,null,null,null,null,null,null,null,null,null,null,null,null,0]
[217,null,null,null,null,null,null,null,null,null,null,null,null,null,null,null,null,null,null,null,null,null,null,null,null,0]
[218,null,null,null,null,null,null,null,null,null,null,null,null,null,null,null,null,null,null,null,null,null,null,null,null,0]
[219,null,null,null,null,null,null,null,null,null,null,null,null,null,null,null,null,null,null,null,null,null,null,null,null,0]
[220,null,null,null,null,null,null,null,null,null,null,null,null,null,null,null,null,null,null,null,null,null,null,null,null,0]
[221,null,null,null,null,null,null,null,null,null,null,null,null,null,null,null,null,null,null,null,null,null,null,null,null,0]
[222,null,null,null,null,null,null,null,null,null,null,null,null,null,null,null,null,null,null,null,null,null,null,null,null,0]
[223,null,null,null,null,null,null,null,null,null,null,null,null,null,null,null,null,null,null,null,null,null,null,null,null,0]
[224,null,null,null,null,null,null,null,null,null,null,null,null,null,null,null,null,null,null,null,null,null,null,null,null,0]
[225,null,null,null,null,null,null,null,null,null,null,null,null,null,null,null,null,null,null,null,null,null,null,null,null,0]
[226,null,null,null,null,null,null,null,null,null,null,null,null,null,null,null,null,null,null,null,null,null,null,null,null,0]
[227,null,null,null,null,null,null,null,null,null,null,null,null,null,null,null,null,null,null,null,null,null,null,null,null,0]
[228,null,null,null,null,null,null,null,null,null,null,null,null,null,null,null,null,null,null,null,null,null,null,null,null,0]
[229,null,null,null,null,null,null,null,null,null,null,null,null,null,null,null,null,null,null,null,null,null,null,null,null,0]
[230,null,null,null,null,null,null,null,null,null,null,null,null,null,null,null,null,null,null,null,null,null,null,null,null,0]
[231,null,null,null,null,null,null,null,null,null,null,null,null,null,null,null,null,null,null,null,null,null,null,null,null,0]
[232,null,null,null,null,null,null,null,null,null,null,null,null,null,null,null,null,null,null,null,null,null,null,null,null,0]
[233,null,null,null,null,null,null,null,null,null,null,null,null,null,null,null,null,null,null,null,null,null,null,null,null,0]
[234,null,null,null,null,null,null,null,null,null,null,null,null,null,null,null,null,null,null,null,null,null,null,null,null,0]
[235,null,null,null,null,null,null,null,null,null,null,null,null,null,null,null,null,null,null,null,null,null,null,null,null,0]
[236,null,null,null,null,null,null,null,null,null,null,null,null,null,null,null,null,null,null,null,null,null,null,null,null,0]
[237,null,null,null,null,null,null,null,null,null,null,null,null,null,null,null,null,null,null,null,null,null,null,null,null,0]
[238,null,null,null,null,null,null,null,null,null,null,null,null,null,null,null,null,null,null,null,null,null,null,null,null,0]
[239,null,null,null,null,null,null,null,null,null,null,null,null,null,null,null,null,null,null,null,null,null,null,null,null,0]
[240,null,null,null,null,null,null,null,null,null,null,null,null,null,null,null,null,null,null,null,null,null,null,null,null,0]
[241,null,null,null,null,null,null,null,null,null,null,null,null,null,null,null,null,null,null,null,null,null,null,null,null,0]
[242,null,null,null,null,null,null,null,null,null,null,null,null,null,null,null,null,null,null,null,null,null,null,null,null,0]
[243,null,null,null,null,null,null,null,null,null,null,null,null,null,null,null,null,null,null,null,null,null,null,null,null,0]
[244,null,null,null,null,null,null,null,null,null,null,null,null,null,null,null,null,null,null,null,null,null,null,null,null,0]
[245,null,null,null,null,null,null,null,null,null,null,null,null,null,null,null,null,null,null,null,null,null,null,null,null,0]
[246,null,null,null,null,null,null,null,null,null,null,null,null,null,null,null,null,null,null,null,null,null,null,null,null,0]
[247,null,null,null,null,null,null,null,null,null,null,null,null,null,null,null,null,null,null,null,null,null,null,null,null,0]
[248,null,null,null,null,null,null,null,null,null,null,null,null,null,null,null,null,null,null,null,null,null,null,null,null,0]
[249,null,null,null,null,null,null,null,null,null,null,null,null,null,null,null,null,null,null,null,null,null,null,null,null,0]
[250,null,null,null,null,null,null,null,null,null,null,null,null,null,null,null,null,null,null,null,null,null,null,null,null,0]
[251,null,null,null,null,null,null,null,null,null,null,null,null,null,null,null,null,null,null,null,null,null,null,null,null,0]
[252,null,null,null,null,null,null,null,null,null,null,null,null,null,null,null,null,null,null,null,null,null,null,null,null,0]
[253,null,null,null,null,null,null,null,null,null,null,null,null,null,null,null,null,null,null,null,null,null,null,null,null,0]
[254,null,null,null,null,null,null,null,null,null,null,null,null,null,null,null,null,null,null,null,null,null,null,null,null,0]
[255,null,null,null,null,null,null,null,null,null,null,null,null,null,null,null,null,null,null,null,null,null,null,null,null,0]
[256,null,null,null,null,null,null,null,null,null,null,null,null,null,null,null,null,null,null,null,null,null,null,null,null,0]

{"sheet":"On_Eleme","index":2,"n_rows":195,"n_cols":29,"rows_kept":195,"cut":false,"hidden":false,"merged":[[0,4,1,6],[2,4,2,6]]}
[null,null,null,null,{"$f":"Kura!AC1","v":"TÜRKİYE MASA TENİSİ FEDERASYONU\nKÜÇÜKLER FEDERASYON KUPASI"},null,null,null,null,null,null,null,null,null,null,null,null,null,null,null,null,null,null,null,null,null,4,null,{"$f":"SUM(AA5:AA500)","v":0}]
[]
[null,null,null,null,{"$f":"Kura!A2&\" \"&Kura!AC3","v":"TEK KIZ [15-16 Nisan Amasya] [ Ön Eleme ]"}]
[null,null,null,null,"Sporcu","Skor","Galip",null,"Külüp Adı",null,null,"Eleme tablosu ilk turda denk gelip gelmediğinin kontrolü yapılır"]
[1,"E1",84,null,{"$f":"IFERROR(VLOOKUP(C5,Kura!$A$4:$Z$301,26,0),0)","v":"NİSA GÜN (AMS)"},null,{"$f":"IF(AND(F5=0,F6=0),\"\",IF(F5>F6,E5,E6))","v":""},null,{"$f":"IFERROR(VLOOKUP(C5,Kura!$A$4:$G$301,5,0),0)","v":"MESA SPOR KULÜBÜ"},null,null,"E1",1,{"$f":"OFFSET(Sablon!$CL$1,M5,Kura!$AW$1)","v":38},{"$f":"IFERROR(VLOOKUP(N5,Kura!$A$4:$Z$301,26,0),0)","v":"BERRA BAHTİYAR (SKR)"},{"$f":"IFERROR(VLOOKUP(N5,Kura!$A$4:$G$301,5,0),0)","v":"SAKARYA BÜYÜKŞEHİR BELEDİYE SPOR KULÜBÜ"},null,null,null,null,null,null,null,null,null,null,{"$f":"IF(AND(E5<>0,E6<>0),1,0)","v":0}]
["1.1",null,105,null,{"$f":"IFERROR(VLOOKUP(C6,Kura!$A$4:$Z$301,26,0),0)","v":0},null,null,null,{"$f":"IFERROR(VLOOKUP(C6,Kura!$A$4:$G$301,5,0),0)","v":0}]
[]
[2,"E2",61,null,{"$f":"IFERROR(VLOOKUP(C8,Kura!$A$4:$Z$301,26,0),0)","v":"ECE ECRİN MELEN (VAN)"},null,{"$f":"IF(AND(F8=0,F9=0),\"\",IF(F8>F9,E8,E9))","v":""},null,{"$f":"IFERROR(VLOOKUP(C8,Kura!$A$4:$G$301,5,0),0)","v":"GENÇLİK VE SPOR"},null,null,"E2",2,{"$f":"OFFSET(Sablon!$CL$1,M8,Kura!$AW$1)","v":37},{"$f":"IFERROR(VLOOKUP(N8,Kura!$A$4:$Z$301,26,0),0)","v":"ESMA KAMER SÜT (KYS)"},{"$f":"IFERROR(VLOOKUP(N8,Kura!$A$4:$G$301,5,0),0)","v":"SPOR A.Ş GENÇLİK VE S.K DERNEĞİ"},null,null,null,null,null,null,null,null,null,null,{"$f":"IF(AND(E8<>0,E9<>0),1,0)","v":0}]
["2.2",null,106,null,{"$f":"IFERROR(VLOOKUP(C9,Kura!$A$4:$Z$301,26,0),0)","v":0},null,null,null,{"$f":"IFERROR(VLOOKUP(C9,Kura!$A$4:$G$301,5,0),0)","v":0}]
[]
[3,"E3",93,null,{"$f":"IFERROR(VLOOKUP(C11,Kura!$A$4:$Z$301,26,0),0)","v":"BUSE NUR ÖNDER (BTM)"},null,{"$f":"IF(AND(F11=0,F12=0),\"\",IF(F11>F12,E11,E12))","v":""},null,{"$f":"IFERROR(VLOOKUP(C11,Kura!$A$4:$G$301,5,0),0)","v":"BATMAN GENÇLİK SPOR KLÜBÜ"},null,null,"E3",3,{"$f":"OFFSET(Sablon!$CL$1,M11,Kura!$AW$1)","v":39},{"$f":"IFERROR(VLOOKUP(N11,Kura!$A$4:$Z$301,26,0),0)","v":"ECRİN FİDAN (BRS)"},{"$f":"IFERROR(VLOOKUP(N11,Kura!$A$4:$G$301,5,0),0)","v":"BURSA BÜYÜKŞEHİR BELEDİYESPOR"},null,null,null,null,null,null,null,null,null,null,0]
["3.3",null,107,null,{"$f":"IFERROR(VLOOKUP(C12,Kura!$A$4:$Z$301,26,0),0)","v":0},null,null,null,{"$f":"IFERROR(VLOOKUP(C12,Kura!$A$4:$G$301,5,0),0)","v":0}]
[]
[4,"E4",52,null,{"$f":"IFERROR(VLOOKUP(C14,Kura!$A$4:$Z$301,26,0),0)","v":"HİLALSU SAĞLAM (VAN)"},null,{"$f":"IF(AND(F14=0,F15=0),\"\",IF(F14>F15,E14,E15))","v":""},null,{"$f":"IFERROR(VLOOKUP(C14,Kura!$A$4:$G$301,5,0),0)","v":"GENÇLİK VE SPOR"},null,null,"E4",4,{"$f":"OFFSET(Sablon!$CL$1,M14,Kura!$AW$1)","v":40},{"$f":"IFERROR(VLOOKUP(N14,Kura!$A$4:$Z$301,26,0),0)","v":"AYÇA SAVAŞ (KST)"},{"$f":"IFERROR(VLOOKUP(N14,Kura!$A$4:$G$301,5,0),0)","v":"KASTAMONU MASATENİSİ SK"},null,null,null,null,null,null,null,null,null,null,0]
["4.4",null,108,null,{"$f":"IFERROR(VLOOKUP(C15,Kura!$A$4:$Z$301,26,0),0)","v":0},null,null,null,{"$f":"IFERROR(VLOOKUP(C15,Kura!$A$4:$G$301,5,0),0)","v":0}]
[]
[5,"E5",77,null,{"$f":"IFERROR(VLOOKUP(C17,Kura!$A$4:$Z$301,26,0),0)","v":"CEREN KOÇAK (KYS)"},null,{"$f":"IF(AND(F17=0,F18=0),\"\",IF(F17>F18,E17,E18))","v":""},null,{"$f":"IFERROR(VLOOKUP(C17,Kura!$A$4:$G$301,5,0),0)","v":"SPOR A.Ş GENÇLİK VE S.K DERNEĞİ"},null,null,"E5",5,{"$f":"OFFSET(Sablon!$CL$1,M17,Kura!$AW$1)","v":35},{"$f":"IFERROR(VLOOKUP(N17,Kura!$A$4:$Z$301,26,0),0)","v":"ESMA SULTAN SARI (SKR)"},{"$f":"IFERROR(VLOOKUP(N17,Kura!$A$4:$G$301,5,0),0)","v":"SAKARYA BÜYÜKŞEHİR BELEDİYE SPOR KULÜBÜ"},null,null,null,null,null,null,null,null,null,null,0]
["5.5",null,109,null,{"$f":"IFERROR(VLOOKUP(C18,Kura!$A$4:$Z$301,26,0),0)","v":0},null,null,null,{"$f":"IFERROR(VLOOKUP(C18,Kura!$A$4:$G$301,5,0),0)","v":0}]
[]
[6,"E6",68,null,{"$f":"IFERROR(VLOOKUP(C20,Kura!$A$4:$Z$301,26,0),0)","v":"BERİL ECE ÇARKÇI (ORD)"},null,{"$f":"IF(AND(F20=0,F21=0),\"\",IF(F20>F21,E20,E21))","v":""},null,{"$f":"IFERROR(VLOOKUP(C20,Kura!$A$4:$G$301,5,0),0)","v":"ORDU GENÇLİK VE SPOR KULÜBÜ"},null,null,"E6",6,{"$f":"OFFSET(Sablon!$CL$1,M20,Kura!$AW$1)","v":36},{"$f":"IFERROR(VLOOKUP(N20,Kura!$A$4:$Z$301,26,0),0)","v":"DURU BERİL TOK (YLV)"},{"$f":"IFERROR(VLOOKUP(N20,Kura!$A$4:$G$301,5,0),0)","v":"YALOVA BELEDİYE G.S.K."},null,null,null,null,null,null,null,null,null,null,0]
["6.6",null,110,null,{"$f":"IFERROR(VLOOKUP(C21,Kura!$A$4:$Z$301,26,0),0)","v":0},null,null,null,{"$f":"IFERROR(VLOOKUP(C21,Kura!$A$4:$G$301,5,0),0)","v":0}]
[]
[7,"E7",100,null,{"$f":"IFERROR(VLOOKUP(C23,Kura!$A$4:$Z$301,26,0),0)","v":0},null,{"$f":"IF(AND(F23=0,F24=0),\"\",IF(F23>F24,E23,E24))","v":""},null,{"$f":"IFERROR(VLOOKUP(C23,Kura!$A$4:$G$301,5,0),0)","v":0},null,null,"E7",7,{"$f":"OFFSET(Sablon!$CL$1,M23,Kura!$AW$1)","v":34},{"$f":"IFERROR(VLOOKUP(N23,Kura!$A$4:$Z$301,26,0),0)","v":"ELİF BEYZA AKDEMİR (BTM)"},{"$f":"IFERROR(VLOOKUP(N23,Kura!$A$4:$G$301,5,0),0)","v":"1955 BATMAN BELEDİYE SPOR "},null,null,null,null,null,null,null,null,null,null,0]
["7.7",null,111,null,{"$f":"IFERROR(VLOOKUP(C24,Kura!$A$4:$Z$301,26,0),0)","v":0},null,null,null,{"$f":"IFERROR(VLOOKUP(C24,Kura!$A$4:$G$301,5,0),0)","v":0}]
[]
[8,"E8",45,null,{"$f":"IFERROR(VLOOKUP(C26,Kura!$A$4:$Z$301,26,0),0)","v":"SÜEDA SİVAS (AMS)"},null,{"$f":"IF(AND(F26=0,F27=0),\"\",IF(F26>F27,E26,E27))","v":""},null,{"$f":"IFERROR(VLOOKUP(C26,Kura!$A$4:$G$301,5,0),0)","v":"MESA SPOR KULÜBÜ"},null,null,"E8",8,{"$f":"OFFSET(Sablon!$CL$1,M26,Kura!$AW$1)","v":33},{"$f":"IFERROR(VLOOKUP(N26,Kura!$A$4:$Z$301,26,0),0)","v":"EMİNE AYDINAY (BRS)"},{"$f":"IFERROR(VLOOKUP(N26,Kura!$A$4:$G$301,5,0),0)","v":"BURSA BÜYÜKŞEHİR BELEDİYESPOR"},null,null,null,null,null,null,null,null,null,null,0]
["8.8",null,112,null,{"$f":"IFERROR(VLOOKUP(C27,Kura!$A$4:$Z$301,26,0),0)","v":0},null,null,null,{"$f":"IFERROR(VLOOKUP(C27,Kura!$A$4:$G$301,5,0),0)","v":0}]
[]
[9,"E9",87,null,{"$f":"IFERROR(VLOOKUP(C29,Kura!$A$4:$Z$301,26,0),0)","v":"ZEYNEB KOÇ (ZNG)"},null,{"$f":"IF(AND(F29=0,F30=0),\"\",IF(F29>F30,E29,E30))","v":""},null,{"$f":"IFERROR(VLOOKUP(C29,Kura!$A$4:$G$301,5,0),0)","v":"ÖZEL İDARE YOLSPOR"},null,null,"E9",9,{"$f":"OFFSET(Sablon!$CL$1,M29,Kura!$AW$1)","v":88},{"$f":"IFERROR(VLOOKUP(N29,Kura!$A$4:$Z$301,26,0),0)","v":"NAZLINUR AKGÜN (ANT)"},{"$f":"IFERROR(VLOOKUP(N29,Kura!$A$4:$G$301,5,0),0)","v":"ANTALYASPOR"},null,null,null,null,null,null,null,null,null,null,0]
["9.9",null,113,null,{"$f":"IFERROR(VLOOKUP(C30,Kura!$A$4:$Z$301,26,0),0)","v":0},null,null,null,{"$f":"IFERROR(VLOOKUP(C30,Kura!$A$4:$G$301,5,0),0)","v":0}]
[]
[10,"E10",58,null,{"$f":"IFERROR(VLOOKUP(C32,Kura!$A$4:$Z$301,26,0),0)","v":"ECRİN ZEYNEP ERCİYAS (ORD)"},null,{"$f":"IF(AND(F32=0,F33=0),\"\",IF(F32>F33,E32,E33))","v":""},null,{"$f":"IFERROR(VLOOKUP(C32,Kura!$A$4:$G$301,5,0),0)","v":"ORDU GENÇLİK VE SPOR KULÜBÜ"},null,null,"E10",10,{"$f":"OFFSET(Sablon!$CL$1,M32,Kura!$AW$1)","v":57},{"$f":"IFERROR(VLOOKUP(N32,Kura!$A$4:$Z$301,26,0),0)","v":"ELANUR YILMAZ (BRS)"},{"$f":"IFERROR(VLOOKUP(N32,Kura!$A$4:$G$301,5,0),0)","v":"BURSA BÜYÜKŞEHİR BELEDİYESPOR"},null,null,null,null,null,null,null,null,null,null,0]
["10.10",null,114,null,{"$f":"IFERROR(VLOOKUP(C33,Kura!$A$4:$Z$301,26,0),0)","v":0},null,null,null,{"$f":"IFERROR(VLOOKUP(C33,Kura!$A$4:$G$301,5,0),0)","v":0}]
[]
[11,"E11",90,null,{"$f":"IFERROR(VLOOKUP(C35,Kura!$A$4:$Z$301,26,0),0)","v":"ASLINUR USLU (BRS)"},null,{"$f":"IF(AND(F35=0,F36=0),\"\",IF(F35>F36,E35,E36))","v":""},null,{"$f":"IFERROR(VLOOKUP(C35,Kura!$A$4:$G$301,5,0),0)","v":"BURSA BÜYÜKŞEHİR BELEDİYESPOR"},null,null,"E11",11,{"$f":"OFFSET(Sablon!$CL$1,M35,Kura!$AW$1)","v":89},{"$f":"IFERROR(VLOOKUP(N35,Kura!$A$4:$Z$301,26,0),0)","v":"HİLAL ECEM MUSLU (ZNG)"},{"$f":"IFERROR(VLOOKUP(N35,Kura!$A$4:$G$301,5,0),0)","v":"ÖZEL İDARE YOLSPOR"},null,null,null,null,null,null,null,null,null,null,0]
["11.11",null,115,null,{"$f":"IFERROR(VLOOKUP(C36,Kura!$A$4:$Z$301,26,0),0)","v":0},null,null,null,{"$f":"IFERROR(VLOOKUP(C36,Kura!$A$4:$G$301,5,0),0)","v":0}]
[]
[12,"E12",55,null,{"$f":"IFERROR(VLOOKUP(C38,Kura!$A$4:$Z$301,26,0),0)","v":"ELİF ASYA HOCAOĞLU (RİZ)"},null,{"$f":"IF(AND(F38=0,F39=0),\"\",IF(F38>F39,E38,E39))","v":""},null,{"$f":"IFERROR(VLOOKUP(C38,Kura!$A$4:$G$301,5,0),0)","v":"ÇAYKUR RİZESPOR"},null,null,"E12",12,{"$f":"OFFSET(Sablon!$CL$1,M38,Kura!$AW$1)","v":56},{"$f":"IFERROR(VLOOKUP(N38,Kura!$A$4:$Z$301,26,0),0)","v":"MİRAÇ DENİZ AKAR (TKD)"},{"$f":"IFERROR(VLOOKUP(N38,Kura!$A$4:$G$301,5,0),0)","v":"ÇERKEZKÖY BELEDİYESİ GENÇLİK VE SPOR KULÜBÜ "},null,null,null,null,null,null,null,null,null,null,0]
["12.12",null,116,null,{"$f":"IFERROR(VLOOKUP(C39,Kura!$A$4:$Z$301,26,0),0)","v":0},null,null,null,{"$f":"IFERROR(VLOOKUP(C39,Kura!$A$4:$G$301,5,0),0)","v":0}]
[]
[13,"E13",74,null,{"$f":"IFERROR(VLOOKUP(C41,Kura!$A$4:$Z$301,26,0),0)","v":"EYLÜL KENANOĞLU (KST)"},null,{"$f":"IF(AND(F41=0,F42=0),\"\",IF(F41>F42,E41,E42))","v":""},null,{"$f":"IFERROR(VLOOKUP(C41,Kura!$A$4:$G$301,5,0),0)","v":"KASTAMONU MASATENİSİ SK"},null,null,"E13",13,{"$f":"OFFSET(Sablon!$CL$1,M41,Kura!$AW$1)","v":73},{"$f":"IFERROR(VLOOKUP(N41,Kura!$A$4:$Z$301,26,0),0)","v":"ESLEM SENA ERCİYAS (ORD)"},{"$f":"IFERROR(VLOOKUP(N41,Kura!$A$4:$G$301,5,0),0)","v":"ORDU GENÇLİK VE SPOR KULÜBÜ"},null,null,null,null,null,null,null,null,null,null,0]
["13.13",null,117,null,{"$f":"IFERROR(VLOOKUP(C42,Kura!$A$4:$Z$301,26,0),0)","v":0},null,null,null,{"$f":"IFERROR(VLOOKUP(C42,Kura!$A$4:$G$301,5,0),0)","v":0}]
[]
[14,"E14",71,null,{"$f":"IFERROR(VLOOKUP(C44,Kura!$A$4:$Z$301,26,0),0)","v":"İLGİ İPEK TUNÇ (ANK)"},null,{"$f":"IF(AND(F44=0,F45=0),\"\",IF(F44>F45,E44,E45))","v":""},null,{"$f":"IFERROR(VLOOKUP(C44,Kura!$A$4:$G$301,5,0),0)","v":"KARİYER EĞİTİM SPOR KULÜBÜ "},null,null,"E14",14,{"$f":"OFFSET(Sablon!$CL$1,M44,Kura!$AW$1)","v":72},{"$f":"IFERROR(VLOOKUP(N44,Kura!$A$4:$Z$301,26,0),0)","v":"ÖZGE ARI (KRL)"},{"$f":"IFERROR(VLOOKUP(N44,Kura!$A$4:$G$301,5,0),0)","v":"ZİRVE GSK"},null,null,null,null,null,null,null,null,null,null,0]
["14.14",null,118,null,{"$f":"IFERROR(VLOOKUP(C45,Kura!$A$4:$Z$301,26,0),0)","v":0},null,null,null,{"$f":"IFERROR(VLOOKUP(C45,Kura!$A$4:$G$301,5,0),0)","v":0}]
[]
[15,"E15",103,null,{"$f":"IFERROR(VLOOKUP(C47,Kura!$A$4:$Z$301,26,0),0)","v":0},null,{"$f":"IF(AND(F47=0,F48=0),\"\",IF(F47>F48,E47,E48))","v":""},null,{"$f":"IFERROR(VLOOKUP(C47,Kura!$A$4:$G$301,5,0),0)","v":0},null,null,"E15",15,{"$f":"OFFSET(Sablon!$CL$1,M47,Kura!$AW$1)","v":104},{"$f":"IFERROR(VLOOKUP(N47,Kura!$A$4:$Z$301,26,0),0)","v":0},{"$f":"IFERROR(VLOOKUP(N47,Kura!$A$4:$G$301,5,0),0)","v":0},null,null,null,null,null,null,null,null,null,null,0]
["15.15",null,119,null,{"$f":"IFERROR(VLOOKUP(C48,Kura!$A$4:$Z$301,26,0),0)","v":0},null,null,null,{"$f":"IFERROR(VLOOKUP(C48,Kura!$A$4:$G$301,5,0),0)","v":0}]
[]
[16,"E16",42,null,{"$f":"IFERROR(VLOOKUP(C50,Kura!$A$4:$Z$301,26,0),0)","v":"FİRDEVSNUR BİNGÖL (YLV)"},null,{"$f":"IF(AND(F50=0,F51=0),\"\",IF(F50>F51,E50,E51))","v":""},null,{"$f":"IFERROR(VLOOKUP(C50,Kura!$A$4:$G$301,5,0),0)","v":"YALOVA BLD. GENÇLİK SPOR"},null,null,"E16",16,{"$f":"OFFSET(Sablon!$CL$1,M50,Kura!$AW$1)","v":41},{"$f":"IFERROR(VLOOKUP(N50,Kura!$A$4:$Z$301,26,0),0)","v":"ŞEVVAL ALAŞ (BTM)"},{"$f":"IFERROR(VLOOKUP(N50,Kura!$A$4:$G$301,5,0),0)","v":"1955 BATMAN BELEDİYE SPOR "},null,null,null,null,null,null,null,null,null,null,0]
["16.16",null,120,null,{"$f":"IFERROR(VLOOKUP(C51,Kura!$A$4:$Z$301,26,0),0)","v":0},null,null,null,{"$f":"IFERROR(VLOOKUP(C51,Kura!$A$4:$G$301,5,0),0)","v":0}]
[]
[17,"E17",82,null,{"$f":"IFERROR(VLOOKUP(C53,Kura!$A$4:$Z$301,26,0),0)","v":"NİSANUR AYTEN (VAN)"},null,{"$f":"IF(AND(F53=0,F54=0),\"\",IF(F53>F54,E53,E54))","v":""},null,{"$f":"IFERROR(VLOOKUP(C53,Kura!$A$4:$G$301,5,0),0)","v":"GENÇLİK VE SPOR"},null,null,"E17",17,{"$f":"OFFSET(Sablon!$CL$1,M53,Kura!$AW$1)","v":83},{"$f":"IFERROR(VLOOKUP(N53,Kura!$A$4:$Z$301,26,0),0)","v":"ELANUR DEMİR (İST)"},{"$f":"IFERROR(VLOOKUP(N53,Kura!$A$4:$G$301,5,0),0)","v":"İSTANBUL BÜYÜKŞEHİR BELEDİYE"},null,null,null,null,null,null,null,null,null,null,0]
["17.17",null,121,null,{"$f":"IFERROR(VLOOKUP(C54,Kura!$A$4:$Z$301,26,0),0)","v":0},null,null,null,{"$f":"IFERROR(VLOOKUP(C54,Kura!$A$4:$G$301,5,0),0)","v":0}]
[]
[18,"E18",63,null,{"$f":"IFERROR(VLOOKUP(C56,Kura!$A$4:$Z$301,26,0),0)","v":"ŞEVVAL CİMBEK (AMS)"},null,{"$f":"IF(AND(F56=0,F57=0),\"\",IF(F56>F57,E56,E57))","v":""},null,{"$f":"IFERROR(VLOOKUP(C56,Kura!$A$4:$G$301,5,0),0)","v":"MESA SPOR KULÜBÜ"},null,null,"E18",18,{"$f":"OFFSET(Sablon!$CL$1,M56,Kura!$AW$1)","v":62},{"$f":"IFERROR(VLOOKUP(N56,Kura!$A$4:$Z$301,26,0),0)","v":"BERRA AKICI (SKR)"},{"$f":"IFERROR(VLOOKUP(N56,Kura!$A$4:$G$301,5,0),0)","v":"SAKARYA BÜYÜKŞEHİR BELEDİYE SPOR KULÜBÜ"},null,null,null,null,null,null,null,null,null,null,0]
["18.18",null,122,null,{"$f":"IFERROR(VLOOKUP(C57,Kura!$A$4:$Z$301,26,0),0)","v":0},null,null,null,{"$f":"IFERROR(VLOOKUP(C57,Kura!$A$4:$G$301,5,0),0)","v":0}]
[]
[19,"E19",95,null,{"$f":"IFERROR(VLOOKUP(C59,Kura!$A$4:$Z$301,26,0),0)","v":"BAHAR TUNÇOK (ANK)"},null,{"$f":"IF(AND(F59=0,F60=0),\"\",IF(F59>F60,E59,E60))","v":""},null,{"$f":"IFERROR(VLOOKUP(C59,Kura!$A$4:$G$301,5,0),0)","v":"KARİYER EĞİTİM SPOR KULÜBÜ "},null,null,"E19",19,{"$f":"OFFSET(Sablon!$CL$1,M59,Kura!$AW$1)","v":94},{"$f":"IFERROR(VLOOKUP(N59,Kura!$A$4:$Z$301,26,0),0)","v":"NEVA NUR KALKAN (AMS)"},{"$f":"IFERROR(VLOOKUP(N59,Kura!$A$4:$G$301,5,0),0)","v":"KUTLUBEY OKULLARI SPOR KULÜBÜ"},null,null,null,null,null,null,null,null,null,null,0]
["19.19",null,123,null,{"$f":"IFERROR(VLOOKUP(C60,Kura!$A$4:$Z$301,26,0),0)","v":0},null,null,null,{"$f":"IFERROR(VLOOKUP(C60,Kura!$A$4:$G$301,5,0),0)","v":0}]
[]
[20,"E20",50,null,{"$f":"IFERROR(VLOOKUP(C62,Kura!$A$4:$Z$301,26,0),0)","v":"ZEYNEP BERRA GÜLOĞLU (VAN)"},null,{"$f":"IF(AND(F62=0,F63=0),\"\",IF(F62>F63,E62,E63))","v":""},null,{"$f":"IFERROR(VLOOKUP(C62,Kura!$A$4:$G$301,5,0),0)","v":"GENÇLİK VE SPOR"},null,null,"E20",20,{"$f":"OFFSET(Sablon!$CL$1,M62,Kura!$AW$1)","v":51},{"$f":"IFERROR(VLOOKUP(N62,Kura!$A$4:$Z$301,26,0),0)","v":"KAREN GÜRBÜZ (ADN)"},{"$f":"IFERROR(VLOOKUP(N62,Kura!$A$4:$G$301,5,0),0)","v":"ÇİLTAR MTİ"},null,null,null,null,null,null,null,null,null,null,0]
["20.20",null,124,null,{"$f":"IFERROR(VLOOKUP(C63,Kura!$A$4:$Z$301,26,0),0)","v":0},null,null,null,{"$f":"IFERROR(VLOOKUP(C63,Kura!$A$4:$G$301,5,0),0)","v":0}]
[]
[21,"E21",79,null,{"$f":"IFERROR(VLOOKUP(C65,Kura!$A$4:$Z$301,26,0),0)","v":"ELANUR ALAÇAM (AMS)"},null,{"$f":"IF(AND(F65=0,F66=0),\"\",IF(F65>F66,E65,E66))","v":""},null,{"$f":"IFERROR(VLOOKUP(C65,Kura!$A$4:$G$301,5,0),0)","v":"AMASYA GENÇLİK VE SPOR"},null,null,"E21",21,{"$f":"OFFSET(Sablon!$CL$1,M65,Kura!$AW$1)","v":78},{"$f":"IFERROR(VLOOKUP(N65,Kura!$A$4:$Z$301,26,0),0)","v":"ESMA ÇUKUR (RİZ)"},{"$f":"IFERROR(VLOOKUP(N65,Kura!$A$4:$G$301,5,0),0)","v":"ÇAYKUR RİZESPOR"},null,null,null,null,null,null,null,null,null,null,0]
["21.21",null,125,null,{"$f":"IFERROR(VLOOKUP(C66,Kura!$A$4:$Z$301,26,0),0)","v":0},null,null,null,{"$f":"IFERROR(VLOOKUP(C66,Kura!$A$4:$G$301,5,0),0)","v":0}]
[]
[22,"E22",66,null,{"$f":"IFERROR(VLOOKUP(C68,Kura!$A$4:$Z$301,26,0),0)","v":"ASUDE AKSOY (GZT)"},null,{"$f":"IF(AND(F68=0,F69=0),\"\",IF(F68>F69,E68,E69))","v":""},null,{"$f":"IFERROR(VLOOKUP(C68,Kura!$A$4:$G$301,5,0),0)","v":"GENÇLİK SPOR KULÜBÜ "},null,null,"E22",22,{"$f":"OFFSET(Sablon!$CL$1,M68,Kura!$AW$1)","v":67},{"$f":"IFERROR(VLOOKUP(N68,Kura!$A$4:$Z$301,26,0),0)","v":"BAHAR GÜL (ZNG)"},{"$f":"IFERROR(VLOOKUP(N68,Kura!$A$4:$G$301,5,0),0)","v":"ÖZEL İDARE YOLSPOR"},null,null,null,null,null,null,null,null,null,null,0]
["22.22",null,126,null,{"$f":"IFERROR(VLOOKUP(C69,Kura!$A$4:$Z$301,26,0),0)","v":0},null,null,null,{"$f":"IFERROR(VLOOKUP(C69,Kura!$A$4:$G$301,5,0),0)","v":0}]
[]
[23,"E23",98,null,{"$f":"IFERROR(VLOOKUP(C71,Kura!$A$4:$Z$301,26,0),0)","v":0},null,{"$f":"IF(AND(F71=0,F72=0),\"\",IF(F71>F72,E71,E72))","v":""},null,{"$f":"IFERROR(VLOOKUP(C71,Kura!$A$4:$G$301,5,0),0)","v":0},null,null,"E23",23,{"$f":"OFFSET(Sablon!$CL$1,M71,Kura!$AW$1)","v":99},{"$f":"IFERROR(VLOOKUP(N71,Kura!$A$4:$Z$301,26,0),0)","v":0},{"$f":"IFERROR(VLOOKUP(N71,Kura!$A$4:$G$301,5,0),0)","v":0},null,null,null,null,null,null,null,null,null,null,{"$f":"IF(AND(E71<>0,E72<>0),1,0)","v":0}]
["23.23",null,127,null,{"$f":"IFERROR(VLOOKUP(C72,Kura!$A$4:$Z$301,26,0),0)","v":0},null,null,null,{"$f":"IFERROR(VLOOKUP(C72,Kura!$A$4:$G$301,5,0),0)","v":0}]
[]
[24,"E24",47,null,{"$f":"IFERROR(VLOOKUP(C74,Kura!$A$4:$Z$301,26,0),0)","v":"AYNUR CANGİR (BTM)"},null,{"$f":"IF(AND(F74=0,F75=0),\"\",IF(F74>F75,E74,E75))","v":""},null,{"$f":"IFERROR(VLOOKUP(C74,Kura!$A$4:$G$301,5,0),0)","v":"1955 BATMAN BELEDİYE SPOR "},null,null,"E24",24,{"$f":"OFFSET(Sablon!$CL$1,M74,Kura!$AW$1)","v":46},{"$f":"IFERROR(VLOOKUP(N74,Kura!$A$4:$Z$301,26,0),0)","v":"BERRA ARIKAN (ADN)"},{"$f":"IFERROR(VLOOKUP(N74,Kura!$A$4:$G$301,5,0),0)","v":"ÇİLTAR MTİ"},null,null,null,null,null,null,null,null,null,null,0]
["24.24",null,128,null,{"$f":"IFERROR(VLOOKUP(C75,Kura!$A$4:$Z$301,26,0),0)","v":0},null,null,null,{"$f":"IFERROR(VLOOKUP(C75,Kura!$A$4:$G$301,5,0),0)","v":0}]
[]
[25,"E25",91,null,{"$f":"IFERROR(VLOOKUP(C77,Kura!$A$4:$Z$301,26,0),0)","v":"ZEYNEP HÜMA YILMAZ (SMS)"},null,{"$f":"IF(AND(F77=0,F78=0),\"\",IF(F77>F78,E77,E78))","v":""},null,{"$f":"IFERROR(VLOOKUP(C77,Kura!$A$4:$G$301,5,0),0)","v":"YAKAKENT GENÇLİKGÜCÜ SK "},null,null,"E25",25,{"$f":"OFFSET(Sablon!$CL$1,M77,Kura!$AW$1)","v":999},{"$f":"IFERROR(VLOOKUP(N77,Kura!$A$4:$Z$301,26,0),0)","v":0},{"$f":"IFERROR(VLOOKUP(N77,Kura!$A$4:$G$301,5,0),0)","v":0},null,null,null,null,null,null,null,null,null,null,0]
["25.25",null,129,null,{"$f":"IFERROR(VLOOKUP(C78,Kura!$A$4:$Z$301,26,0),0)","v":0},null,null,null,{"$f":"IFERROR(VLOOKUP(C78,Kura!$A$4:$G$301,5,0),0)","v":0}]
[]
[26,"E26",54,null,{"$f":"IFERROR(VLOOKUP(C80,Kura!$A$4:$Z$301,26,0),0)","v":"İDİL TOSUN (ADN)"},null,{"$f":"IF(AND(F80=0,F81=0),\"\",IF(F80>F81,E80,E81))","v":""},null,{"$f":"IFERROR(VLOOKUP(C80,Kura!$A$4:$G$301,5,0),0)","v":"ÇİLTAR MTİ"},null,null,"E26",26,{"$f":"OFFSET(Sablon!$CL$1,M80,Kura!$AW$1)","v":999},{"$f":"IFERROR(VLOOKUP(N80,Kura!$A$4:$Z$301,26,0),0)","v":0},{"$f":"IFERROR(VLOOKUP(N80,Kura!$A$4:$G$301,5,0),0)","v":0},null,null,null,null,null,null,null,null,null,null,0]
["26.26",null,130,null,{"$f":"IFERROR(VLOOKUP(C81,Kura!$A$4:$Z$301,26,0),0)","v":0},null,null,null,{"$f":"IFERROR(VLOOKUP(C81,Kura!$A$4:$G$301,5,0),0)","v":0}]
[]
[27,"E27",65,null,{"$f":"IFERROR(VLOOKUP(C83,Kura!$A$4:$Z$301,26,0),0)","v":"RÜYA EMİR (SMS)"},null,{"$f":"IF(AND(F83=0,F84=0),\"\",IF(F83>F84,E83,E84))","v":""},null,{"$f":"IFERROR(VLOOKUP(C83,Kura!$A$4:$G$301,5,0),0)","v":"YAKAKENT GENÇLİKGÜCÜ SK "},null,null,"E27",27,{"$f":"OFFSET(Sablon!$CL$1,M83,Kura!$AW$1)","v":999},{"$f":"IFERROR(VLOOKUP(N83,Kura!$A$4:$Z$301,26,0),0)","v":0},{"$f":"IFERROR(VLOOKUP(N83,Kura!$A$4:$G$301,5,0),0)","v":0},null,null,null,null,null,null,null,null,null,null,0]
["27.27",null,131,null,{"$f":"IFERROR(VLOOKUP(C84,Kura!$A$4:$Z$301,26,0),0)","v":0},null,null,null,{"$f":"IFERROR(VLOOKUP(C84,Kura!$A$4:$G$301,5,0),0)","v":0}]
[]
[28,"E28",76,null,{"$f":"IFERROR(VLOOKUP(C86,Kura!$A$4:$Z$301,26,0),0)","v":"RÜMEYSA MAYDA (BRS)"},null,{"$f":"IF(AND(F86=0,F87=0),\"\",IF(F86>F87,E86,E87))","v":""},null,{"$f":"IFERROR(VLOOKUP(C86,Kura!$A$4:$G$301,5,0),0)","v":"BURSA BÜYÜKŞEHİR BELEDİYESPOR"},null,null,"E28",28,{"$f":"OFFSET(Sablon!$CL$1,M86,Kura!$AW$1)","v":999},{"$f":"IFERROR(VLOOKUP(N86,Kura!$A$4:$Z$301,26,0),0)","v":0},{"$f":"IFERROR(VLOOKUP(N86,Kura!$A$4:$G$301,5,0),0)","v":0},null,null,null,null,null,null,null,null,null,null,0]
["28.28",null,132,null,{"$f":"IFERROR(VLOOKUP(C87,Kura!$A$4:$Z$301,26,0),0)","v":0},null,null,null,{"$f":"IFERROR(VLOOKUP(C87,Kura!$A$4:$G$301,5,0),0)","v":0}]
[]
[29,"E29",43,null,{"$f":"IFERROR(VLOOKUP(C89,Kura!$A$4:$Z$301,26,0),0)","v":"FATMANUR DEMİRCİ (KMŞ)"},null,{"$f":"IF(AND(F89=0,F90=0),\"\",IF(F89>F90,E89,E90))","v":""},null,{"$f":"IFERROR(VLOOKUP(C89,Kura!$A$4:$G$301,5,0),0)","v":"GENÇLİK SPOR"},null,null,"E29",29,{"$f":"OFFSET(Sablon!$CL$1,M89,Kura!$AW$1)","v":999},{"$f":"IFERROR(VLOOKUP(N89,Kura!$A$4:$Z$301,26,0),0)","v":0},{"$f":"IFERROR(VLOOKUP(N89,Kura!$A$4:$G$301,5,0),0)","v":0},null,null,null,null,null,null,null,null,null,null,0]
["29.29",null,133,null,{"$f":"IFERROR(VLOOKUP(C90,Kura!$A$4:$Z$301,26,0),0)","v":0},null,null,null,{"$f":"IFERROR(VLOOKUP(C90,Kura!$A$4:$G$301,5,0),0)","v":0}]
[]
[30,"E30",60,null,{"$f":"IFERROR(VLOOKUP(C92,Kura!$A$4:$Z$301,26,0),0)","v":"NAZLISU OKKAN (KRL)"},null,{"$f":"IF(AND(F92=0,F93=0),\"\",IF(F92>F93,E92,E93))","v":""},null,{"$f":"IFERROR(VLOOKUP(C92,Kura!$A$4:$G$301,5,0),0)","v":"GENCLİK SPOR KULÜBÜ KIRKLARELİ"},null,null,"E30",30,{"$f":"OFFSET(Sablon!$CL$1,M92,Kura!$AW$1)","v":999},{"$f":"IFERROR(VLOOKUP(N92,Kura!$A$4:$Z$301,26,0),0)","v":0},{"$f":"IFERROR(VLOOKUP(N92,Kura!$A$4:$G$301,5,0),0)","v":0},null,null,null,null,null,null,null,null,null,null,0]
["30.30",null,134,null,{"$f":"IFERROR(VLOOKUP(C93,Kura!$A$4:$Z$301,26,0),0)","v":0},null,null,null,{"$f":"IFERROR(VLOOKUP(C93,Kura!$A$4:$G$301,5,0),0)","v":0}]
[]
[31,"E31",80,null,{"$f":"IFERROR(VLOOKUP(C95,Kura!$A$4:$Z$301,26,0),0)","v":"HAZAL ERSOY (AMS)"},null,{"$f":"IF(AND(F95=0,F96=0),\"\",IF(F95>F96,E95,E96))","v":""},null,{"$f":"IFERROR(VLOOKUP(C95,Kura!$A$4:$G$301,5,0),0)","v":"KUTLUBEY OKULLARI SPOR KULÜBÜ"},null,null,"E31",31,{"$f":"OFFSET(Sablon!$CL$1,M95,Kura!$AW$1)","v":999},{"$f":"IFERROR(VLOOKUP(N95,Kura!$A$4:$Z$301,26,0),0)","v":0},{"$f":"IFERROR(VLOOKUP(N95,Kura!$A$4:$G$301,5,0),0)","v":0},null,null,null,null,null,null,null,null,null,null,0]
["31.31",null,135,null,{"$f":"IFERROR(VLOOKUP(C96,Kura!$A$4:$Z$301,26,0),0)","v":0},null,null,null,{"$f":"IFERROR(VLOOKUP(C96,Kura!$A$4:$G$301,5,0),0)","v":0}]
[]
[32,"E32",97,null,{"$f":"IFERROR(VLOOKUP(C98,Kura!$A$4:$Z$301,26,0),0)","v":"DEFNE DEMİR (ORD)"},null,{"$f":"IF(AND(F98=0,F99=0),\"\",IF(F98>F99,E98,E99))","v":""},null,{"$f":"IFERROR(VLOOKUP(C98,Kura!$A$4:$G$301,5,0),0)","v":"ORDU GENÇLİK VE SPOR KULÜBÜ"},null,null,"E32",32,{"$f":"OFFSET(Sablon!$CL$1,M98,Kura!$AW$1)","v":999},{"$f":"IFERROR(VLOOKUP(N98,Kura!$A$4:$Z$301,26,0),0)","v":0},{"$f":"IFERROR(VLOOKUP(N98,Kura!$A$4:$G$301,5,0),0)","v":0},null,null,null,null,null,null,null,null,null,null,0]
["32.32",null,136,null,{"$f":"IFERROR(VLOOKUP(C99,Kura!$A$4:$Z$301,26,0),0)","v":0},null,null,null,{"$f":"IFERROR(VLOOKUP(C99,Kura!$A$4:$G$301,5,0),0)","v":0}]
[]
[33,"E33",102,null,{"$f":"IFERROR(VLOOKUP(C101,Kura!$A$4:$Z$301,26,0),0)","v":0},null,{"$f":"IF(AND(F101=0,F102=0),\"\",IF(F101>F102,E101,E102))","v":""},null,{"$f":"IFERROR(VLOOKUP(C101,Kura!$A$4:$G$301,5,0),0)","v":0},null,null,"E33",33,{"$f":"OFFSET(Sablon!$CL$1,M101,Kura!$AW$1)","v":22},{"$f":"IFERROR(VLOOKUP(N101,Kura!$A$4:$Z$301,26,0),0)","v":"IRMAK BÜŞRA UNCU (KST)"},{"$f":"IFERROR(VLOOKUP(N101,Kura!$A$4:$G$301,5,0),0)","v":"KASTAMONU MASATENİSİ SK"},null,null,null,null,null,null,null,null,null,null,0]
["33.33",null,137,null,{"$f":"IFERROR(VLOOKUP(C102,Kura!$A$4:$Z$301,26,0),0)","v":0},null,null,null,{"$f":"IFERROR(VLOOKUP(C102,Kura!$A$4:$G$301,5,0),0)","v":0}]
[]
[34,"E34",64,null,{"$f":"IFERROR(VLOOKUP(C104,Kura!$A$4:$Z$301,26,0),0)","v":"ECEM SUNA KALDIRIM (ANK)"},null,{"$f":"IF(AND(F104=0,F105=0),\"\",IF(F104>F105,E104,E105))","v":""},null,{"$f":"IFERROR(VLOOKUP(C104,Kura!$A$4:$G$301,5,0),0)","v":"ANKARA GENÇLİK MERKEZLERİ GSKD"},null,null,"E34",34,{"$f":"OFFSET(Sablon!$CL$1,M104,Kura!$AW$1)","v":21},{"$f":"IFERROR(VLOOKUP(N104,Kura!$A$4:$Z$301,26,0),0)","v":"DİLAY BALABAN (RİZ)"},{"$f":"IFERROR(VLOOKUP(N104,Kura!$A$4:$G$301,5,0),0)","v":"ÇAYKUR RİZESPOR"},null,null,null,null,null,null,null,null,null,null,0]
["34.34",null,138,null,{"$f":"IFERROR(VLOOKUP(C105,Kura!$A$4:$Z$301,26,0),0)","v":0},null,null,null,{"$f":"IFERROR(VLOOKUP(C105,Kura!$A$4:$G$301,5,0),0)","v":0}]
[]
[35,"E35",59,null,{"$f":"IFERROR(VLOOKUP(C107,Kura!$A$4:$Z$301,26,0),0)","v":"MERYEM ECRİN ŞENTÜRK (KCL)"},null,{"$f":"IF(AND(F107=0,F108=0),\"\",IF(F107>F108,E107,E108))","v":""},null,{"$f":"IFERROR(VLOOKUP(C107,Kura!$A$4:$G$301,5,0),0)","v":"B.B.KAĞITSPOR KULÜBÜ"},null,null,"E35",35,{"$f":"OFFSET(Sablon!$CL$1,M107,Kura!$AW$1)","v":23},{"$f":"IFERROR(VLOOKUP(N107,Kura!$A$4:$Z$301,26,0),0)","v":"DAMLA AVŞAR (VAN)"},{"$f":"IFERROR(VLOOKUP(N107,Kura!$A$4:$G$301,5,0),0)","v":"GENÇLİK VE SPOR"},null,null,null,null,null,null,null,null,null,null,0]
["35.35",null,139,null,{"$f":"IFERROR(VLOOKUP(C108,Kura!$A$4:$Z$301,26,0),0)","v":0},null,null,null,{"$f":"IFERROR(VLOOKUP(C108,Kura!$A$4:$G$301,5,0),0)","v":0}]
[]
[36,"E36",75,null,{"$f":"IFERROR(VLOOKUP(C110,Kura!$A$4:$Z$301,26,0),0)","v":"MİYASE ESLEM ÖZDEN (KNY)"},null,{"$f":"IF(AND(F110=0,F111=0),\"\",IF(F110>F111,E110,E111))","v":""},null,{"$f":"IFERROR(VLOOKUP(C110,Kura!$A$4:$G$301,5,0),0)","v":"SELÇUKLU BELEDİYE SPOR KULÜBÜ"},null,null,"E36",36,{"$f":"OFFSET(Sablon!$CL$1,M110,Kura!$AW$1)","v":24},{"$f":"IFERROR(VLOOKUP(N110,Kura!$A$4:$Z$301,26,0),0)","v":"NİSA ÜZÜMCÜ (BTM)"},{"$f":"IFERROR(VLOOKUP(N110,Kura!$A$4:$G$301,5,0),0)","v":"1955 BATMAN BELEDİYE SPOR "},null,null,null,null,null,null,null,null,null,null,0]
["36.36",null,140,null,{"$f":"IFERROR(VLOOKUP(C111,Kura!$A$4:$Z$301,26,0),0)","v":0},null,null,null,{"$f":"IFERROR(VLOOKUP(C111,Kura!$A$4:$G$301,5,0),0)","v":0}]
[]
[37,"E37",48,null,{"$f":"IFERROR(VLOOKUP(C113,Kura!$A$4:$Z$301,26,0),0)","v":"ELİF KABAAHMETOĞLU (KST)"},null,{"$f":"IF(AND(F113=0,F114=0),\"\",IF(F113>F114,E113,E114))","v":""},null,{"$f":"IFERROR(VLOOKUP(C113,Kura!$A$4:$G$301,5,0),0)","v":"KASTAMONU MASATENİSİ SK"},null,null,"E37",37,{"$f":"OFFSET(Sablon!$CL$1,M113,Kura!$AW$1)","v":19},{"$f":"IFERROR(VLOOKUP(N113,Kura!$A$4:$Z$301,26,0),0)","v":"NAZLI ŞAHAN (ÇRM)"},{"$f":"IFERROR(VLOOKUP(N113,Kura!$A$4:$G$301,5,0),0)","v":"GENÇLİKSPOR "},null,null,null,null,null,null,null,null,null,null,0]
["37.37",null,141,null,{"$f":"IFERROR(VLOOKUP(C114,Kura!$A$4:$Z$301,26,0),0)","v":0},null,null,null,{"$f":"IFERROR(VLOOKUP(C114,Kura!$A$4:$G$301,5,0),0)","v":0}]
[]
[38,"E38",49,null,{"$f":"IFERROR(VLOOKUP(C116,Kura!$A$4:$Z$301,26,0),0)","v":"TUANA GÜLER (KRL)"},null,{"$f":"IF(AND(F116=0,F117=0),\"\",IF(F116>F117,E116,E117))","v":""},null,{"$f":"IFERROR(VLOOKUP(C116,Kura!$A$4:$G$301,5,0),0)","v":"TRAKER"},null,null,"E38",38,{"$f":"OFFSET(Sablon!$CL$1,M116,Kura!$AW$1)","v":20},{"$f":"IFERROR(VLOOKUP(N116,Kura!$A$4:$Z$301,26,0),0)","v":"MASAL ERYILMAZ (İST)"},{"$f":"IFERROR(VLOOKUP(N116,Kura!$A$4:$G$301,5,0),0)","v":"GİRİŞİM SPOR KULÜBÜ"},null,null,null,null,null,null,null,null,null,null,0]
["38.38",null,142,null,{"$f":"IFERROR(VLOOKUP(C117,Kura!$A$4:$Z$301,26,0),0)","v":0},null,null,null,{"$f":"IFERROR(VLOOKUP(C117,Kura!$A$4:$G$301,5,0),0)","v":0}]
[]
[39,"E39",53,null,{"$f":"IFERROR(VLOOKUP(C119,Kura!$A$4:$Z$301,26,0),0)","v":"KÜBRA YERLİKAYA (AMS)"},null,{"$f":"IF(AND(F119=0,F120=0),\"\",IF(F119>F120,E119,E120))","v":""},null,{"$f":"IFERROR(VLOOKUP(C119,Kura!$A$4:$G$301,5,0),0)","v":"MESA SPOR KULÜBÜ"},null,null,"E39",39,{"$f":"OFFSET(Sablon!$CL$1,M119,Kura!$AW$1)","v":18},{"$f":"IFERROR(VLOOKUP(N119,Kura!$A$4:$Z$301,26,0),0)","v":"MERVE MENGENE (RİZ)"},{"$f":"IFERROR(VLOOKUP(N119,Kura!$A$4:$G$301,5,0),0)","v":"ÇAYKUR RİZESPOR"},null,null,null,null,null,null,null,null,null,null,0]
["39.39",null,143,null,{"$f":"IFERROR(VLOOKUP(C120,Kura!$A$4:$Z$301,26,0),0)","v":0},null,null,null,{"$f":"IFERROR(VLOOKUP(C120,Kura!$A$4:$G$301,5,0),0)","v":0}]
[]
[40,"E40",70,null,{"$f":"IFERROR(VLOOKUP(C122,Kura!$A$4:$Z$301,26,0),0)","v":"ECEM DEMİR (KRL)"},null,{"$f":"IF(AND(F122=0,F123=0),\"\",IF(F122>F123,E122,E123))","v":""},null,{"$f":"IFERROR(VLOOKUP(C122,Kura!$A$4:$G$301,5,0),0)","v":"GENCLİK SPOR KULÜBÜ KIRKLARELİ"},null,null,"E40",40,{"$f":"OFFSET(Sablon!$CL$1,M122,Kura!$AW$1)","v":17},{"$f":"IFERROR(VLOOKUP(N122,Kura!$A$4:$Z$301,26,0),0)","v":"ELA SU YÖNTER (ANK)"},{"$f":"IFERROR(VLOOKUP(N122,Kura!$A$4:$G$301,5,0),0)","v":"ŞAFAKTEPE GSK"},null,null,null,null,null,null,null,null,null,null,0]
["40.40",null,144,null,{"$f":"IFERROR(VLOOKUP(C123,Kura!$A$4:$Z$301,26,0),0)","v":0},null,null,null,{"$f":"IFERROR(VLOOKUP(C123,Kura!$A$4:$G$301,5,0),0)","v":0}]
[]
[41,"E41",86,null,{"$f":"IFERROR(VLOOKUP(C125,Kura!$A$4:$Z$301,26,0),0)","v":"ELİF DURU BECER (ÇRM)"},null,{"$f":"IF(AND(F125=0,F126=0),\"\",IF(F125>F126,E125,E126))","v":""},null,{"$f":"IFERROR(VLOOKUP(C125,Kura!$A$4:$G$301,5,0),0)","v":"GENÇLİKSPOR "},null,null,"E41",41,{"$f":"OFFSET(Sablon!$CL$1,M125,Kura!$AW$1)","v":27},{"$f":"IFERROR(VLOOKUP(N125,Kura!$A$4:$Z$301,26,0),0)","v":"ECEMSU ÇİÇEK (İZM)"},{"$f":"IFERROR(VLOOKUP(N125,Kura!$A$4:$G$301,5,0),0)","v":"İZGEM SPOR"},null,null,null,null,null,null,null,null,null,null,0]
["41.41",null,145,null,{"$f":"IFERROR(VLOOKUP(C126,Kura!$A$4:$Z$301,26,0),0)","v":0},null,null,null,{"$f":"IFERROR(VLOOKUP(C126,Kura!$A$4:$G$301,5,0),0)","v":0}]
[]
[42,"E42",85,null,{"$f":"IFERROR(VLOOKUP(C128,Kura!$A$4:$Z$301,26,0),0)","v":"EBRAR NİSA TORU (AMS)"},null,{"$f":"IF(AND(F128=0,F129=0),\"\",IF(F128>F129,E128,E129))","v":""},null,{"$f":"IFERROR(VLOOKUP(C128,Kura!$A$4:$G$301,5,0),0)","v":"KUTLUBEY OKULLARI SPOR KULÜBÜ"},null,null,"E42",42,{"$f":"OFFSET(Sablon!$CL$1,M128,Kura!$AW$1)","v":28},{"$f":"IFERROR(VLOOKUP(N128,Kura!$A$4:$Z$301,26,0),0)","v":"AYŞE DURU DOĞAN (ANK)"},{"$f":"IFERROR(VLOOKUP(N128,Kura!$A$4:$G$301,5,0),0)","v":"MASA-DER"},null,null,null,null,null,null,null,null,null,null,0]
["42.42",null,146,null,{"$f":"IFERROR(VLOOKUP(C129,Kura!$A$4:$Z$301,26,0),0)","v":0},null,null,null,{"$f":"IFERROR(VLOOKUP(C129,Kura!$A$4:$G$301,5,0),0)","v":0}]
[]
[43,"E43",96,null,{"$f":"IFERROR(VLOOKUP(C131,Kura!$A$4:$Z$301,26,0),0)","v":"EDA TUNA (ANT)"},null,{"$f":"IF(AND(F131=0,F132=0),\"\",IF(F131>F132,E131,E132))","v":""},null,{"$f":"IFERROR(VLOOKUP(C131,Kura!$A$4:$G$301,5,0),0)","v":"ANTALYASPOR"},null,null,"E43",43,{"$f":"OFFSET(Sablon!$CL$1,M131,Kura!$AW$1)","v":26},{"$f":"IFERROR(VLOOKUP(N131,Kura!$A$4:$Z$301,26,0),0)","v":"ELVİN KALE (YLV)"},{"$f":"IFERROR(VLOOKUP(N131,Kura!$A$4:$G$301,5,0),0)","v":"YALOVA BLD. GENÇLİK SPOR"},null,null,null,null,null,null,null,null,null,null,0]
["43.43",null,147,null,{"$f":"IFERROR(VLOOKUP(C132,Kura!$A$4:$Z$301,26,0),0)","v":0},null,null,null,{"$f":"IFERROR(VLOOKUP(C132,Kura!$A$4:$G$301,5,0),0)","v":0}]
[]
[44,"E44",92,null,{"$f":"IFERROR(VLOOKUP(C134,Kura!$A$4:$Z$301,26,0),0)","v":"AYSEL SENA GÜN (AMS)"},null,{"$f":"IF(AND(F134=0,F135=0),\"\",IF(F134>F135,E134,E135))","v":""},null,{"$f":"IFERROR(VLOOKUP(C134,Kura!$A$4:$G$301,5,0),0)","v":"KUTLUBEY OKULLARI SPOR KULÜBÜ"},null,null,"E44",44,{"$f":"OFFSET(Sablon!$CL$1,M134,Kura!$AW$1)","v":25},{"$f":"IFERROR(VLOOKUP(N134,Kura!$A$4:$Z$301,26,0),0)","v":"ESİLA SU YALÇIN (SKR)"},{"$f":"IFERROR(VLOOKUP(N134,Kura!$A$4:$G$301,5,0),0)","v":"SAKARYA BÜYÜKŞEHİR BELEDİYE SPOR KULÜBÜ"},null,null,null,null,null,null,null,null,null,null,{"$f":"IF(AND(E134<>0,E135<>0),1,0)","v":0}]
["44.44",null,148,null,{"$f":"IFERROR(VLOOKUP(C135,Kura!$A$4:$Z$301,26,0),0)","v":0},null,null,null,{"$f":"IFERROR(VLOOKUP(C135,Kura!$A$4:$G$301,5,0),0)","v":0}]
[]
[45,"E45",44,null,{"$f":"IFERROR(VLOOKUP(C137,Kura!$A$4:$Z$301,26,0),0)","v":"MEDİNE İREM TÜRKAN (BTM)"},null,{"$f":"IF(AND(F137=0,F138=0),\"\",IF(F137>F138,E137,E138))","v":""},null,{"$f":"IFERROR(VLOOKUP(C137,Kura!$A$4:$G$301,5,0),0)","v":"BATMAN GENÇLİK SPOR KULÜBÜ"},null,null,"E45",45,{"$f":"OFFSET(Sablon!$CL$1,M137,Kura!$AW$1)","v":30},{"$f":"IFERROR(VLOOKUP(N137,Kura!$A$4:$Z$301,26,0),0)","v":"ELİF ÇELİK (MLT)"},{"$f":"IFERROR(VLOOKUP(N137,Kura!$A$4:$G$301,5,0),0)","v":"MALATYA B. ŞEH. BLD. SPOR"},null,null,null,null,null,null,null,null,null,null,0]
["45.45",null,149,null,{"$f":"IFERROR(VLOOKUP(C138,Kura!$A$4:$Z$301,26,0),0)","v":0},null,null,null,{"$f":"IFERROR(VLOOKUP(C138,Kura!$A$4:$G$301,5,0),0)","v":0}]
[]
[46,"E46",69,null,{"$f":"IFERROR(VLOOKUP(C140,Kura!$A$4:$Z$301,26,0),0)","v":"AYŞE MELİS ÖZER (TKD)"},null,{"$f":"IF(AND(F140=0,F141=0),\"\",IF(F140>F141,E140,E141))","v":""},null,{"$f":"IFERROR(VLOOKUP(C140,Kura!$A$4:$G$301,5,0),0)","v":"ÇERKEZKÖY BELEDİYESİ GENÇLİK VE SPOR KULÜBÜ "},null,null,"E46",46,{"$f":"OFFSET(Sablon!$CL$1,M140,Kura!$AW$1)","v":29},{"$f":"IFERROR(VLOOKUP(N140,Kura!$A$4:$Z$301,26,0),0)","v":"ZEYNEP DURAN (İST)"},{"$f":"IFERROR(VLOOKUP(N140,Kura!$A$4:$G$301,5,0),0)","v":"FENERBAHÇE SPOR KULÜBÜ"},null,null,null,null,null,null,null,null,null,null,0]
["46.46",null,150,null,{"$f":"IFERROR(VLOOKUP(C141,Kura!$A$4:$Z$301,26,0),0)","v":0},null,null,null,{"$f":"IFERROR(VLOOKUP(C141,Kura!$A$4:$G$301,5,0),0)","v":0}]
[]
[47,"E47",101,null,{"$f":"IFERROR(VLOOKUP(C143,Kura!$A$4:$Z$301,26,0),0)","v":0},null,{"$f":"IF(AND(F143=0,F144=0),\"\",IF(F143>F144,E143,E144))","v":""},null,{"$f":"IFERROR(VLOOKUP(C143,Kura!$A$4:$G$301,5,0),0)","v":0},null,null,"E47",47,{"$f":"OFFSET(Sablon!$CL$1,M143,Kura!$AW$1)","v":31},{"$f":"IFERROR(VLOOKUP(N143,Kura!$A$4:$Z$301,26,0),0)","v":"ARMİN AYDIN (İST)"},{"$f":"IFERROR(VLOOKUP(N143,Kura!$A$4:$G$301,5,0),0)","v":"FENERBAHÇE SPOR KULÜBÜ"},null,null,null,null,null,null,null,null,null,null,0]
["47.47",null,151,null,{"$f":"IFERROR(VLOOKUP(C144,Kura!$A$4:$Z$301,26,0),0)","v":0},null,null,null,{"$f":"IFERROR(VLOOKUP(C144,Kura!$A$4:$G$301,5,0),0)","v":0}]
[]
[48,"E48",81,null,{"$f":"IFERROR(VLOOKUP(C146,Kura!$A$4:$Z$301,26,0),0)","v":"NEHİR GÖHER SALTÜRK (BRS)"},null,{"$f":"IF(AND(F146=0,F147=0),\"\",IF(F146>F147,E146,E147))","v":""},null,{"$f":"IFERROR(VLOOKUP(C146,Kura!$A$4:$G$301,5,0),0)","v":"BURSA BÜYÜKŞEHİR BELEDİYESPOR"},null,null,"E48",48,{"$f":"OFFSET(Sablon!$CL$1,M146,Kura!$AW$1)","v":32},{"$f":"IFERROR(VLOOKUP(N146,Kura!$A$4:$Z$301,26,0),0)","v":"HATİCE RAVZA GÜLCE (KYS)"},{"$f":"IFERROR(VLOOKUP(N146,Kura!$A$4:$G$301,5,0),0)","v":"SPOR A.Ş GENÇLİK VE S.K DERNEĞİ"},null,null,null,null,null,null,null,null,null,null,0]
["48.48",null,152,null,{"$f":"IFERROR(VLOOKUP(C147,Kura!$A$4:$Z$301,26,0),0)","v":0},null,null,null,{"$f":"IFERROR(VLOOKUP(C147,Kura!$A$4:$G$301,5,0),0)","v":0}]
[]
[49,"E49",41,null,{"$f":"IFERROR(VLOOKUP(C149,Kura!$A$4:$Z$301,26,0),0)","v":"ŞEVVAL ALAŞ (BTM)"},null,{"$f":"IF(AND(F149=0,F150=0),\"\",IF(F149>F150,E149,E150))","v":""},null,{"$f":"IFERROR(VLOOKUP(C149,Kura!$A$4:$G$301,5,0),0)","v":"1955 BATMAN BELEDİYE SPOR "},null,null,"E49",49,{"$f":"OFFSET(Sablon!$CL$1,M149,Kura!$AW$1)","v":11},{"$f":"IFERROR(VLOOKUP(N149,Kura!$A$4:$Z$301,26,0),0)","v":"AYTEN CEREN KAHRAMAN (KYS)"},{"$f":"IFERROR(VLOOKUP(N149,Kura!$A$4:$G$301,5,0),0)","v":"KOCASİNAN BELEDİYESİ SPOR"},null,null,null,null,null,null,null,null,null,null,0]
["49.49",null,153,null,{"$f":"IFERROR(VLOOKUP(C150,Kura!$A$4:$Z$301,26,0),0)","v":0},null,null,null,{"$f":"IFERROR(VLOOKUP(C150,Kura!$A$4:$G$301,5,0),0)","v":0}]
[]
[50,"E50",99,null,{"$f":"IFERROR(VLOOKUP(C152,Kura!$A$4:$Z$301,26,0),0)","v":0},null,{"$f":"IF(AND(F152=0,F153=0),\"\",IF(F152>F153,E152,E153))","v":""},null,{"$f":"IFERROR(VLOOKUP(C152,Kura!$A$4:$G$301,5,0),0)","v":0},null,null,"E50",50,{"$f":"OFFSET(Sablon!$CL$1,M152,Kura!$AW$1)","v":12},{"$f":"IFERROR(VLOOKUP(N152,Kura!$A$4:$Z$301,26,0),0)","v":"ZEYNEP NAZ EKER (KRL)"},{"$f":"IFERROR(VLOOKUP(N152,Kura!$A$4:$G$301,5,0),0)","v":"ZİRVE GSK"},null,null,null,null,null,null,null,null,null,null,0]
["50.50",null,154,null,{"$f":"IFERROR(VLOOKUP(C153,Kura!$A$4:$Z$301,26,0),0)","v":0},null,null,null,{"$f":"IFERROR(VLOOKUP(C153,Kura!$A$4:$G$301,5,0),0)","v":0}]
[]
[51,"E51",78,null,{"$f":"IFERROR(VLOOKUP(C155,Kura!$A$4:$Z$301,26,0),0)","v":"ESMA ÇUKUR (RİZ)"},null,{"$f":"IF(AND(F155=0,F156=0),\"\",IF(F155>F156,E155,E156))","v":""},null,{"$f":"IFERROR(VLOOKUP(C155,Kura!$A$4:$G$301,5,0),0)","v":"ÇAYKUR RİZESPOR"},null,null,"E51",51,{"$f":"OFFSET(Sablon!$CL$1,M155,Kura!$AW$1)","v":10},{"$f":"IFERROR(VLOOKUP(N155,Kura!$A$4:$Z$301,26,0),0)","v":"BUSE KOÇAK (ANK)"},{"$f":"IFERROR(VLOOKUP(N155,Kura!$A$4:$G$301,5,0),0)","v":"ŞAFAKTEPE GSK"},null,null,null,null,null,null,null,null,null,null,0]
["51.51",null,155,null,{"$f":"IFERROR(VLOOKUP(C156,Kura!$A$4:$Z$301,26,0),0)","v":0},null,null,null,{"$f":"IFERROR(VLOOKUP(C156,Kura!$A$4:$G$301,5,0),0)","v":0}]
[]
[52,"E52",57,null,{"$f":"IFERROR(VLOOKUP(C158,Kura!$A$4:$Z$301,26,0),0)","v":"ELANUR YILMAZ (BRS)"},null,{"$f":"IF(AND(F158=0,F159=0),\"\",IF(F158>F159,E158,E159))","v":""},null,{"$f":"IFERROR(VLOOKUP(C158,Kura!$A$4:$G$301,5,0),0)","v":"BURSA BÜYÜKŞEHİR BELEDİYESPOR"},null,null,"E52",52,{"$f":"OFFSET(Sablon!$CL$1,M158,Kura!$AW$1)","v":9},{"$f":"IFERROR(VLOOKUP(N158,Kura!$A$4:$Z$301,26,0),0)","v":"ELİZAN BAŞAR (ANK)"},{"$f":"IFERROR(VLOOKUP(N158,Kura!$A$4:$G$301,5,0),0)","v":"AFAD SPOR KULUBÜ"},null,null,null,null,null,null,null,null,null,null,0]
["52.52",null,156,null,{"$f":"IFERROR(VLOOKUP(C159,Kura!$A$4:$Z$301,26,0),0)","v":0},null,null,null,{"$f":"IFERROR(VLOOKUP(C159,Kura!$A$4:$G$301,5,0),0)","v":0}]
[]
[53,"E53",73,null,{"$f":"IFERROR(VLOOKUP(C161,Kura!$A$4:$Z$301,26,0),0)","v":"ESLEM SENA ERCİYAS (ORD)"},null,{"$f":"IF(AND(F161=0,F162=0),\"\",IF(F161>F162,E161,E162))","v":""},null,{"$f":"IFERROR(VLOOKUP(C161,Kura!$A$4:$G$301,5,0),0)","v":"ORDU GENÇLİK VE SPOR KULÜBÜ"},null,null,"E53",53,{"$f":"OFFSET(Sablon!$CL$1,M161,Kura!$AW$1)","v":14},{"$f":"IFERROR(VLOOKUP(N161,Kura!$A$4:$Z$301,26,0),0)","v":"NEHİR DUYURAN (ANK)"},{"$f":"IFERROR(VLOOKUP(N161,Kura!$A$4:$G$301,5,0),0)","v":"KARİYER EĞİTİM SPOR KULÜBÜ "},null,null,null,null,null,null,null,null,null,null,0]
["53.53",null,157,null,{"$f":"IFERROR(VLOOKUP(C162,Kura!$A$4:$Z$301,26,0),0)","v":0},null,null,null,{"$f":"IFERROR(VLOOKUP(C162,Kura!$A$4:$G$301,5,0),0)","v":0}]
[]
[54,"E54",37,null,{"$f":"IFERROR(VLOOKUP(C164,Kura!$A$4:$Z$301,26,0),0)","v":"ESMA KAMER SÜT (KYS)"},null,{"$f":"IF(AND(F164=0,F165=0),\"\",IF(F164>F165,E164,E165))","v":""},null,{"$f":"IFERROR(VLOOKUP(C164,Kura!$A$4:$G$301,5,0),0)","v":"SPOR A.Ş GENÇLİK VE S.K DERNEĞİ"},null,null,"E54",54,{"$f":"OFFSET(Sablon!$CL$1,M164,Kura!$AW$1)","v":13},{"$f":"IFERROR(VLOOKUP(N164,Kura!$A$4:$Z$301,26,0),0)","v":"İPEK ERTUNA (ANK)"},{"$f":"IFERROR(VLOOKUP(N164,Kura!$A$4:$G$301,5,0),0)","v":"AFAD SPOR KULUBÜ"},null,null,null,null,null,null,null,null,null,null,0]
["54.54",null,158,null,{"$f":"IFERROR(VLOOKUP(C165,Kura!$A$4:$Z$301,26,0),0)","v":0},null,null,null,{"$f":"IFERROR(VLOOKUP(C165,Kura!$A$4:$G$301,5,0),0)","v":0}]
[]
[55,"E55",51,null,{"$f":"IFERROR(VLOOKUP(C167,Kura!$A$4:$Z$301,26,0),0)","v":"KAREN GÜRBÜZ (ADN)"},null,{"$f":"IF(AND(F167=0,F168=0),\"\",IF(F167>F168,E167,E168))","v":""},null,{"$f":"IFERROR(VLOOKUP(C167,Kura!$A$4:$G$301,5,0),0)","v":"ÇİLTAR MTİ"},null,null,"E55",55,{"$f":"OFFSET(Sablon!$CL$1,M167,Kura!$AW$1)","v":15},{"$f":"IFERROR(VLOOKUP(N167,Kura!$A$4:$Z$301,26,0),0)","v":"ÖZLEM KÖSEOĞLU (RİZ)"},{"$f":"IFERROR(VLOOKUP(N167,Kura!$A$4:$G$301,5,0),0)","v":"ÇAYKUR RİZESPOR"},null,null,null,null,null,null,null,null,null,null,0]
["55.55",null,159,null,{"$f":"IFERROR(VLOOKUP(C168,Kura!$A$4:$Z$301,26,0),0)","v":0},null,null,null,{"$f":"IFERROR(VLOOKUP(C168,Kura!$A$4:$G$301,5,0),0)","v":0}]
[]
[56,"E56",56,null,{"$f":"IFERROR(VLOOKUP(C170,Kura!$A$4:$Z$301,26,0),0)","v":"MİRAÇ DENİZ AKAR (TKD)"},null,{"$f":"IF(AND(F170=0,F171=0),\"\",IF(F170>F171,E170,E171))","v":""},null,{"$f":"IFERROR(VLOOKUP(C170,Kura!$A$4:$G$301,5,0),0)","v":"ÇERKEZKÖY BELEDİYESİ GENÇLİK VE SPOR KULÜBÜ "},null,null,"E56",56,{"$f":"OFFSET(Sablon!$CL$1,M170,Kura!$AW$1)","v":16},{"$f":"IFERROR(VLOOKUP(N170,Kura!$A$4:$Z$301,26,0),0)","v":"CEYLİN AKDANALI (ÇRM)"},{"$f":"IFERROR(VLOOKUP(N170,Kura!$A$4:$G$301,5,0),0)","v":"GENÇLİKSPOR "},null,null,null,null,null,null,null,null,null,null,0]
["56.56",null,160,null,{"$f":"IFERROR(VLOOKUP(C171,Kura!$A$4:$Z$301,26,0),0)","v":0},null,null,null,{"$f":"IFERROR(VLOOKUP(C171,Kura!$A$4:$G$301,5,0),0)","v":0}]
[]
[57,"E57",88,null,{"$f":"IFERROR(VLOOKUP(C173,Kura!$A$4:$Z$301,26,0),0)","v":"NAZLINUR AKGÜN (ANT)"},null,{"$f":"IF(AND(F173=0,F174=0),\"\",IF(F173>F174,E173,E174))","v":""},null,{"$f":"IFERROR(VLOOKUP(C173,Kura!$A$4:$G$301,5,0),0)","v":"ANTALYASPOR"},null,null,"E57",57,{"$f":"OFFSET(Sablon!$CL$1,M173,Kura!$AW$1)","v":6},{"$f":"IFERROR(VLOOKUP(N173,Kura!$A$4:$Z$301,26,0),0)","v":"DURU KIRBAÇ (İST)"},{"$f":"IFERROR(VLOOKUP(N173,Kura!$A$4:$G$301,5,0),0)","v":"PENDİK BELEDİYESPOR"},null,null,null,null,null,null,null,null,null,null,0]
["57.57",null,161,null,{"$f":"IFERROR(VLOOKUP(C174,Kura!$A$4:$Z$301,26,0),0)","v":0},null,null,null,{"$f":"IFERROR(VLOOKUP(C174,Kura!$A$4:$G$301,5,0),0)","v":0}]
[]
[58,"E58",38,null,{"$f":"IFERROR(VLOOKUP(C176,Kura!$A$4:$Z$301,26,0),0)","v":"BERRA BAHTİYAR (SKR)"},null,{"$f":"IF(AND(F176=0,F177=0),\"\",IF(F176>F177,E176,E177))","v":""},null,{"$f":"IFERROR(VLOOKUP(C176,Kura!$A$4:$G$301,5,0),0)","v":"SAKARYA BÜYÜKŞEHİR BELEDİYE SPOR KULÜBÜ"},null,null,"E58",58,{"$f":"OFFSET(Sablon!$CL$1,M176,Kura!$AW$1)","v":5},{"$f":"IFERROR(VLOOKUP(N176,Kura!$A$4:$Z$301,26,0),0)","v":"EYLÜL ŞEVVAL AYDIN (İST)"},{"$f":"IFERROR(VLOOKUP(N176,Kura!$A$4:$G$301,5,0),0)","v":"PENDİK BELEDİYESPOR"},null,null,null,null,null,null,null,null,null,null,0]
["58.58",null,162,null,{"$f":"IFERROR(VLOOKUP(C177,Kura!$A$4:$Z$301,26,0),0)","v":0},null,null,null,{"$f":"IFERROR(VLOOKUP(C177,Kura!$A$4:$G$301,5,0),0)","v":0}]
[]
[59,"E59",62,null,{"$f":"IFERROR(VLOOKUP(C179,Kura!$A$4:$Z$301,26,0),0)","v":"BERRA AKICI (SKR)"},null,{"$f":"IF(AND(F179=0,F180=0),\"\",IF(F179>F180,E179,E180))","v":""},null,{"$f":"IFERROR(VLOOKUP(C179,Kura!$A$4:$G$301,5,0),0)","v":"SAKARYA BÜYÜKŞEHİR BELEDİYE SPOR KULÜBÜ"},null,null,"E59",59,{"$f":"OFFSET(Sablon!$CL$1,M179,Kura!$AW$1)","v":7},{"$f":"IFERROR(VLOOKUP(N179,Kura!$A$4:$Z$301,26,0),0)","v":"ZEYNEP ADA ER (ANK)"},{"$f":"IFERROR(VLOOKUP(N179,Kura!$A$4:$G$301,5,0),0)","v":"AFAD SPOR KULUBÜ"},null,null,null,null,null,null,null,null,null,null,0]
["59.59",null,163,null,{"$f":"IFERROR(VLOOKUP(C180,Kura!$A$4:$Z$301,26,0),0)","v":0},null,null,null,{"$f":"IFERROR(VLOOKUP(C180,Kura!$A$4:$G$301,5,0),0)","v":0}]
[]
[60,"E60",89,null,{"$f":"IFERROR(VLOOKUP(C182,Kura!$A$4:$Z$301,26,0),0)","v":"HİLAL ECEM MUSLU (ZNG)"},null,{"$f":"IF(AND(F182=0,F183=0),\"\",IF(F182>F183,E182,E183))","v":""},null,{"$f":"IFERROR(VLOOKUP(C182,Kura!$A$4:$G$301,5,0),0)","v":"ÖZEL İDARE YOLSPOR"},null,null,"E60",60,{"$f":"OFFSET(Sablon!$CL$1,M182,Kura!$AW$1)","v":8},{"$f":"IFERROR(VLOOKUP(N182,Kura!$A$4:$Z$301,26,0),0)","v":"DURU ŞENDOĞAN (RİZ)"},{"$f":"IFERROR(VLOOKUP(N182,Kura!$A$4:$G$301,5,0),0)","v":"ÇAYKUR RİZESPOR"},null,null,null,null,null,null,null,null,null,null,0]
["60.60",null,164,null,{"$f":"IFERROR(VLOOKUP(C183,Kura!$A$4:$Z$301,26,0),0)","v":0},null,null,null,{"$f":"IFERROR(VLOOKUP(C183,Kura!$A$4:$G$301,5,0),0)","v":0}]
[]
[61,"E61",35,null,{"$f":"IFERROR(VLOOKUP(C185,Kura!$A$4:$Z$301,26,0),0)","v":"ESMA SULTAN SARI (SKR)"},null,{"$f":"IF(AND(F185=0,F186=0),\"\",IF(F185>F186,E185,E186))","v":""},null,{"$f":"IFERROR(VLOOKUP(C185,Kura!$A$4:$G$301,5,0),0)","v":"SAKARYA BÜYÜKŞEHİR BELEDİYE SPOR KULÜBÜ"},null,null,"E61",61,{"$f":"OFFSET(Sablon!$CL$1,M185,Kura!$AW$1)","v":3},{"$f":"IFERROR(VLOOKUP(N185,Kura!$A$4:$Z$301,26,0),0)","v":"ELİF ECE AKYÜREK (ADN)"},{"$f":"IFERROR(VLOOKUP(N185,Kura!$A$4:$G$301,5,0),0)","v":"ÇİLTAR MTİ"},null,null,null,null,null,null,null,null,null,null,0]
["61.61",null,165,null,{"$f":"IFERROR(VLOOKUP(C186,Kura!$A$4:$Z$301,26,0),0)","v":0},null,null,null,{"$f":"IFERROR(VLOOKUP(C186,Kura!$A$4:$G$301,5,0),0)","v":0}]
[]
[62,"E62",39,null,{"$f":"IFERROR(VLOOKUP(C188,Kura!$A$4:$Z$301,26,0),0)","v":"ECRİN FİDAN (BRS)"},null,{"$f":"IF(AND(F188=0,F189=0),\"\",IF(F188>F189,E188,E189))","v":""},null,{"$f":"IFERROR(VLOOKUP(C188,Kura!$A$4:$G$301,5,0),0)","v":"BURSA BÜYÜKŞEHİR BELEDİYESPOR"},null,null,"E62",62,{"$f":"OFFSET(Sablon!$CL$1,M188,Kura!$AW$1)","v":4},{"$f":"IFERROR(VLOOKUP(N188,Kura!$A$4:$Z$301,26,0),0)","v":"HATİCE ELİF GÜVELİ (İST)"},{"$f":"IFERROR(VLOOKUP(N188,Kura!$A$4:$G$301,5,0),0)","v":"PENDİK BELEDİYESPOR"},null,null,null,null,null,null,null,null,null,null,0]
["62.62",null,166,null,{"$f":"IFERROR(VLOOKUP(C189,Kura!$A$4:$Z$301,26,0),0)","v":0},null,null,null,{"$f":"IFERROR(VLOOKUP(C189,Kura!$A$4:$G$301,5,0),0)","v":0}]
[]
[63,"E63",83,null,{"$f":"IFERROR(VLOOKUP(C191,Kura!$A$4:$Z$301,26,0),0)","v":"ELANUR DEMİR (İST)"},null,{"$f":"IF(AND(F191=0,F192=0),\"\",IF(F191>F192,E191,E192))","v":""},null,{"$f":"IFERROR(VLOOKUP(C191,Kura!$A$4:$G$301,5,0),0)","v":"İSTANBUL BÜYÜKŞEHİR BELEDİYE"},null,null,"E63",63,{"$f":"OFFSET(Sablon!$CL$1,M191,Kura!$AW$1)","v":2},{"$f":"IFERROR(VLOOKUP(N191,Kura!$A$4:$Z$301,26,0),0)","v":"GÜLCE DÖNMEZ (KNY)"},{"$f":"IFERROR(VLOOKUP(N191,Kura!$A$4:$G$301,5,0),0)","v":"SELÇUKLU BELEDİYE SPOR KULÜBÜ"},null,null,null,null,null,null,null,null,null,null,0]
["63.63",null,167,null,{"$f":"IFERROR(VLOOKUP(C192,Kura!$A$4:$Z$301,26,0),0)","v":0},null,null,null,{"$f":"IFERROR(VLOOKUP(C192,Kura!$A$4:$G$301,5,0),0)","v":0}]
[]
[64,"E64",72,null,{"$f":"IFERROR(VLOOKUP(C194,Kura!$A$4:$Z$301,26,0),0)","v":"ÖZGE ARI (KRL)"},null,{"$f":"IF(AND(F194=0,F195=0),\"\",IF(F194>F195,E194,E195))","v":""},null,{"$f":"IFERROR(VLOOKUP(C194,Kura!$A$4:$G$301,5,0),0)","v":"ZİRVE GSK"},null,null,"E64",64,{"$f":"OFFSET(Sablon!$CL$1,M194,Kura!$AW$1)","v":1},{"$f":"IFERROR(VLOOKUP(N194,Kura!$A$4:$Z$301,26,0),0)","v":"NİL BAŞARAN (İST)"},{"$f":"IFERROR(VLOOKUP(N194,Kura!$A$4:$G$301,5,0),0)","v":"PENDİK BELEDİYESPOR"},null,null,null,null,null,null,null,null,null,null,0]
["64.64",null,168,null,{"$f":"IFERROR(VLOOKUP(C195,Kura!$A$4:$Z$301,26,0),0)","v":0},null,null,null,{"$f":"IFERROR(VLOOKUP(C195,Kura!$A$4:$G$301,5,0),0)","v":0}]

{"sheet":"Eleme","index":3,"n_rows":195,"n_cols":105,"rows_kept":195,"cut":false,"hidden":false,"merged":[[22,12,22,18],[14,5,14,11],[15,5,15,11],[17,5,17,11],[18,5,18,11],[20,5,20,11],[21,5,21,11],[13,12,13,18],[16,12,16,18],[19,12,19,18],[23,5,23,11],[24,5,24,11],[26,5,26,11],[27,5,27,11],[29,5,29,11],[30,5,30,11],[32,5,32,11],[25,12,25,18],[28,12,28,18],[31,12,31,18],[33,5,33,11],[35,5,35,11],[36,5,36,11],[38,5,38,11],[39,5,39,11],[41,5,41,11],[34,12,34,18],[37,12,37,18],[40,12,40,18],[42,5,42,11],[44,5,44,11],[45,5,45,11],[47,5,47,11],[48,5,48,11],[50,5,50,11],[51,5,51,11],[43,12,43,18],[46,12,46,18],[49,12,49,18],[53,5,53,11],[54,5,54,11],[56,5,56,11],[57,5,57,11],[59,5,59,11],[60,5,60,11],[52,12,52,18],[55,12,55,18],[58,12,58,18],[62,5,62,11],[63,5,63,11],[65,5,65,11],[66,5,66,11],[68,5,68,11],[69,5,69,11],[67,19,67,25],[70,19,70,25],[61,12,61,18],[64,12,64,18],[67,12,67,18],[70,12,70,18],[71,5,71,11],[72,5,72,11],[74,5,74,11],[75,5,75,11],[77,5,77,11],[78,5,78,11],[80,5,80,11],[73,19,73,25],[76,19,76,25],[79,19,79,25],[73,12,73,18],[76,12,76,18],[79,12,79,18],[81,5,81,11],[83,5,83,11],[84,5,84,11],[86,5,86,11],[87,5,87,11],[89,5,89,11],[82,19,82,25],[85,19,85,25],[88,19,88,25],[82,12,82,18],[85,12,85,18],[88,12,88,18],[108,33,108,39],[90,5,90,11],[92,5,92,11],[93,5,93,11],[95,5,95,11],[96,5,96,11],[98,5,98,11],[99,5,99,11],[91,19,91,25],[94,19,94,25],[97,19,97,25],[91,12,91,18],[94,12,94,18],[97,12,97,18],[100,12,100,18],[90,26,90,32],[96,26,96,32],[102,26,102,32],[108,26,108,32],[101,5,101,11],[102,5,102,11],[114,5,114,11],[116,5,116,11],[117,5,117,11],[109,19,109,25],[112,19,112,25],[115,19,115,25],[103,12,103,18],[115,12,115,18],[118,12,118,18],[103,19,103,25],[106,19,106,25],[106,12,106,18],[104,5,104,11],[105,5,105,11],[107,5,107,11],[108,5,108,11],[110,5,110,11],[111,5,111,11],[113,5,113,11],[119,5,119,11],[120,5,120,11],[122,5,122,11],[123,5,123,11],[125,5,125,11],[126,5,126,11],[128,5,128,11],[121,19,121,25],[124,19,124,25],[127,19,127,25],[121,12,121,18],[124,12,124,18],[127,12,127,18],[129,5,129,11],[131,5,131,11],[132,5,132,11],[134,5,134,11],[135,5,135,11],[137,5,137,11],[130,19,130,25],[133,19,133,25],[136,19,136,25],[130,12,130,18],[133,12,133,18],[136,12,136,18],[138,5,138,11],[140,5,140,11],[141,5,141,11],[143,5,143,11],[144,5,144,11],[146,5,146,11],[147,5,147,11],[139,19,139,25],[142,19,142,25],[145,19,145,25],[142,12,142,18],[145,12,145,18],[139,12,139,18],[149,5,149,11],[150,5,150,11],[152,5,152,11],[153,5,153,11],[155,5,155,11],[156,5,156,11],[166,12,166,18],[148,19,148,25],[151,19,151,25],[154,19,154,25],[148,12,148,18],[151,12,151,18],[154,12,154,18],[0,5,0,32],[1,5,1,32],[180,5,180,11],[182,5,182,11],[183,5,183,11],[185,5,185,11],[186,5,186,11],[188,5,188,11],[189,5,189,11],[158,5,158,11],[159,5,159,11],[161,5,161,11],[162,5,162,11],[164,5,164,11],[165,5,165,11],[167,5,167,11],[168,5,168,11],[170,5,170,11],[171,5,171,11],[173,5,173,11],[174,5,174,11],[176,5,176,11],[177,5,177,11],[179,5,179,11],[3,5,3,11],[5,5,5,11],[6,5,6,11],[8,5,8,11],[9,5,9,11],[11,5,11,11],[12,5,12,11],[5,33,5,39],[4,12,4,18],[7,12,7,18],[10,12,10,18],[6,26,6,32],[12,26,12,32],[12,33,12,39],[191,5,191,11],[192,5,192,11],[194,5,194,11],[4,19,4,25],[7,19,7,25],[10,19,10,25],[13,19,13,25],[16,19,16,25],[19,19,19,25],[22,19,22,25],[25,19,25,25],[28,19,28,25],[31,19,31,25],[34,19,34,25],[37,19,37,25],[40,19,40,25],[43,19,43,25],[46,19,46,25],[49,19,49,25],[52,19,52,25],[55,19,55,25],[58,19,58,25],[61,19,61,25],[64,19,64,25],[178,12,178,18],[181,12,181,18],[184,12,184,18],[187,12,187,18],[190,12,190,18],[193,12,193,18],[169,19,169,25],[172,19,172,25],[175,19,175,25],[178,19,178,25],[181,19,181,25],[184,19,184,25],[187,19,187,25],[190,19,190,25],[193,19,193,25],[36,26,36,32],[42,26,42,32],[48,26,48,32],[54,26,54,32],[60,26,60,32],[66,26,66,32],[169,12,169,18],[172,12,172,18],[175,12,175,18],[157,19,157,25],[160,19,160,25],[163,19,163,25],[166,19,166,25],[157,12,157,18],[160,12,160,18],[163,12,163,18],[118,19,118,25],[109,12,109,18],[112,12,112,18],[100,19,100,25],[132,26,132,32],[138,26,138,32],[168,26,168,32],[174,26,174,32],[17,33,17,39],[24,33,24,39],[29,33,29,39],[36,33,36,39],[41,33,41,39],[48,33,48,39],[53,33,53,39],[60,33,60,39],[126,26,126,32],[65,33,65,39],[72,33,72,39],[77,33,77,39],[84,33,84,39],[89,33,89,39],[96,33,96,39],[101,33,101,39],[72,26,72,32],[78,26,78,32],[84,26,84,32],[114,26,114,32],[120,26,120,32],[18,26,18,32],[24,26,24,32],[30,26,30,32],[180,26,180,32],[186,26,186,32],[192,26,192,32],[144,26,144,32],[132,33,132,39],[137,33,137,39],[144,33,144,39],[149,33,149,39],[156,33,156,39],[161,33,161,39],[150,26,150,32],[156,26,156,32],[162,26,162,32],[168,33,168,39],[173,33,173,39],[180,33,180,39],[185,33,185,39],[192,33,192,39],[9,40,9,46],[21,40,21,46],[33,40,33,46],[45,40,45,46],[57,40,57,46],[69,40,69,46],[81,40,81,46],[93,40,93,46],[105,40,105,46],[117,40,117,46],[129,40,129,46],[141,40,141,46],[153,40,153,46],[165,40,165,46],[177,40,177,46],[189,40,189,46],[113,33,113,39],[120,33,120,39],[125,33,125,39]]}
[null,null,null,null,null,{"$f":"Kura!AC1","v":"TÜRKİYE MASA TENİSİ FEDERASYONU\nKÜÇÜKLER FEDERASYON KUPASI"},null,null,null,null,null,null,null,null,null,null,null,null,null,null,null,null,null,null,null,null,null,null,null,null,null,null,null,null,null,null,null,null,null,null,null,null,null,null,null,null,null,null,null,null,null,null,null,null,null,null,null,null,null,null,null,null,null,null,null,null,2,null,null,null,null,null,null,null,null,null,null,null,null,null,null,null,null,null,null,null,null,null,null,null,null,null,null,null,null,null,null,null,null,null,null,null,null,null,1]
[null,null,null,null,null,{"$f":"Kura!AC2&\" \"&Kura!AD3","v":"TEK KIZ [15-16 Nisan Amasya] [ Eleme ]"}]
["Y","S","B","Q","#"]
[1,1,0,0,1,{"$f":"VLOOKUP(E4,Kura!$A$4:$Z$301,26,0)","v":"NİL BAŞARAN (İST)"},{"$f":"+Kura!AJ4","v":0},{"$f":"+Kura!AK4","v":0},{"$f":"+Kura!AL4","v":0},{"$f":"+Kura!AM4","v":0},{"$f":"+Kura!AN4","v":0},{"$f":"+Kura!#REF!","v":{"$error":"#REF!"}},null,null,null,null,null,null,null,null,null,null,null,null,null,null,null,null,null,null,null,null,null,null,null,null,null,null,null,null,null,null,null,null,null,null,null,null,null,null,"Ön eleme müsabakasını kazanan sporcular "]
[null,null,null,null,null,null,null,3,0,null,null,1,{"$f":"IF(AND(H5=0,I5=0),\"\",IF(H5>I5,F4,F6))","v":"NİL BAŞARAN (İST)"},null,null,null,null,null,null,{"$f":"IF(AND(H5=0,I5=0),\"\",IF(H5>I5,F4,F6))","v":"NİL BAŞARAN (İST)"},null,null,null,null,null,null,null,null,null,null,null,null,null,null,null,null,null,null,null,null,null,null,null,null,null,null,null,null,null,null,"E1",{"$f":"VLOOKUP(On_Eleme!G5,CHOOSE({3,2,1},On_Eleme!$C$5:$C$200,On_Eleme!$D$5:$D$200,On_Eleme!$E$5:$E$200),3,0)","v":{"$error":"#N/A"}},"E9",{"$f":"VLOOKUP(On_Eleme!G29,CHOOSE({3,2,1},On_Eleme!$C$5:$C$200,On_Eleme!$D$5:$D$200,On_Eleme!$E$5:$E$200),3,0)","v":{"$error":"#N/A"}},"E17",{"$f":"VLOOKUP(On_Eleme!G53,CHOOSE({3,2,1},On_Eleme!$C$5:$C$200,On_Eleme!$D$5:$D$200,On_Eleme!$E$5:$E$200),3,0)","v":{"$error":"#N/A"}},"E25",{"$f":"VLOOKUP(On_Eleme!G77,CHOOSE({3,2,1},On_Eleme!$C$5:$C$200,On_Eleme!$D$5:$D$200,On_Eleme!$E$5:$E$200),3,0)","v":{"$error":"#N/A"}},"E33",{"$f":"VLOOKUP(On_Eleme!G101,CHOOSE({3,2,1},On_Eleme!$C$5:$C$200,On_Eleme!$D$5:$D$200,On_Eleme!$E$5:$E$200),3,0)","v":{"$error":"#N/A"}},"E41",{"$f":"VLOOKUP(On_Eleme!G125,CHOOSE({3,2,1},On_Eleme!$C$5:$C$200,On_Eleme!$D$5:$D$200,On_Eleme!$E$5:$E$200),3,0)","v":{"$error":"#N/A"}},"E49",{"$f":"VLOOKUP(On_Eleme!G149,CHOOSE({3,2,1},On_Eleme!$C$5:$C$200,On_Eleme!$D$5:$D$200,On_Eleme!$E$5:$E$200),3,0)","v":{"$error":"#N/A"}},"E57",{"$f":"VLOOKUP(On_Eleme!G173,CHOOSE({3,2,1},On_Eleme!$C$5:$C$200,On_Eleme!$D$5:$D$200,On_Eleme!$E$5:$E$200),3,0)","v":{"$error":"#N/A"}}]
[2,65,1,64,999,{"$f":"VLOOKUP(E6,Kura!$A$4:$Z$301,26,0)","v":{"$error":"#N/A"}},{"$f":"+Kura!AJ6","v":0},{"$f":"+Kura!AK6","v":0},{"$f":"+Kura!AL6","v":0},{"$f":"+Kura!AM6","v":0},{"$f":"+Kura!AN6","v":0},{"$f":"+Kura!#REF!","v":{"$error":"#REF!"}},null,null,null,null,null,null,null,null,null,null,null,null,null,65,null,null,null,null,null,null,null,{"$f":"IF(AND(V7=0,W7=0),\"\",IF(V7>W7,T5,T8))","v":"NİL BAŞARAN (İST)"},null,null,null,null,null,null,null,null,null,null,null,null,null,null,null,null,"E2",{"$f":"VLOOKUP(On_Eleme!G8,CHOOSE({3,2,1},On_Eleme!$C$5:$C$200,On_Eleme!$D$5:$D$200,On_Eleme!$E$5:$E$200),3,0)","v":{"$error":"#N/A"}},"E10",{"$f":"VLOOKUP(On_Eleme!G32,CHOOSE({3,2,1},On_Eleme!$C$5:$C$200,On_Eleme!$D$5:$D$200,On_Eleme!$E$5:$E$200),3,0)","v":{"$error":"#N/A"}},"E18",{"$f":"VLOOKUP(On_Eleme!G56,CHOOSE({3,2,1},On_Eleme!$C$5:$C$200,On_Eleme!$D$5:$D$200,On_Eleme!$E$5:$E$200),3,0)","v":{"$error":"#N/A"}},"E26",{"$f":"VLOOKUP(On_Eleme!G80,CHOOSE({3,2,1},On_Eleme!$C$5:$C$200,On_Eleme!$D$5:$D$200,On_Eleme!$E$5:$E$200),3,0)","v":{"$error":"#N/A"}},"E34",{"$f":"VLOOKUP(On_Eleme!G104,CHOOSE({3,2,1},On_Eleme!$C$5:$C$200,On_Eleme!$D$5:$D$200,On_Eleme!$E$5:$E$200),3,0)","v":{"$error":"#N/A"}},"E42",{"$f":"VLOOKUP(On_Eleme!G128,CHOOSE({3,2,1},On_Eleme!$C$5:$C$200,On_Eleme!$D$5:$D$200,On_Eleme!$E$5:$E$200),3,0)","v":{"$error":"#N/A"}},"E50",{"$f":"VLOOKUP(On_Eleme!G152,CHOOSE({3,2,1},On_Eleme!$C$5:$C$200,On_Eleme!$D$5:$D$200,On_Eleme!$E$5:$E$200),3,0)","v":{"$error":"#N/A"}},"E58",{"$f":"VLOOKUP(On_Eleme!G176,CHOOSE({3,2,1},On_Eleme!$C$5:$C$200,On_Eleme!$D$5:$D$200,On_Eleme!$E$5:$E$200),3,0)","v":{"$error":"#N/A"}}]
[3,65,33,32,999,{"$f":"VLOOKUP(E7,Kura!$A$4:$Z$301,26,0)","v":{"$error":"#N/A"}},{"$f":"+Kura!AJ7","v":0},{"$f":"+Kura!AK7","v":0},{"$f":"+Kura!AL7","v":0},{"$f":"+Kura!AM7","v":0},{"$f":"+Kura!AN7","v":0},{"$f":"+Kura!#REF!","v":{"$error":"#REF!"}},null,null,null,null,null,null,null,null,null,3,0,null,null,null,{"$f":"IF(AND(V7=0,W7=0),\"\",IF(V7>W7,T5,T8))","v":"NİL BAŞARAN (İST)"},null,null,null,null,null,null,null,null,null,null,null,null,97,null,null,null,null,null,null,null,null,null,null,"E3",{"$f":"VLOOKUP(On_Eleme!G11,CHOOSE({3,2,1},On_Eleme!$C$5:$C$200,On_Eleme!$D$5:$D$200,On_Eleme!$E$5:$E$200),3,0)","v":{"$error":"#N/A"}},"E11",{"$f":"VLOOKUP(On_Eleme!G35,CHOOSE({3,2,1},On_Eleme!$C$5:$C$200,On_Eleme!$D$5:$D$200,On_Eleme!$E$5:$E$200),3,0)","v":{"$error":"#N/A"}},"E19",{"$f":"VLOOKUP(On_Eleme!G59,CHOOSE({3,2,1},On_Eleme!$C$5:$C$200,On_Eleme!$D$5:$D$200,On_Eleme!$E$5:$E$200),3,0)","v":{"$error":"#N/A"}},"E27",{"$f":"VLOOKUP(On_Eleme!G83,CHOOSE({3,2,1},On_Eleme!$C$5:$C$200,On_Eleme!$D$5:$D$200,On_Eleme!$E$5:$E$200),3,0)","v":{"$error":"#N/A"}},"E35",{"$f":"VLOOKUP(On_Eleme!G107,CHOOSE({3,2,1},On_Eleme!$C$5:$C$200,On_Eleme!$D$5:$D$200,On_Eleme!$E$5:$E$200),3,0)","v":{"$error":"#N/A"}},"E43",{"$f":"VLOOKUP(On_Eleme!G131,CHOOSE({3,2,1},On_Eleme!$C$5:$C$200,On_Eleme!$D$5:$D$200,On_Eleme!$E$5:$E$200),3,0)","v":{"$error":"#N/A"}},"E51",{"$f":"VLOOKUP(On_Eleme!G155,CHOOSE({3,2,1},On_Eleme!$C$5:$C$200,On_Eleme!$D$5:$D$200,On_Eleme!$E$5:$E$200),3,0)","v":{"$error":"#N/A"}},"E59",{"$f":"VLOOKUP(On_Eleme!G179,CHOOSE({3,2,1},On_Eleme!$C$5:$C$200,On_Eleme!$D$5:$D$200,On_Eleme!$E$5:$E$200),3,0)","v":{"$error":"#N/A"}}]
[null,null,null,null,null,null,null,0,0,null,null,2,{"$f":"IF(AND(H8=0,I8=0),\"\",IF(H8>I8,F7,F9))","v":""},null,null,null,null,null,null,{"$f":"IF(AND(H8=0,I8=0),\"\",IF(H8>I8,F7,F9))","v":""},null,null,null,null,null,null,null,null,null,null,null,null,null,null,null,null,null,null,null,null,null,null,null,null,null,null,null,null,null,null,"E4",{"$f":"VLOOKUP(On_Eleme!G14,CHOOSE({3,2,1},On_Eleme!$C$5:$C$200,On_Eleme!$D$5:$D$200,On_Eleme!$E$5:$E$200),3,0)","v":{"$error":"#N/A"}},"E12",{"$f":"VLOOKUP(On_Eleme!G38,CHOOSE({3,2,1},On_Eleme!$C$5:$C$200,On_Eleme!$D$5:$D$200,On_Eleme!$E$5:$E$200),3,0)","v":{"$error":"#N/A"}},"E20",{"$f":"VLOOKUP(On_Eleme!G62,CHOOSE({3,2,1},On_Eleme!$C$5:$C$200,On_Eleme!$D$5:$D$200,On_Eleme!$E$5:$E$200),3,0)","v":{"$error":"#N/A"}},"E28",{"$f":"VLOOKUP(On_Eleme!G86,CHOOSE({3,2,1},On_Eleme!$C$5:$C$200,On_Eleme!$D$5:$D$200,On_Eleme!$E$5:$E$200),3,0)","v":{"$error":"#N/A"}},"E36",{"$f":"VLOOKUP(On_Eleme!G110,CHOOSE({3,2,1},On_Eleme!$C$5:$C$200,On_Eleme!$D$5:$D$200,On_Eleme!$E$5:$E$200),3,0)","v":{"$error":"#N/A"}},"E44",{"$f":"VLOOKUP(On_Eleme!G134,CHOOSE({3,2,1},On_Eleme!$C$5:$C$200,On_Eleme!$D$5:$D$200,On_Eleme!$E$5:$E$200),3,0)","v":{"$error":"#N/A"}},"E52",{"$f":"VLOOKUP(On_Eleme!G158,CHOOSE({3,2,1},On_Eleme!$C$5:$C$200,On_Eleme!$D$5:$D$200,On_Eleme!$E$5:$E$200),3,0)","v":{"$error":"#N/A"}},"E60",{"$f":"VLOOKUP(On_Eleme!G182,CHOOSE({3,2,1},On_Eleme!$C$5:$C$200,On_Eleme!$D$5:$D$200,On_Eleme!$E$5:$E$200),3,0)","v":{"$error":"#N/A"}}]
[4,33,0,0,999,{"$f":"VLOOKUP(E9,Kura!$A$4:$Z$301,26,0)","v":{"$error":"#N/A"}},{"$f":"+Kura!AJ9","v":0},{"$f":"+Kura!AK9","v":0},{"$f":"+Kura!AL9","v":0},{"$f":"+Kura!AM9","v":0},{"$f":"+Kura!AN9","v":0},{"$f":"+Kura!#REF!","v":{"$error":"#REF!"}},null,null,null,null,null,null,null,null,null,null,null,null,null,null,null,null,null,null,null,null,null,null,null,null,null,null,null,null,null,null,null,null,null,null,null,null,null,null,"E5",{"$f":"VLOOKUP(On_Eleme!G17,CHOOSE({3,2,1},On_Eleme!$C$5:$C$200,On_Eleme!$D$5:$D$200,On_Eleme!$E$5:$E$200),3,0)","v":{"$error":"#N/A"}},"E13",{"$f":"VLOOKUP(On_Eleme!G41,CHOOSE({3,2,1},On_Eleme!$C$5:$C$200,On_Eleme!$D$5:$D$200,On_Eleme!$E$5:$E$200),3,0)","v":{"$error":"#N/A"}},"E21",{"$f":"VLOOKUP(On_Eleme!G65,CHOOSE({3,2,1},On_Eleme!$C$5:$C$200,On_Eleme!$D$5:$D$200,On_Eleme!$E$5:$E$200),3,0)","v":{"$error":"#N/A"}},"E29",{"$f":"VLOOKUP(On_Eleme!G89,CHOOSE({3,2,1},On_Eleme!$C$5:$C$200,On_Eleme!$D$5:$D$200,On_Eleme!$E$5:$E$200),3,0)","v":{"$error":"#N/A"}},"E37",{"$f":"VLOOKUP(On_Eleme!G113,CHOOSE({3,2,1},On_Eleme!$C$5:$C$200,On_Eleme!$D$5:$D$200,On_Eleme!$E$5:$E$200),3,0)","v":{"$error":"#N/A"}},"E45",{"$f":"VLOOKUP(On_Eleme!G137,CHOOSE({3,2,1},On_Eleme!$C$5:$C$200,On_Eleme!$D$5:$D$200,On_Eleme!$E$5:$E$200),3,0)","v":{"$error":"#N/A"}},"E53",{"$f":"VLOOKUP(On_Eleme!G161,CHOOSE({3,2,1},On_Eleme!$C$5:$C$200,On_Eleme!$D$5:$D$200,On_Eleme!$E$5:$E$200),3,0)","v":{"$error":"#N/A"}},"E61",{"$f":"VLOOKUP(On_Eleme!G185,CHOOSE({3,2,1},On_Eleme!$C$5:$C$200,On_Eleme!$D$5:$D$200,On_Eleme!$E$5:$E$200),3,0)","v":{"$error":"#N/A"}}]
[5,33,0,0,41,{"$f":"VLOOKUP(E10,Kura!$A$4:$Z$301,26,0)","v":"ŞEVVAL ALAŞ (BTM)"},{"$f":"+Kura!AJ10","v":0},{"$f":"+Kura!AK10","v":0},{"$f":"+Kura!AL10","v":0},{"$f":"+Kura!AM10","v":0},{"$f":"+Kura!AN10","v":0},{"$f":"+Kura!#REF!","v":{"$error":"#REF!"}},null,null,null,null,null,null,null,null,null,null,null,null,null,null,null,null,null,null,null,null,null,null,null,0,0,null,null,null,{"$f":"IF(AND(AJ10=0,AK10=0),\"\",IF(AJ10>AK10,AH6,AH13))","v":""},null,null,null,null,null,null,null,null,null,"E6",{"$f":"VLOOKUP(On_Eleme!G20,CHOOSE({3,2,1},On_Eleme!$C$5:$C$200,On_Eleme!$D$5:$D$200,On_Eleme!$E$5:$E$200),3,0)","v":{"$error":"#N/A"}},"E14",{"$f":"VLOOKUP(On_Eleme!G44,CHOOSE({3,2,1},On_Eleme!$C$5:$C$200,On_Eleme!$D$5:$D$200,On_Eleme!$E$5:$E$200),3,0)","v":{"$error":"#N/A"}},"E22",{"$f":"VLOOKUP(On_Eleme!G68,CHOOSE({3,2,1},On_Eleme!$C$5:$C$200,On_Eleme!$D$5:$D$200,On_Eleme!$E$5:$E$200),3,0)","v":{"$error":"#N/A"}},"E30",{"$f":"VLOOKUP(On_Eleme!G92,CHOOSE({3,2,1},On_Eleme!$C$5:$C$200,On_Eleme!$D$5:$D$200,On_Eleme!$E$5:$E$200),3,0)","v":{"$error":"#N/A"}},"E38",{"$f":"VLOOKUP(On_Eleme!G116,CHOOSE({3,2,1},On_Eleme!$C$5:$C$200,On_Eleme!$D$5:$D$200,On_Eleme!$E$5:$E$200),3,0)","v":{"$error":"#N/A"}},"E46",{"$f":"VLOOKUP(On_Eleme!G140,CHOOSE({3,2,1},On_Eleme!$C$5:$C$200,On_Eleme!$D$5:$D$200,On_Eleme!$E$5:$E$200),3,0)","v":{"$error":"#N/A"}},"E54",{"$f":"VLOOKUP(On_Eleme!G164,CHOOSE({3,2,1},On_Eleme!$C$5:$C$200,On_Eleme!$D$5:$D$200,On_Eleme!$E$5:$E$200),3,0)","v":{"$error":"#N/A"}},"E62",{"$f":"VLOOKUP(On_Eleme!G188,CHOOSE({3,2,1},On_Eleme!$C$5:$C$200,On_Eleme!$D$5:$D$200,On_Eleme!$E$5:$E$200),3,0)","v":{"$error":"#N/A"}}]
[null,null,null,null,null,null,null,3,0,null,null,3,{"$f":"IF(AND(H11=0,I11=0),\"\",IF(H11>I11,F10,F12))","v":"ŞEVVAL ALAŞ (BTM)"},null,null,null,null,null,null,{"$f":"IF(AND(H11=0,I11=0),\"\",IF(H11>I11,F10,F12))","v":"ŞEVVAL ALAŞ (BTM)"},null,null,null,null,null,null,null,null,null,null,null,null,null,null,null,null,null,null,null,null,null,null,null,null,null,null,null,null,null,null,"E7",{"$f":"VLOOKUP(On_Eleme!G23,CHOOSE({3,2,1},On_Eleme!$C$5:$C$200,On_Eleme!$D$5:$D$200,On_Eleme!$E$5:$E$200),3,0)","v":{"$error":"#N/A"}},"E15",{"$f":"VLOOKUP(On_Eleme!G47,CHOOSE({3,2,1},On_Eleme!$C$5:$C$200,On_Eleme!$D$5:$D$200,On_Eleme!$E$5:$E$200),3,0)","v":{"$error":"#N/A"}},"E23",{"$f":"VLOOKUP(On_Eleme!G71,CHOOSE({3,2,1},On_Eleme!$C$5:$C$200,On_Eleme!$D$5:$D$200,On_Eleme!$E$5:$E$200),3,0)","v":{"$error":"#N/A"}},"E31",{"$f":"VLOOKUP(On_Eleme!G95,CHOOSE({3,2,1},On_Eleme!$C$5:$C$200,On_Eleme!$D$5:$D$200,On_Eleme!$E$5:$E$200),3,0)","v":{"$error":"#N/A"}},"E39",{"$f":"VLOOKUP(On_Eleme!G119,CHOOSE({3,2,1},On_Eleme!$C$5:$C$200,On_Eleme!$D$5:$D$200,On_Eleme!$E$5:$E$200),3,0)","v":{"$error":"#N/A"}},"E47",{"$f":"VLOOKUP(On_Eleme!G143,CHOOSE({3,2,1},On_Eleme!$C$5:$C$200,On_Eleme!$D$5:$D$200,On_Eleme!$E$5:$E$200),3,0)","v":{"$error":"#N/A"}},"E55",{"$f":"VLOOKUP(On_Eleme!G167,CHOOSE({3,2,1},On_Eleme!$C$5:$C$200,On_Eleme!$D$5:$D$200,On_Eleme!$E$5:$E$200),3,0)","v":{"$error":"#N/A"}},"E63",{"$f":"VLOOKUP(On_Eleme!G191,CHOOSE({3,2,1},On_Eleme!$C$5:$C$200,On_Eleme!$D$5:$D$200,On_Eleme!$E$5:$E$200),3,0)","v":{"$error":"#N/A"}}]
[6,65,49,16,42,{"$f":"VLOOKUP(E12,Kura!$A$4:$Z$301,26,0)","v":"FİRDEVSNUR BİNGÖL (YLV)"},{"$f":"+Kura!AJ12","v":0},{"$f":"+Kura!AK12","v":0},{"$f":"+Kura!AL12","v":0},{"$f":"+Kura!AM12","v":0},{"$f":"+Kura!AN12","v":0},{"$f":"+Kura!#REF!","v":{"$error":"#REF!"}},null,null,null,null,null,null,null,null,null,null,null,null,null,66,null,null,null,null,null,null,null,null,null,null,null,null,null,null,null,null,null,null,null,null,null,null,null,null,"E8",{"$f":"VLOOKUP(On_Eleme!G26,CHOOSE({3,2,1},On_Eleme!$C$5:$C$200,On_Eleme!$D$5:$D$200,On_Eleme!$E$5:$E$200),3,0)","v":{"$error":"#N/A"}},"E16",{"$f":"VLOOKUP(On_Eleme!G50,CHOOSE({3,2,1},On_Eleme!$C$5:$C$200,On_Eleme!$D$5:$D$200,On_Eleme!$E$5:$E$200),3,0)","v":{"$error":"#N/A"}},"E24",{"$f":"VLOOKUP(On_Eleme!G74,CHOOSE({3,2,1},On_Eleme!$C$5:$C$200,On_Eleme!$D$5:$D$200,On_Eleme!$E$5:$E$200),3,0)","v":{"$error":"#N/A"}},"E32",{"$f":"VLOOKUP(On_Eleme!G98,CHOOSE({3,2,1},On_Eleme!$C$5:$C$200,On_Eleme!$D$5:$D$200,On_Eleme!$E$5:$E$200),3,0)","v":{"$error":"#N/A"}},"E40",{"$f":"VLOOKUP(On_Eleme!G122,CHOOSE({3,2,1},On_Eleme!$C$5:$C$200,On_Eleme!$D$5:$D$200,On_Eleme!$E$5:$E$200),3,0)","v":{"$error":"#N/A"}},"E48",{"$f":"VLOOKUP(On_Eleme!G146,CHOOSE({3,2,1},On_Eleme!$C$5:$C$200,On_Eleme!$D$5:$D$200,On_Eleme!$E$5:$E$200),3,0)","v":{"$error":"#N/A"}},"E56",{"$f":"VLOOKUP(On_Eleme!G170,CHOOSE({3,2,1},On_Eleme!$C$5:$C$200,On_Eleme!$D$5:$D$200,On_Eleme!$E$5:$E$200),3,0)","v":{"$error":"#N/A"}},"E64",{"$f":"VLOOKUP(On_Eleme!G194,CHOOSE({3,2,1},On_Eleme!$C$5:$C$200,On_Eleme!$D$5:$D$200,On_Eleme!$E$5:$E$200),3,0)","v":{"$error":"#N/A"}}]
[7,65,17,48,43,{"$f":"VLOOKUP(E13,Kura!$A$4:$Z$301,26,0)","v":"FATMANUR DEMİRCİ (KMŞ)"},{"$f":"+Kura!AJ13","v":0},{"$f":"+Kura!AK13","v":0},{"$f":"+Kura!AL13","v":0},{"$f":"+Kura!AM13","v":0},{"$f":"+Kura!AN13","v":0},{"$f":"+Kura!#REF!","v":{"$error":"#REF!"}},null,null,null,null,null,null,null,null,null,3,1,null,null,null,{"$f":"IF(AND(V13=0,W13=0),\"\",IF(V13>W13,T11,T14))","v":"ŞEVVAL ALAŞ (BTM)"},null,null,null,null,null,null,{"$f":"IF(AND(V13=0,W13=0),\"\",IF(V13>W13,T11,T14))","v":"ŞEVVAL ALAŞ (BTM)"}]
[null,null,null,null,null,null,null,0,3,null,null,4,{"$f":"IF(AND(H14=0,I14=0),\"\",IF(H14>I14,F13,F15))","v":"HATİCE RAVZA GÜLCE (KYS)"},null,null,null,null,null,null,{"$f":"IF(AND(H14=0,I14=0),\"\",IF(H14>I14,F13,F15))","v":"HATİCE RAVZA GÜLCE (KYS)"}]
[8,17,0,0,32,{"$f":"VLOOKUP(E15,Kura!$A$4:$Z$301,26,0)","v":"HATİCE RAVZA GÜLCE (KYS)"},{"$f":"+Kura!AJ15","v":0},{"$f":"+Kura!AK15","v":0},{"$f":"+Kura!AL15","v":0},{"$f":"+Kura!AM15","v":0},{"$f":"+Kura!AN15","v":0},{"$f":"+Kura!#REF!","v":{"$error":"#REF!"}}]
[9,17,0,0,17,{"$f":"VLOOKUP(E16,Kura!$A$4:$Z$301,26,0)","v":"ELA SU YÖNTER (ANK)"},{"$f":"+Kura!AJ16","v":0},{"$f":"+Kura!AK16","v":0},{"$f":"+Kura!AL16","v":0},{"$f":"+Kura!AM16","v":0},{"$f":"+Kura!AN16","v":0},{"$f":"+Kura!#REF!","v":{"$error":"#REF!"}}]
[null,null,null,null,null,null,null,3,0,null,null,5,{"$f":"IF(AND(H17=0,I17=0),\"\",IF(H17>I17,F16,F18))","v":"ELA SU YÖNTER (ANK)"},null,null,null,null,null,null,{"$f":"IF(AND(H17=0,I17=0),\"\",IF(H17>I17,F16,F18))","v":"ELA SU YÖNTER (ANK)"}]
[10,65,25,40,44,{"$f":"VLOOKUP(E18,Kura!$A$4:$Z$301,26,0)","v":"MEDİNE İREM TÜRKAN (BTM)"},{"$f":"+Kura!AJ18","v":0},{"$f":"+Kura!AK18","v":0},{"$f":"+Kura!AL18","v":0},{"$f":"+Kura!AM18","v":0},{"$f":"+Kura!AN18","v":0},{"$f":"+Kura!#REF!","v":{"$error":"#REF!"}},null,null,null,null,null,null,null,null,null,null,null,null,null,67,null,null,null,null,null,null,null,{"$f":"IF(AND(V19=0,W19=0),\"\",IF(V19>W19,T17,T20))","v":"ELA SU YÖNTER (ANK)"}]
[11,65,57,8,45,{"$f":"VLOOKUP(E19,Kura!$A$4:$Z$301,26,0)","v":"SÜEDA SİVAS (AMS)"},{"$f":"+Kura!AJ19","v":0},{"$f":"+Kura!AK19","v":0},{"$f":"+Kura!AL19","v":0},{"$f":"+Kura!AM19","v":0},{"$f":"+Kura!AN19","v":0},{"$f":"+Kura!#REF!","v":{"$error":"#REF!"}},null,null,null,null,null,null,null,null,null,3,2,null,null,null,{"$f":"IF(AND(V19=0,W19=0),\"\",IF(V19>W19,T17,T20))","v":"ELA SU YÖNTER (ANK)"},null,null,null,null,null,null,null,null,null,null,null,null,98]
[null,null,null,null,null,null,null,0,3,null,null,6,{"$f":"IF(AND(H20=0,I20=0),\"\",IF(H20>I20,F19,F21))","v":"EMİNE AYDINAY (BRS)"},null,null,null,null,null,null,{"$f":"IF(AND(H20=0,I20=0),\"\",IF(H20>I20,F19,F21))","v":"EMİNE AYDINAY (BRS)"}]
[12,33,0,0,33,{"$f":"VLOOKUP(E21,Kura!$A$4:$Z$301,26,0)","v":"EMİNE AYDINAY (BRS)"},{"$f":"+Kura!AJ21","v":0},{"$f":"+Kura!AK21","v":0},{"$f":"+Kura!AL21","v":0},{"$f":"+Kura!AM21","v":0},{"$f":"+Kura!AN21","v":0},{"$f":"+Kura!#REF!","v":{"$error":"#REF!"}}]
[13,33,0,0,46,{"$f":"VLOOKUP(E22,Kura!$A$4:$Z$301,26,0)","v":"BERRA ARIKAN (ADN)"},{"$f":"+Kura!AJ22","v":0},{"$f":"+Kura!AK22","v":0},{"$f":"+Kura!AL22","v":0},{"$f":"+Kura!AM22","v":0},{"$f":"+Kura!AN22","v":0},{"$f":"+Kura!#REF!","v":{"$error":"#REF!"}},null,null,null,null,null,null,null,null,null,null,null,null,null,null,null,null,null,null,null,null,null,null,null,0,0,null,null,null,{"$f":"IF(AND(AJ22=0,AK22=0),\"\",IF(AJ22>AK22,AH18,AH25))","v":""}]
[null,null,null,null,null,null,null,3,2,null,null,7,{"$f":"IF(AND(H23=0,I23=0),\"\",IF(H23>I23,F22,F24))","v":"BERRA ARIKAN (ADN)"},null,null,null,null,null,null,{"$f":"IF(AND(H23=0,I23=0),\"\",IF(H23>I23,F22,F24))","v":"BERRA ARIKAN (ADN)"}]
[14,65,41,24,47,{"$f":"VLOOKUP(E24,Kura!$A$4:$Z$301,26,0)","v":"AYNUR CANGİR (BTM)"},{"$f":"+Kura!AJ24","v":0},{"$f":"+Kura!AK24","v":0},{"$f":"+Kura!AL24","v":0},{"$f":"+Kura!AM24","v":0},{"$f":"+Kura!AN24","v":0},{"$f":"+Kura!#REF!","v":{"$error":"#REF!"}},null,null,null,null,null,null,null,null,null,null,null,null,null,68]
[15,65,9,56,48,{"$f":"VLOOKUP(E25,Kura!$A$4:$Z$301,26,0)","v":"ELİF KABAAHMETOĞLU (KST)"},{"$f":"+Kura!AJ25","v":0},{"$f":"+Kura!AK25","v":0},{"$f":"+Kura!AL25","v":0},{"$f":"+Kura!AM25","v":0},{"$f":"+Kura!AN25","v":0},{"$f":"+Kura!#REF!","v":{"$error":"#REF!"}},null,null,null,null,null,null,null,null,null,0,3,null,null,null,{"$f":"IF(AND(V25=0,W25=0),\"\",IF(V25>W25,T23,T26))","v":"CEYLİN AKDANALI (ÇRM)"},null,null,null,null,null,null,{"$f":"IF(AND(V25=0,W25=0),\"\",IF(V25>W25,T23,T26))","v":"CEYLİN AKDANALI (ÇRM)"}]
[null,null,null,null,null,null,null,0,3,null,null,8,{"$f":"IF(AND(H26=0,I26=0),\"\",IF(H26>I26,F25,F27))","v":"CEYLİN AKDANALI (ÇRM)"},null,null,null,null,null,null,{"$f":"IF(AND(H26=0,I26=0),\"\",IF(H26>I26,F25,F27))","v":"CEYLİN AKDANALI (ÇRM)"}]
[16,9,0,0,16,{"$f":"VLOOKUP(E27,Kura!$A$4:$Z$301,26,0)","v":"CEYLİN AKDANALI (ÇRM)"},{"$f":"+Kura!AJ27","v":0},{"$f":"+Kura!AK27","v":0},{"$f":"+Kura!AL27","v":0},{"$f":"+Kura!AM27","v":0},{"$f":"+Kura!AN27","v":0},{"$f":"+Kura!#REF!","v":{"$error":"#REF!"}}]
[17,9,0,0,9,{"$f":"VLOOKUP(E28,Kura!$A$4:$Z$301,26,0)","v":"ELİZAN BAŞAR (ANK)"},{"$f":"+Kura!AJ28","v":0},{"$f":"+Kura!AK28","v":0},{"$f":"+Kura!AL28","v":0},{"$f":"+Kura!AM28","v":0},{"$f":"+Kura!AN28","v":0},{"$f":"+Kura!#REF!","v":{"$error":"#REF!"}}]
[null,null,null,null,null,null,null,3,1,null,null,9,{"$f":"IF(AND(H29=0,I29=0),\"\",IF(H29>I29,F28,F30))","v":"ELİZAN BAŞAR (ANK)"},null,null,null,null,null,null,{"$f":"IF(AND(H29=0,I29=0),\"\",IF(H29>I29,F28,F30))","v":"ELİZAN BAŞAR (ANK)"}]
[18,65,13,52,49,{"$f":"VLOOKUP(E30,Kura!$A$4:$Z$301,26,0)","v":"TUANA GÜLER (KRL)"},{"$f":"+Kura!AJ30","v":0},{"$f":"+Kura!AK30","v":0},{"$f":"+Kura!AL30","v":0},{"$f":"+Kura!AM30","v":0},{"$f":"+Kura!AN30","v":0},{"$f":"+Kura!#REF!","v":{"$error":"#REF!"}},null,null,null,null,null,null,null,null,null,null,null,null,null,69,null,null,null,null,null,null,null,{"$f":"IF(AND(V31=0,W31=0),\"\",IF(V31>W31,T29,T32))","v":"ELİZAN BAŞAR (ANK)"}]
[19,65,45,20,50,{"$f":"VLOOKUP(E31,Kura!$A$4:$Z$301,26,0)","v":"ZEYNEP BERRA GÜLOĞLU (VAN)"},{"$f":"+Kura!AJ31","v":0},{"$f":"+Kura!AK31","v":0},{"$f":"+Kura!AL31","v":0},{"$f":"+Kura!AM31","v":0},{"$f":"+Kura!AN31","v":0},{"$f":"+Kura!#REF!","v":{"$error":"#REF!"}},null,null,null,null,null,null,null,null,null,3,0,null,null,null,{"$f":"IF(AND(V31=0,W31=0),\"\",IF(V31>W31,T29,T32))","v":"ELİZAN BAŞAR (ANK)"},null,null,null,null,null,null,null,null,null,null,null,null,99]
[null,null,null,null,null,null,null,0,3,null,null,10,{"$f":"IF(AND(H32=0,I32=0),\"\",IF(H32>I32,F31,F33))","v":"KAREN GÜRBÜZ (ADN)"},null,null,null,null,null,null,{"$f":"IF(AND(H32=0,I32=0),\"\",IF(H32>I32,F31,F33))","v":"KAREN GÜRBÜZ (ADN)"}]
[20,33,0,0,51,{"$f":"VLOOKUP(E33,Kura!$A$4:$Z$301,26,0)","v":"KAREN GÜRBÜZ (ADN)"},{"$f":"+Kura!AJ33","v":0},{"$f":"+Kura!AK33","v":0},{"$f":"+Kura!AL33","v":0},{"$f":"+Kura!AM33","v":0},{"$f":"+Kura!AN33","v":0},{"$f":"+Kura!#REF!","v":{"$error":"#REF!"}}]
[21,33,0,0,40,{"$f":"VLOOKUP(E34,Kura!$A$4:$Z$301,26,0)","v":"AYÇA SAVAŞ (KST)"},{"$f":"+Kura!AJ34","v":0},{"$f":"+Kura!AK34","v":0},{"$f":"+Kura!AL34","v":0},{"$f":"+Kura!AM34","v":0},{"$f":"+Kura!AN34","v":0},{"$f":"+Kura!#REF!","v":{"$error":"#REF!"}},null,null,null,null,null,null,null,null,null,null,null,null,null,null,null,null,null,null,null,null,null,null,null,0,0,null,null,null,{"$f":"IF(AND(AJ34=0,AK34=0),\"\",IF(AJ34>AK34,AH30,AH37))","v":""}]
[null,null,null,null,null,null,null,3,0,null,null,11,{"$f":"IF(AND(H35=0,I35=0),\"\",IF(H35>I35,F34,F36))","v":"AYÇA SAVAŞ (KST)"},null,null,null,null,null,null,{"$f":"IF(AND(H35=0,I35=0),\"\",IF(H35>I35,F34,F36))","v":"AYÇA SAVAŞ (KST)"}]
[22,65,61,4,52,{"$f":"VLOOKUP(E36,Kura!$A$4:$Z$301,26,0)","v":"HİLALSU SAĞLAM (VAN)"},{"$f":"+Kura!AJ36","v":0},{"$f":"+Kura!AK36","v":0},{"$f":"+Kura!AL36","v":0},{"$f":"+Kura!AM36","v":0},{"$f":"+Kura!AN36","v":0},{"$f":"+Kura!#REF!","v":{"$error":"#REF!"}},null,null,null,null,null,null,null,null,null,null,null,null,null,70]
[23,65,29,36,53,{"$f":"VLOOKUP(E37,Kura!$A$4:$Z$301,26,0)","v":"KÜBRA YERLİKAYA (AMS)"},{"$f":"+Kura!AJ37","v":0},{"$f":"+Kura!AK37","v":0},{"$f":"+Kura!AL37","v":0},{"$f":"+Kura!AM37","v":0},{"$f":"+Kura!AN37","v":0},{"$f":"+Kura!#REF!","v":{"$error":"#REF!"}},null,null,null,null,null,null,null,null,null,0,3,null,null,null,{"$f":"IF(AND(V37=0,W37=0),\"\",IF(V37>W37,T35,T38))","v":"NİSA ÜZÜMCÜ (BTM)"},null,null,null,null,null,null,{"$f":"IF(AND(V37=0,W37=0),\"\",IF(V37>W37,T35,T38))","v":"NİSA ÜZÜMCÜ (BTM)"}]
[null,null,null,null,null,null,null,0,3,null,null,12,{"$f":"IF(AND(H38=0,I38=0),\"\",IF(H38>I38,F37,F39))","v":"NİSA ÜZÜMCÜ (BTM)"},null,null,null,null,null,null,{"$f":"IF(AND(H38=0,I38=0),\"\",IF(H38>I38,F37,F39))","v":"NİSA ÜZÜMCÜ (BTM)"}]
[24,17,0,0,24,{"$f":"VLOOKUP(E39,Kura!$A$4:$Z$301,26,0)","v":"NİSA ÜZÜMCÜ (BTM)"},{"$f":"+Kura!AJ39","v":0},{"$f":"+Kura!AK39","v":0},{"$f":"+Kura!AL39","v":0},{"$f":"+Kura!AM39","v":0},{"$f":"+Kura!AN39","v":0},{"$f":"+Kura!#REF!","v":{"$error":"#REF!"}}]
[25,17,0,0,25,{"$f":"VLOOKUP(E40,Kura!$A$4:$Z$301,26,0)","v":"ESİLA SU YALÇIN (SKR)"},{"$f":"+Kura!AJ40","v":0},{"$f":"+Kura!AK40","v":0},{"$f":"+Kura!AL40","v":0},{"$f":"+Kura!AM40","v":0},{"$f":"+Kura!AN40","v":0},{"$f":"+Kura!#REF!","v":{"$error":"#REF!"}}]
[null,null,null,null,null,null,null,3,1,null,null,13,{"$f":"IF(AND(H41=0,I41=0),\"\",IF(H41>I41,F40,F42))","v":"ESİLA SU YALÇIN (SKR)"},null,null,null,null,null,null,{"$f":"IF(AND(H41=0,I41=0),\"\",IF(H41>I41,F40,F42))","v":"ESİLA SU YALÇIN (SKR)"}]
[26,65,21,44,54,{"$f":"VLOOKUP(E42,Kura!$A$4:$Z$301,26,0)","v":"İDİL TOSUN (ADN)"},{"$f":"+Kura!AJ42","v":0},{"$f":"+Kura!AK42","v":0},{"$f":"+Kura!AL42","v":0},{"$f":"+Kura!AM42","v":0},{"$f":"+Kura!AN42","v":0},{"$f":"+Kura!#REF!","v":{"$error":"#REF!"}},null,null,null,null,null,null,null,null,null,null,null,null,null,71,null,null,null,null,null,null,null,{"$f":"IF(AND(V43=0,W43=0),\"\",IF(V43>W43,T41,T44))","v":"ESİLA SU YALÇIN (SKR)"}]
[27,65,53,12,55,{"$f":"VLOOKUP(E43,Kura!$A$4:$Z$301,26,0)","v":"ELİF ASYA HOCAOĞLU (RİZ)"},{"$f":"+Kura!AJ43","v":0},{"$f":"+Kura!AK43","v":0},{"$f":"+Kura!AL43","v":0},{"$f":"+Kura!AM43","v":0},{"$f":"+Kura!AN43","v":0},{"$f":"+Kura!#REF!","v":{"$error":"#REF!"}},null,null,null,null,null,null,null,null,null,3,0,null,null,null,{"$f":"IF(AND(V43=0,W43=0),\"\",IF(V43>W43,T41,T44))","v":"ESİLA SU YALÇIN (SKR)"},null,null,null,null,null,null,null,null,null,null,null,null,100]
[null,null,null,null,null,null,null,3,0,null,null,14,{"$f":"IF(AND(H44=0,I44=0),\"\",IF(H44>I44,F43,F45))","v":"ELİF ASYA HOCAOĞLU (RİZ)"},null,null,null,null,null,null,{"$f":"IF(AND(H44=0,I44=0),\"\",IF(H44>I44,F43,F45))","v":"ELİF ASYA HOCAOĞLU (RİZ)"}]
[28,33,0,0,56,{"$f":"VLOOKUP(E45,Kura!$A$4:$Z$301,26,0)","v":"MİRAÇ DENİZ AKAR (TKD)"},{"$f":"+Kura!AJ45","v":0},{"$f":"+Kura!AK45","v":0},{"$f":"+Kura!AL45","v":0},{"$f":"+Kura!AM45","v":0},{"$f":"+Kura!AN45","v":0},{"$f":"+Kura!#REF!","v":{"$error":"#REF!"}}]
[29,33,0,0,999,{"$f":"VLOOKUP(E46,Kura!$A$4:$Z$301,26,0)","v":{"$error":"#N/A"}},{"$f":"+Kura!AJ46","v":0},{"$f":"+Kura!AK46","v":0},{"$f":"+Kura!AL46","v":0},{"$f":"+Kura!AM46","v":0},{"$f":"+Kura!AN46","v":0},{"$f":"+Kura!#REF!","v":{"$error":"#REF!"}},null,null,null,null,null,null,null,null,null,null,null,null,null,null,null,null,null,null,null,null,null,null,null,0,0,null,null,null,{"$f":"IF(AND(AJ46=0,AK46=0),\"\",IF(AJ46>AK46,AH42,AH49))","v":""}]
[null,null,null,null,null,null,null,0,0,null,null,15,{"$f":"IF(AND(H47=0,I47=0),\"\",IF(H47>I47,F46,F48))","v":""},null,null,null,null,null,null,{"$f":"IF(AND(H47=0,I47=0),\"\",IF(H47>I47,F46,F48))","v":""}]
[30,65,37,28,999,{"$f":"VLOOKUP(E48,Kura!$A$4:$Z$301,26,0)","v":{"$error":"#N/A"}},{"$f":"+Kura!AJ48","v":0},{"$f":"+Kura!AK48","v":0},{"$f":"+Kura!AL48","v":0},{"$f":"+Kura!AM48","v":0},{"$f":"+Kura!AN48","v":0},{"$f":"+Kura!#REF!","v":{"$error":"#REF!"}},null,null,null,null,null,null,null,null,null,null,null,null,null,72]
[31,65,5,60,999,{"$f":"VLOOKUP(E49,Kura!$A$4:$Z$301,26,0)","v":{"$error":"#N/A"}},{"$f":"+Kura!AJ49","v":0},{"$f":"+Kura!AK49","v":0},{"$f":"+Kura!AL49","v":0},{"$f":"+Kura!AM49","v":0},{"$f":"+Kura!AN49","v":0},{"$f":"+Kura!#REF!","v":{"$error":"#REF!"}},null,null,null,null,null,null,null,null,null,0,3,null,null,null,{"$f":"IF(AND(V49=0,W49=0),\"\",IF(V49>W49,T47,T50))","v":"DURU ŞENDOĞAN (RİZ)"},null,null,null,null,null,null,{"$f":"IF(AND(V49=0,W49=0),\"\",IF(V49>W49,T47,T50))","v":"DURU ŞENDOĞAN (RİZ)"}]
[null,null,null,null,null,null,null,0,3,null,null,16,{"$f":"IF(AND(H50=0,I50=0),\"\",IF(H50>I50,F49,F51))","v":"DURU ŞENDOĞAN (RİZ)"},null,null,null,null,null,null,{"$f":"IF(AND(H50=0,I50=0),\"\",IF(H50>I50,F49,F51))","v":"DURU ŞENDOĞAN (RİZ)"}]
[32,5,0,0,8,{"$f":"VLOOKUP(E51,Kura!$A$4:$Z$301,26,0)","v":"DURU ŞENDOĞAN (RİZ)"},{"$f":"+Kura!AJ51","v":0},{"$f":"+Kura!AK51","v":0},{"$f":"+Kura!AL51","v":0},{"$f":"+Kura!AM51","v":0},{"$f":"+Kura!AN51","v":0},{"$f":"+Kura!#REF!","v":{"$error":"#REF!"}}]
[33,5,0,0,5,{"$f":"VLOOKUP(E52,Kura!$A$4:$Z$301,26,0)","v":"EYLÜL ŞEVVAL AYDIN (İST)"},{"$f":"+Kura!AJ52","v":0},{"$f":"+Kura!AK52","v":0},{"$f":"+Kura!AL52","v":0},{"$f":"+Kura!AM52","v":0},{"$f":"+Kura!AN52","v":0},{"$f":"+Kura!#REF!","v":{"$error":"#REF!"}}]
[null,null,null,null,null,null,null,3,0,null,null,17,{"$f":"IF(AND(H53=0,I53=0),\"\",IF(H53>I53,F52,F54))","v":"EYLÜL ŞEVVAL AYDIN (İST)"},null,null,null,null,null,null,{"$f":"IF(AND(H53=0,I53=0),\"\",IF(H53>I53,F52,F54))","v":"EYLÜL ŞEVVAL AYDIN (İST)"}]
[34,65,7,58,999,{"$f":"VLOOKUP(E54,Kura!$A$4:$Z$301,26,0)","v":{"$error":"#N/A"}},{"$f":"+Kura!AJ54","v":0},{"$f":"+Kura!AK54","v":0},{"$f":"+Kura!AL54","v":0},{"$f":"+Kura!AM54","v":0},{"$f":"+Kura!AN54","v":0},{"$f":"+Kura!#REF!","v":{"$error":"#REF!"}},null,null,null,null,null,null,null,null,null,null,null,null,null,73,null,null,null,null,null,null,null,{"$f":"IF(AND(V55=0,W55=0),\"\",IF(V55>W55,T53,T56))","v":"EYLÜL ŞEVVAL AYDIN (İST)"}]
[35,65,39,26,999,{"$f":"VLOOKUP(E55,Kura!$A$4:$Z$301,26,0)","v":{"$error":"#N/A"}},{"$f":"+Kura!AJ55","v":0},{"$f":"+Kura!AK55","v":0},{"$f":"+Kura!AL55","v":0},{"$f":"+Kura!AM55","v":0},{"$f":"+Kura!AN55","v":0},{"$f":"+Kura!#REF!","v":{"$error":"#REF!"}},null,null,null,null,null,null,null,null,null,3,0,null,null,null,{"$f":"IF(AND(V55=0,W55=0),\"\",IF(V55>W55,T53,T56))","v":"EYLÜL ŞEVVAL AYDIN (İST)"},null,null,null,null,null,null,null,null,null,null,null,null,101]
[null,null,null,null,null,null,null,0,0,null,null,18,{"$f":"IF(AND(H56=0,I56=0),\"\",IF(H56>I56,F55,F57))","v":""},null,null,null,null,null,null,{"$f":"IF(AND(H56=0,I56=0),\"\",IF(H56>I56,F55,F57))","v":""}]
[36,33,0,0,999,{"$f":"VLOOKUP(E57,Kura!$A$4:$Z$301,26,0)","v":{"$error":"#N/A"}},{"$f":"+Kura!AJ57","v":0},{"$f":"+Kura!AK57","v":0},{"$f":"+Kura!AL57","v":0},{"$f":"+Kura!AM57","v":0},{"$f":"+Kura!AN57","v":0},{"$f":"+Kura!#REF!","v":{"$error":"#REF!"}}]
[37,33,0,0,57,{"$f":"VLOOKUP(E58,Kura!$A$4:$Z$301,26,0)","v":"ELANUR YILMAZ (BRS)"},{"$f":"+Kura!AJ58","v":0},{"$f":"+Kura!AK58","v":0},{"$f":"+Kura!AL58","v":0},{"$f":"+Kura!AM58","v":0},{"$f":"+Kura!AN58","v":0},{"$f":"+Kura!#REF!","v":{"$error":"#REF!"}},null,null,null,null,null,null,null,null,null,null,null,null,null,null,null,null,null,null,null,null,null,null,null,0,0,null,null,null,{"$f":"IF(AND(AJ58=0,AK58=0),\"\",IF(AJ58>AK58,AH54,AH61))","v":""}]
[null,null,null,null,null,null,null,3,2,null,null,19,{"$f":"IF(AND(H59=0,I59=0),\"\",IF(H59>I59,F58,F60))","v":"ELANUR YILMAZ (BRS)"},null,null,null,null,null,null,{"$f":"IF(AND(H59=0,I59=0),\"\",IF(H59>I59,F58,F60))","v":"ELANUR YILMAZ (BRS)"}]
[38,65,55,10,58,{"$f":"VLOOKUP(E60,Kura!$A$4:$Z$301,26,0)","v":"ECRİN ZEYNEP ERCİYAS (ORD)"},{"$f":"+Kura!AJ60","v":0},{"$f":"+Kura!AK60","v":0},{"$f":"+Kura!AL60","v":0},{"$f":"+Kura!AM60","v":0},{"$f":"+Kura!AN60","v":0},{"$f":"+Kura!#REF!","v":{"$error":"#REF!"}},null,null,null,null,null,null,null,null,null,null,null,null,null,74]
[39,65,23,42,59,{"$f":"VLOOKUP(E61,Kura!$A$4:$Z$301,26,0)","v":"MERYEM ECRİN ŞENTÜRK (KCL)"},{"$f":"+Kura!AJ61","v":0},{"$f":"+Kura!AK61","v":0},{"$f":"+Kura!AL61","v":0},{"$f":"+Kura!AM61","v":0},{"$f":"+Kura!AN61","v":0},{"$f":"+Kura!#REF!","v":{"$error":"#REF!"}},null,null,null,null,null,null,null,null,null,3,0,null,null,null,{"$f":"IF(AND(V61=0,W61=0),\"\",IF(V61>W61,T59,T62))","v":"ELANUR YILMAZ (BRS)"},null,null,null,null,null,null,{"$f":"IF(AND(V61=0,W61=0),\"\",IF(V61>W61,T59,T62))","v":"ELANUR YILMAZ (BRS)"}]
[null,null,null,null,null,null,null,2,3,null,null,20,{"$f":"IF(AND(H62=0,I62=0),\"\",IF(H62>I62,F61,F63))","v":"AYŞE DURU DOĞAN (ANK)"},null,null,null,null,null,null,{"$f":"IF(AND(H62=0,I62=0),\"\",IF(H62>I62,F61,F63))","v":"AYŞE DURU DOĞAN (ANK)"}]
[40,17,0,0,28,{"$f":"VLOOKUP(E63,Kura!$A$4:$Z$301,26,0)","v":"AYŞE DURU DOĞAN (ANK)"},{"$f":"+Kura!AJ63","v":0},{"$f":"+Kura!AK63","v":0},{"$f":"+Kura!AL63","v":0},{"$f":"+Kura!AM63","v":0},{"$f":"+Kura!AN63","v":0},{"$f":"+Kura!#REF!","v":{"$error":"#REF!"}}]
[41,17,0,0,21,{"$f":"VLOOKUP(E64,Kura!$A$4:$Z$301,26,0)","v":"DİLAY BALABAN (RİZ)"},{"$f":"+Kura!AJ64","v":0},{"$f":"+Kura!AK64","v":0},{"$f":"+Kura!AL64","v":0},{"$f":"+Kura!AM64","v":0},{"$f":"+Kura!AN64","v":0},{"$f":"+Kura!#REF!","v":{"$error":"#REF!"}}]
[null,null,null,null,null,null,null,3,0,null,null,21,{"$f":"IF(AND(H65=0,I65=0),\"\",IF(H65>I65,F64,F66))","v":"DİLAY BALABAN (RİZ)"},null,null,null,null,null,null,{"$f":"IF(AND(H65=0,I65=0),\"\",IF(H65>I65,F64,F66))","v":"DİLAY BALABAN (RİZ)"}]
[42,65,31,34,60,{"$f":"VLOOKUP(E66,Kura!$A$4:$Z$301,26,0)","v":"NAZLISU OKKAN (KRL)"},{"$f":"+Kura!AJ66","v":0},{"$f":"+Kura!AK66","v":0},{"$f":"+Kura!AL66","v":0},{"$f":"+Kura!AM66","v":0},{"$f":"+Kura!AN66","v":0},{"$f":"+Kura!#REF!","v":{"$error":"#REF!"}},null,null,null,null,null,null,null,null,null,null,null,null,null,75,null,null,null,null,null,null,null,{"$f":"IF(AND(V67=0,W67=0),\"\",IF(V67>W67,T65,T68))","v":"DİLAY BALABAN (RİZ)"}]
[43,65,63,2,61,{"$f":"VLOOKUP(E67,Kura!$A$4:$Z$301,26,0)","v":"ECE ECRİN MELEN (VAN)"},{"$f":"+Kura!AJ67","v":0},{"$f":"+Kura!AK67","v":0},{"$f":"+Kura!AL67","v":0},{"$f":"+Kura!AM67","v":0},{"$f":"+Kura!AN67","v":0},{"$f":"+Kura!#REF!","v":{"$error":"#REF!"}},null,null,null,null,null,null,null,null,null,3,0,null,null,null,{"$f":"IF(AND(V67=0,W67=0),\"\",IF(V67>W67,T65,T68))","v":"DİLAY BALABAN (RİZ)"},null,null,null,null,null,null,null,null,null,null,null,null,102]
[null,null,null,null,null,null,null,0,3,null,null,22,{"$f":"IF(AND(H68=0,I68=0),\"\",IF(H68>I68,F67,F69))","v":"ESMA KAMER SÜT (KYS)"},null,null,null,null,null,null,{"$f":"IF(AND(H68=0,I68=0),\"\",IF(H68>I68,F67,F69))","v":"ESMA KAMER SÜT (KYS)"}]
[44,33,0,0,37,{"$f":"VLOOKUP(E69,Kura!$A$4:$Z$301,26,0)","v":"ESMA KAMER SÜT (KYS)"},{"$f":"+Kura!AJ69","v":0},{"$f":"+Kura!AK69","v":0},{"$f":"+Kura!AL69","v":0},{"$f":"+Kura!AM69","v":0},{"$f":"+Kura!AN69","v":0},{"$f":"+Kura!#REF!","v":{"$error":"#REF!"}}]
[45,33,0,0,62,{"$f":"VLOOKUP(E70,Kura!$A$4:$Z$301,26,0)","v":"BERRA AKICI (SKR)"},{"$f":"+Kura!AJ70","v":0},{"$f":"+Kura!AK70","v":0},{"$f":"+Kura!AL70","v":0},{"$f":"+Kura!AM70","v":0},{"$f":"+Kura!AN70","v":0},{"$f":"+Kura!#REF!","v":{"$error":"#REF!"}},null,null,null,null,null,null,null,null,null,null,null,null,null,null,null,null,null,null,null,null,null,null,null,0,0,null,null,null,{"$f":"IF(AND(AJ70=0,AK70=0),\"\",IF(AJ70>AK70,AH66,AH73))","v":""}]
[null,null,null,null,null,null,null,3,0,null,null,23,{"$f":"IF(AND(H71=0,I71=0),\"\",IF(H71>I71,F70,F72))","v":"BERRA AKICI (SKR)"},null,null,null,null,null,null,{"$f":"IF(AND(H71=0,I71=0),\"\",IF(H71>I71,F70,F72))","v":"BERRA AKICI (SKR)"}]
[46,65,47,18,63,{"$f":"VLOOKUP(E72,Kura!$A$4:$Z$301,26,0)","v":"ŞEVVAL CİMBEK (AMS)"},{"$f":"+Kura!AJ72","v":0},{"$f":"+Kura!AK72","v":0},{"$f":"+Kura!AL72","v":0},{"$f":"+Kura!AM72","v":0},{"$f":"+Kura!AN72","v":0},{"$f":"+Kura!#REF!","v":{"$error":"#REF!"}},null,null,null,null,null,null,null,null,null,null,null,null,null,76]
[47,65,15,50,64,{"$f":"VLOOKUP(E73,Kura!$A$4:$Z$301,26,0)","v":"ECEM SUNA KALDIRIM (ANK)"},{"$f":"+Kura!AJ73","v":0},{"$f":"+Kura!AK73","v":0},{"$f":"+Kura!AL73","v":0},{"$f":"+Kura!AM73","v":0},{"$f":"+Kura!AN73","v":0},{"$f":"+Kura!#REF!","v":{"$error":"#REF!"}},null,null,null,null,null,null,null,null,null,0,3,null,null,null,{"$f":"IF(AND(V73=0,W73=0),\"\",IF(V73>W73,T71,T74))","v":"ZEYNEP NAZ EKER (KRL)"},null,null,null,null,null,null,{"$f":"IF(AND(V73=0,W73=0),\"\",IF(V73>W73,T71,T74))","v":"ZEYNEP NAZ EKER (KRL)"}]
[null,null,null,null,null,null,null,0,3,null,null,24,{"$f":"IF(AND(H74=0,I74=0),\"\",IF(H74>I74,F73,F75))","v":"ZEYNEP NAZ EKER (KRL)"},null,null,null,null,null,null,{"$f":"IF(AND(H74=0,I74=0),\"\",IF(H74>I74,F73,F75))","v":"ZEYNEP NAZ EKER (KRL)"}]
[48,9,0,0,12,{"$f":"VLOOKUP(E75,Kura!$A$4:$Z$301,26,0)","v":"ZEYNEP NAZ EKER (KRL)"},{"$f":"+Kura!AJ75","v":0},{"$f":"+Kura!AK75","v":0},{"$f":"+Kura!AL75","v":0},{"$f":"+Kura!AM75","v":0},{"$f":"+Kura!AN75","v":0},{"$f":"+Kura!#REF!","v":{"$error":"#REF!"}}]
[49,9,0,0,13,{"$f":"VLOOKUP(E76,Kura!$A$4:$Z$301,26,0)","v":"İPEK ERTUNA (ANK)"},{"$f":"+Kura!AJ76","v":0},{"$f":"+Kura!AK76","v":0},{"$f":"+Kura!AL76","v":0},{"$f":"+Kura!AM76","v":0},{"$f":"+Kura!AN76","v":0},{"$f":"+Kura!#REF!","v":{"$error":"#REF!"}}]
[null,null,null,null,null,null,null,3,0,null,null,25,{"$f":"IF(AND(H77=0,I77=0),\"\",IF(H77>I77,F76,F78))","v":"İPEK ERTUNA (ANK)"},null,null,null,null,null,null,{"$f":"IF(AND(H77=0,I77=0),\"\",IF(H77>I77,F76,F78))","v":"İPEK ERTUNA (ANK)"}]
[50,65,11,54,65,{"$f":"VLOOKUP(E78,Kura!$A$4:$Z$301,26,0)","v":"RÜYA EMİR (SMS)"},{"$f":"+Kura!AJ78","v":0},{"$f":"+Kura!AK78","v":0},{"$f":"+Kura!AL78","v":0},{"$f":"+Kura!AM78","v":0},{"$f":"+Kura!AN78","v":0},{"$f":"+Kura!#REF!","v":{"$error":"#REF!"}},null,null,null,null,null,null,null,null,null,null,null,null,null,77,null,null,null,null,null,null,null,{"$f":"IF(AND(V79=0,W79=0),\"\",IF(V79>W79,T77,T80))","v":"İPEK ERTUNA (ANK)"}]
[51,65,43,22,66,{"$f":"VLOOKUP(E79,Kura!$A$4:$Z$301,26,0)","v":"ASUDE AKSOY (GZT)"},{"$f":"+Kura!AJ79","v":0},{"$f":"+Kura!AK79","v":0},{"$f":"+Kura!AL79","v":0},{"$f":"+Kura!AM79","v":0},{"$f":"+Kura!AN79","v":0},{"$f":"+Kura!#REF!","v":{"$error":"#REF!"}},null,null,null,null,null,null,null,null,null,3,1,null,null,null,{"$f":"IF(AND(V79=0,W79=0),\"\",IF(V79>W79,T77,T80))","v":"İPEK ERTUNA (ANK)"},null,null,null,null,null,null,null,null,null,null,null,null,103]
[null,null,null,null,null,null,null,0,3,null,null,26,{"$f":"IF(AND(H80=0,I80=0),\"\",IF(H80>I80,F79,F81))","v":"BAHAR GÜL (ZNG)"},null,null,null,null,null,null,{"$f":"IF(AND(H80=0,I80=0),\"\",IF(H80>I80,F79,F81))","v":"BAHAR GÜL (ZNG)"}]
[52,33,0,0,67,{"$f":"VLOOKUP(E81,Kura!$A$4:$Z$301,26,0)","v":"BAHAR GÜL (ZNG)"},{"$f":"+Kura!AJ81","v":0},{"$f":"+Kura!AK81","v":0},{"$f":"+Kura!AL81","v":0},{"$f":"+Kura!AM81","v":0},{"$f":"+Kura!AN81","v":0},{"$f":"+Kura!#REF!","v":{"$error":"#REF!"}}]
[53,33,0,0,36,{"$f":"VLOOKUP(E82,Kura!$A$4:$Z$301,26,0)","v":"DURU BERİL TOK (YLV)"},{"$f":"+Kura!AJ82","v":0},{"$f":"+Kura!AK82","v":0},{"$f":"+Kura!AL82","v":0},{"$f":"+Kura!AM82","v":0},{"$f":"+Kura!AN82","v":0},{"$f":"+Kura!#REF!","v":{"$error":"#REF!"}},null,null,null,null,null,null,null,null,null,null,null,null,null,null,null,null,null,null,null,null,null,null,null,0,0,null,null,null,{"$f":"IF(AND(AJ82=0,AK82=0),\"\",IF(AJ82>AK82,AH78,AH85))","v":""}]
[null,null,null,null,null,null,null,3,1,null,null,27,{"$f":"IF(AND(H83=0,I83=0),\"\",IF(H83>I83,F82,F84))","v":"DURU BERİL TOK (YLV)"},null,null,null,null,null,null,{"$f":"IF(AND(H83=0,I83=0),\"\",IF(H83>I83,F82,F84))","v":"DURU BERİL TOK (YLV)"}]
[54,65,59,6,68,{"$f":"VLOOKUP(E84,Kura!$A$4:$Z$301,26,0)","v":"BERİL ECE ÇARKÇI (ORD)"},{"$f":"+Kura!AJ84","v":0},{"$f":"+Kura!AK84","v":0},{"$f":"+Kura!AL84","v":0},{"$f":"+Kura!AM84","v":0},{"$f":"+Kura!AN84","v":0},{"$f":"+Kura!#REF!","v":{"$error":"#REF!"}},null,null,null,null,null,null,null,null,null,null,null,null,null,78]
[55,65,27,38,69,{"$f":"VLOOKUP(E85,Kura!$A$4:$Z$301,26,0)","v":"AYŞE MELİS ÖZER (TKD)"},{"$f":"+Kura!AJ85","v":0},{"$f":"+Kura!AK85","v":0},{"$f":"+Kura!AL85","v":0},{"$f":"+Kura!AM85","v":0},{"$f":"+Kura!AN85","v":0},{"$f":"+Kura!#REF!","v":{"$error":"#REF!"}},null,null,null,null,null,null,null,null,null,1,3,null,null,null,{"$f":"IF(AND(V85=0,W85=0),\"\",IF(V85>W85,T83,T86))","v":"MASAL ERYILMAZ (İST)"},null,null,null,null,null,null,{"$f":"IF(AND(V85=0,W85=0),\"\",IF(V85>W85,T83,T86))","v":"MASAL ERYILMAZ (İST)"}]
[null,null,null,null,null,null,null,0,3,null,null,28,{"$f":"IF(AND(H86=0,I86=0),\"\",IF(H86>I86,F85,F87))","v":"MASAL ERYILMAZ (İST)"},null,null,null,null,null,null,{"$f":"IF(AND(H86=0,I86=0),\"\",IF(H86>I86,F85,F87))","v":"MASAL ERYILMAZ (İST)"}]
[56,17,0,0,20,{"$f":"VLOOKUP(E87,Kura!$A$4:$Z$301,26,0)","v":"MASAL ERYILMAZ (İST)"},{"$f":"+Kura!AJ87","v":0},{"$f":"+Kura!AK87","v":0},{"$f":"+Kura!AL87","v":0},{"$f":"+Kura!AM87","v":0},{"$f":"+Kura!AN87","v":0},{"$f":"+Kura!#REF!","v":{"$error":"#REF!"}}]
[57,17,0,0,29,{"$f":"VLOOKUP(E88,Kura!$A$4:$Z$301,26,0)","v":"ZEYNEP DURAN (İST)"},{"$f":"+Kura!AJ88","v":0},{"$f":"+Kura!AK88","v":0},{"$f":"+Kura!AL88","v":0},{"$f":"+Kura!AM88","v":0},{"$f":"+Kura!AN88","v":0},{"$f":"+Kura!#REF!","v":{"$error":"#REF!"}}]
[null,null,null,null,null,null,null,3,0,null,null,29,{"$f":"IF(AND(H89=0,I89=0),\"\",IF(H89>I89,F88,F90))","v":"ZEYNEP DURAN (İST)"},null,null,null,null,null,null,{"$f":"IF(AND(H89=0,I89=0),\"\",IF(H89>I89,F88,F90))","v":"ZEYNEP DURAN (İST)"}]
[58,65,19,46,70,{"$f":"VLOOKUP(E90,Kura!$A$4:$Z$301,26,0)","v":"ECEM DEMİR (KRL)"},{"$f":"+Kura!AJ90","v":0},{"$f":"+Kura!AK90","v":0},{"$f":"+Kura!AL90","v":0},{"$f":"+Kura!AM90","v":0},{"$f":"+Kura!AN90","v":0},{"$f":"+Kura!#REF!","v":{"$error":"#REF!"}},null,null,null,null,null,null,null,null,null,null,null,null,null,79,null,null,null,null,null,null,null,{"$f":"IF(AND(V91=0,W91=0),\"\",IF(V91>W91,T89,T92))","v":"ZEYNEP DURAN (İST)"}]
[59,65,51,14,71,{"$f":"VLOOKUP(E91,Kura!$A$4:$Z$301,26,0)","v":"İLGİ İPEK TUNÇ (ANK)"},{"$f":"+Kura!AJ91","v":0},{"$f":"+Kura!AK91","v":0},{"$f":"+Kura!AL91","v":0},{"$f":"+Kura!AM91","v":0},{"$f":"+Kura!AN91","v":0},{"$f":"+Kura!#REF!","v":{"$error":"#REF!"}},null,null,null,null,null,null,null,null,null,3,0,null,null,null,{"$f":"IF(AND(V91=0,W91=0),\"\",IF(V91>W91,T89,T92))","v":"ZEYNEP DURAN (İST)"},null,null,null,null,null,null,null,null,null,null,null,null,104]
[null,null,null,null,null,null,null,3,0,null,null,30,{"$f":"IF(AND(H92=0,I92=0),\"\",IF(H92>I92,F91,F93))","v":"İLGİ İPEK TUNÇ (ANK)"},null,null,null,null,null,null,{"$f":"IF(AND(H92=0,I92=0),\"\",IF(H92>I92,F91,F93))","v":"İLGİ İPEK TUNÇ (ANK)"}]
[60,33,0,0,72,{"$f":"VLOOKUP(E93,Kura!$A$4:$Z$301,26,0)","v":"ÖZGE ARI (KRL)"},{"$f":"+Kura!AJ93","v":0},{"$f":"+Kura!AK93","v":0},{"$f":"+Kura!AL93","v":0},{"$f":"+Kura!AM93","v":0},{"$f":"+Kura!AN93","v":0},{"$f":"+Kura!#REF!","v":{"$error":"#REF!"}}]
[61,33,0,0,999,{"$f":"VLOOKUP(E94,Kura!$A$4:$Z$301,26,0)","v":{"$error":"#N/A"}},{"$f":"+Kura!AJ94","v":0},{"$f":"+Kura!AK94","v":0},{"$f":"+Kura!AL94","v":0},{"$f":"+Kura!AM94","v":0},{"$f":"+Kura!AN94","v":0},{"$f":"+Kura!#REF!","v":{"$error":"#REF!"}},null,null,null,null,null,null,null,null,null,null,null,null,null,null,null,null,null,null,null,null,null,null,null,0,0,null,null,null,{"$f":"IF(AND(AJ94=0,AK94=0),\"\",IF(AJ94>AK94,AH90,AH97))","v":""}]
[null,null,null,null,null,null,null,0,0,null,null,31,{"$f":"IF(AND(H95=0,I95=0),\"\",IF(H95>I95,F94,F96))","v":""},null,null,null,null,null,null,{"$f":"IF(AND(H95=0,I95=0),\"\",IF(H95>I95,F94,F96))","v":""}]
[62,65,35,30,999,{"$f":"VLOOKUP(E96,Kura!$A$4:$Z$301,26,0)","v":{"$error":"#N/A"}},{"$f":"+Kura!AJ96","v":0},{"$f":"+Kura!AK96","v":0},{"$f":"+Kura!AL96","v":0},{"$f":"+Kura!AM96","v":0},{"$f":"+Kura!AN96","v":0},{"$f":"+Kura!#REF!","v":{"$error":"#REF!"}},null,null,null,null,null,null,null,null,null,null,null,null,null,80]
[63,65,3,62,999,{"$f":"VLOOKUP(E97,Kura!$A$4:$Z$301,26,0)","v":{"$error":"#N/A"}},{"$f":"+Kura!AJ97","v":0},{"$f":"+Kura!AK97","v":0},{"$f":"+Kura!AL97","v":0},{"$f":"+Kura!AM97","v":0},{"$f":"+Kura!AN97","v":0},{"$f":"+Kura!#REF!","v":{"$error":"#REF!"}},null,null,null,null,null,null,null,null,null,0,3,null,null,null,{"$f":"IF(AND(V97=0,W97=0),\"\",IF(V97>W97,T95,T98))","v":"HATİCE ELİF GÜVELİ (İST)"},null,null,null,null,null,null,{"$f":"IF(AND(V97=0,W97=0),\"\",IF(V97>W97,T95,T98))","v":"HATİCE ELİF GÜVELİ (İST)"}]
[null,null,null,null,null,null,null,0,3,null,null,32,{"$f":"IF(AND(H98=0,I98=0),\"\",IF(H98>I98,F97,F99))","v":"HATİCE ELİF GÜVELİ (İST)"},null,null,null,null,null,null,{"$f":"IF(AND(H98=0,I98=0),\"\",IF(H98>I98,F97,F99))","v":"HATİCE ELİF GÜVELİ (İST)"}]
[64,3,0,0,4,{"$f":"VLOOKUP(E99,Kura!$A$4:$Z$301,26,0)","v":"HATİCE ELİF GÜVELİ (İST)"},{"$f":"+Kura!AJ99","v":0},{"$f":"+Kura!AK99","v":0},{"$f":"+Kura!AL99","v":0},{"$f":"+Kura!AM99","v":0},{"$f":"+Kura!AN99","v":0},{"$f":"+Kura!#REF!","v":{"$error":"#REF!"}}]
[65,3,0,0,3,{"$f":"VLOOKUP(E100,Kura!$A$4:$Z$301,26,0)","v":"ELİF ECE AKYÜREK (ADN)"},{"$f":"+Kura!AJ100","v":0},{"$f":"+Kura!AK100","v":0},{"$f":"+Kura!AL100","v":0},{"$f":"+Kura!AM100","v":0},{"$f":"+Kura!AN100","v":0},{"$f":"+Kura!#REF!","v":{"$error":"#REF!"}}]
[null,null,null,null,null,null,null,3,0,null,null,33,{"$f":"IF(AND(H101=0,I101=0),\"\",IF(H101>I101,F100,F102))","v":"ELİF ECE AKYÜREK (ADN)"},null,null,null,null,null,null,{"$f":"IF(AND(H101=0,I101=0),\"\",IF(H101>I101,F100,F102))","v":"ELİF ECE AKYÜREK (ADN)"},null,null,null,null,null,81]
[66,65,4,61,999,{"$f":"VLOOKUP(E102,Kura!$A$4:$Z$301,26,0)","v":{"$error":"#N/A"}},{"$f":"+Kura!AJ102","v":0},{"$f":"+Kura!AK102","v":0},{"$f":"+Kura!AL102","v":0},{"$f":"+Kura!AM102","v":0},{"$f":"+Kura!AN102","v":0},{"$f":"+Kura!#REF!","v":{"$error":"#REF!"}},null,null,null,null,null,null,null,null,null,null,null,null,null,81,null,null,null,null,null,null,null,{"$f":"IF(AND(V103=0,W103=0),\"\",IF(V103>W103,T101,T104))","v":"ELİF ECE AKYÜREK (ADN)"}]
[67,65,36,29,999,{"$f":"VLOOKUP(E103,Kura!$A$4:$Z$301,26,0)","v":{"$error":"#N/A"}},{"$f":"+Kura!AJ103","v":0},{"$f":"+Kura!AK103","v":0},{"$f":"+Kura!AL103","v":0},{"$f":"+Kura!AM103","v":0},{"$f":"+Kura!AN103","v":0},{"$f":"+Kura!#REF!","v":{"$error":"#REF!"}},null,null,null,null,null,null,null,null,null,3,0,null,null,null,{"$f":"IF(AND(V103=0,W103=0),\"\",IF(V103>W103,T101,T104))","v":"ELİF ECE AKYÜREK (ADN)"},null,null,null,null,null,null,null,null,null,null,null,null,105]
[null,null,null,null,null,null,null,0,0,null,null,34,{"$f":"IF(AND(H104=0,I104=0),\"\",IF(H104>I104,F103,F105))","v":""},null,null,null,null,null,null,{"$f":"IF(AND(H104=0,I104=0),\"\",IF(H104>I104,F103,F105))","v":""}]
[68,33,0,0,999,{"$f":"VLOOKUP(E105,Kura!$A$4:$Z$301,26,0)","v":{"$error":"#N/A"}},{"$f":"+Kura!AJ105","v":0},{"$f":"+Kura!AK105","v":0},{"$f":"+Kura!AL105","v":0},{"$f":"+Kura!AM105","v":0},{"$f":"+Kura!AN105","v":0},{"$f":"+Kura!#REF!","v":{"$error":"#REF!"}}]
[69,33,0,0,73,{"$f":"VLOOKUP(E106,Kura!$A$4:$Z$301,26,0)","v":"ESLEM SENA ERCİYAS (ORD)"},{"$f":"+Kura!AJ106","v":0},{"$f":"+Kura!AK106","v":0},{"$f":"+Kura!AL106","v":0},{"$f":"+Kura!AM106","v":0},{"$f":"+Kura!AN106","v":0},{"$f":"+Kura!#REF!","v":{"$error":"#REF!"}},null,null,null,null,null,null,null,null,null,null,null,null,null,null,null,null,null,null,null,null,null,null,null,0,0,null,null,null,{"$f":"IF(AND(AJ106=0,AK106=0),\"\",IF(AJ106>AK106,AH102,AH109))","v":""}]
[null,null,null,null,null,null,null,0,3,null,null,35,{"$f":"IF(AND(H107=0,I107=0),\"\",IF(H107>I107,F106,F108))","v":"EYLÜL KENANOĞLU (KST)"},null,null,null,null,null,null,{"$f":"IF(AND(H107=0,I107=0),\"\",IF(H107>I107,F106,F108))","v":"EYLÜL KENANOĞLU (KST)"},null,null,null,null,null,82]
[70,65,52,13,74,{"$f":"VLOOKUP(E108,Kura!$A$4:$Z$301,26,0)","v":"EYLÜL KENANOĞLU (KST)"},{"$f":"+Kura!AJ108","v":0},{"$f":"+Kura!AK108","v":0},{"$f":"+Kura!AL108","v":0},{"$f":"+Kura!AM108","v":0},{"$f":"+Kura!AN108","v":0},{"$f":"+Kura!#REF!","v":{"$error":"#REF!"}},null,null,null,null,null,null,null,null,null,null,null,null,null,82]
[71,65,20,45,75,{"$f":"VLOOKUP(E109,Kura!$A$4:$Z$301,26,0)","v":"MİYASE ESLEM ÖZDEN (KNY)"},{"$f":"+Kura!AJ109","v":0},{"$f":"+Kura!AK109","v":0},{"$f":"+Kura!AL109","v":0},{"$f":"+Kura!AM109","v":0},{"$f":"+Kura!AN109","v":0},{"$f":"+Kura!#REF!","v":{"$error":"#REF!"}},null,null,null,null,null,null,null,null,null,3,0,null,null,null,{"$f":"IF(AND(V109=0,W109=0),\"\",IF(V109>W109,T107,T110))","v":"EYLÜL KENANOĞLU (KST)"},null,null,null,null,null,null,{"$f":"IF(AND(V109=0,W109=0),\"\",IF(V109>W109,T107,T110))","v":"EYLÜL KENANOĞLU (KST)"}]
[null,null,null,null,null,null,null,1,2,null,null,36,{"$f":"IF(AND(H110=0,I110=0),\"\",IF(H110>I110,F109,F111))","v":"ELİF ÇELİK (MLT)"},null,null,null,null,null,null,{"$f":"IF(AND(H110=0,I110=0),\"\",IF(H110>I110,F109,F111))","v":"ELİF ÇELİK (MLT)"}]
[72,17,0,0,30,{"$f":"VLOOKUP(E111,Kura!$A$4:$Z$301,26,0)","v":"ELİF ÇELİK (MLT)"},{"$f":"+Kura!AJ111","v":0},{"$f":"+Kura!AK111","v":0},{"$f":"+Kura!AL111","v":0},{"$f":"+Kura!AM111","v":0},{"$f":"+Kura!AN111","v":0},{"$f":"+Kura!#REF!","v":{"$error":"#REF!"}}]
[73,17,0,0,19,{"$f":"VLOOKUP(E112,Kura!$A$4:$Z$301,26,0)","v":"NAZLI ŞAHAN (ÇRM)"},{"$f":"+Kura!AJ112","v":0},{"$f":"+Kura!AK112","v":0},{"$f":"+Kura!AL112","v":0},{"$f":"+Kura!AM112","v":0},{"$f":"+Kura!AN112","v":0},{"$f":"+Kura!#REF!","v":{"$error":"#REF!"}}]
[null,null,null,null,null,null,null,3,0,null,null,37,{"$f":"IF(AND(H113=0,I113=0),\"\",IF(H113>I113,F112,F114))","v":"NAZLI ŞAHAN (ÇRM)"},null,null,null,null,null,null,{"$f":"IF(AND(H113=0,I113=0),\"\",IF(H113>I113,F112,F114))","v":"NAZLI ŞAHAN (ÇRM)"},null,null,null,null,null,83]
[74,65,28,37,76,{"$f":"VLOOKUP(E114,Kura!$A$4:$Z$301,26,0)","v":"RÜMEYSA MAYDA (BRS)"},{"$f":"+Kura!AJ114","v":0},{"$f":"+Kura!AK114","v":0},{"$f":"+Kura!AL114","v":0},{"$f":"+Kura!AM114","v":0},{"$f":"+Kura!AN114","v":0},{"$f":"+Kura!#REF!","v":{"$error":"#REF!"}},null,null,null,null,null,null,null,null,null,null,null,null,null,83,null,null,null,null,null,null,null,{"$f":"IF(AND(V115=0,W115=0),\"\",IF(V115>W115,T113,T116))","v":"ESMA SULTAN SARI (SKR)"}]
[75,65,60,5,77,{"$f":"VLOOKUP(E115,Kura!$A$4:$Z$301,26,0)","v":"CEREN KOÇAK (KYS)"},{"$f":"+Kura!AJ115","v":0},{"$f":"+Kura!AK115","v":0},{"$f":"+Kura!AL115","v":0},{"$f":"+Kura!AM115","v":0},{"$f":"+Kura!AN115","v":0},{"$f":"+Kura!#REF!","v":{"$error":"#REF!"}},null,null,null,null,null,null,null,null,null,1,3,null,null,null,{"$f":"IF(AND(V115=0,W115=0),\"\",IF(V115>W115,T113,T116))","v":"ESMA SULTAN SARI (SKR)"},null,null,null,null,null,null,null,null,null,null,null,null,106]
[null,null,null,null,null,null,null,0,3,null,null,38,{"$f":"IF(AND(H116=0,I116=0),\"\",IF(H116>I116,F115,F117))","v":"ESMA SULTAN SARI (SKR)"},null,null,null,null,null,null,{"$f":"IF(AND(H116=0,I116=0),\"\",IF(H116>I116,F115,F117))","v":"ESMA SULTAN SARI (SKR)"}]
[76,33,0,0,35,{"$f":"VLOOKUP(E117,Kura!$A$4:$Z$301,26,0)","v":"ESMA SULTAN SARI (SKR)"},{"$f":"+Kura!AJ117","v":0},{"$f":"+Kura!AK117","v":0},{"$f":"+Kura!AL117","v":0},{"$f":"+Kura!AM117","v":0},{"$f":"+Kura!AN117","v":0},{"$f":"+Kura!#REF!","v":{"$error":"#REF!"}}]
[77,33,0,0,78,{"$f":"VLOOKUP(E118,Kura!$A$4:$Z$301,26,0)","v":"ESMA ÇUKUR (RİZ)"},{"$f":"+Kura!AJ118","v":0},{"$f":"+Kura!AK118","v":0},{"$f":"+Kura!AL118","v":0},{"$f":"+Kura!AM118","v":0},{"$f":"+Kura!AN118","v":0},{"$f":"+Kura!#REF!","v":{"$error":"#REF!"}},null,null,null,null,null,null,null,null,null,null,null,null,null,null,null,null,null,null,null,null,null,null,null,0,0,null,null,null,{"$f":"IF(AND(AJ118=0,AK118=0),\"\",IF(AJ118>AK118,AH114,AH121))","v":""}]
[null,null,null,null,null,null,null,0,3,null,null,39,{"$f":"IF(AND(H119=0,I119=0),\"\",IF(H119>I119,F118,F120))","v":"ELANUR ALAÇAM (AMS)"},null,null,null,null,null,null,{"$f":"IF(AND(H119=0,I119=0),\"\",IF(H119>I119,F118,F120))","v":"ELANUR ALAÇAM (AMS)"},null,null,null,null,null,84]
[78,65,44,21,79,{"$f":"VLOOKUP(E120,Kura!$A$4:$Z$301,26,0)","v":"ELANUR ALAÇAM (AMS)"},{"$f":"+Kura!AJ120","v":0},{"$f":"+Kura!AK120","v":0},{"$f":"+Kura!AL120","v":0},{"$f":"+Kura!AM120","v":0},{"$f":"+Kura!AN120","v":0},{"$f":"+Kura!#REF!","v":{"$error":"#REF!"}},null,null,null,null,null,null,null,null,null,null,null,null,null,84]
[79,65,12,53,80,{"$f":"VLOOKUP(E121,Kura!$A$4:$Z$301,26,0)","v":"HAZAL ERSOY (AMS)"},{"$f":"+Kura!AJ121","v":0},{"$f":"+Kura!AK121","v":0},{"$f":"+Kura!AL121","v":0},{"$f":"+Kura!AM121","v":0},{"$f":"+Kura!AN121","v":0},{"$f":"+Kura!#REF!","v":{"$error":"#REF!"}},null,null,null,null,null,null,null,null,null,3,1,null,null,null,{"$f":"IF(AND(V121=0,W121=0),\"\",IF(V121>W121,T119,T122))","v":"ELANUR ALAÇAM (AMS)"},null,null,null,null,null,null,{"$f":"IF(AND(V121=0,W121=0),\"\",IF(V121>W121,T119,T122))","v":"ELANUR ALAÇAM (AMS)"}]
[null,null,null,null,null,null,null,0,3,null,null,40,{"$f":"IF(AND(H122=0,I122=0),\"\",IF(H122>I122,F121,F123))","v":"NEHİR DUYURAN (ANK)"},null,null,null,null,null,null,{"$f":"IF(AND(H122=0,I122=0),\"\",IF(H122>I122,F121,F123))","v":"NEHİR DUYURAN (ANK)"}]
[80,9,0,0,14,{"$f":"VLOOKUP(E123,Kura!$A$4:$Z$301,26,0)","v":"NEHİR DUYURAN (ANK)"},{"$f":"+Kura!AJ123","v":0},{"$f":"+Kura!AK123","v":0},{"$f":"+Kura!AL123","v":0},{"$f":"+Kura!AM123","v":0},{"$f":"+Kura!AN123","v":0},{"$f":"+Kura!#REF!","v":{"$error":"#REF!"}}]
[81,9,0,0,11,{"$f":"VLOOKUP(E124,Kura!$A$4:$Z$301,26,0)","v":"AYTEN CEREN KAHRAMAN (KYS)"},{"$f":"+Kura!AJ124","v":0},{"$f":"+Kura!AK124","v":0},{"$f":"+Kura!AL124","v":0},{"$f":"+Kura!AM124","v":0},{"$f":"+Kura!AN124","v":0},{"$f":"+Kura!#REF!","v":{"$error":"#REF!"}}]
[null,null,null,null,null,null,null,3,1,null,null,41,{"$f":"IF(AND(H125=0,I125=0),\"\",IF(H125>I125,F124,F126))","v":"AYTEN CEREN KAHRAMAN (KYS)"},null,null,null,null,null,null,{"$f":"IF(AND(H125=0,I125=0),\"\",IF(H125>I125,F124,F126))","v":"AYTEN CEREN KAHRAMAN (KYS)"},null,null,null,null,null,85]
[82,65,16,49,81,{"$f":"VLOOKUP(E126,Kura!$A$4:$Z$301,26,0)","v":"NEHİR GÖHER SALTÜRK (BRS)"},{"$f":"+Kura!AJ126","v":0},{"$f":"+Kura!AK126","v":0},{"$f":"+Kura!AL126","v":0},{"$f":"+Kura!AM126","v":0},{"$f":"+Kura!AN126","v":0},{"$f":"+Kura!#REF!","v":{"$error":"#REF!"}},null,null,null,null,null,null,null,null,null,null,null,null,null,85,null,null,null,null,null,null,null,{"$f":"IF(AND(V127=0,W127=0),\"\",IF(V127>W127,T125,T128))","v":"AYTEN CEREN KAHRAMAN (KYS)"}]
[83,65,48,17,82,{"$f":"VLOOKUP(E127,Kura!$A$4:$Z$301,26,0)","v":"NİSANUR AYTEN (VAN)"},{"$f":"+Kura!AJ127","v":0},{"$f":"+Kura!AK127","v":0},{"$f":"+Kura!AL127","v":0},{"$f":"+Kura!AM127","v":0},{"$f":"+Kura!AN127","v":0},{"$f":"+Kura!#REF!","v":{"$error":"#REF!"}},null,null,null,null,null,null,null,null,null,3,0,null,null,null,{"$f":"IF(AND(V127=0,W127=0),\"\",IF(V127>W127,T125,T128))","v":"AYTEN CEREN KAHRAMAN (KYS)"},null,null,null,null,null,null,null,null,null,null,null,null,107]
[null,null,null,null,null,null,null,0,3,null,null,42,{"$f":"IF(AND(H128=0,I128=0),\"\",IF(H128>I128,F127,F129))","v":"ELANUR DEMİR (İST)"},null,null,null,null,null,null,{"$f":"IF(AND(H128=0,I128=0),\"\",IF(H128>I128,F127,F129))","v":"ELANUR DEMİR (İST)"}]
[84,33,0,0,83,{"$f":"VLOOKUP(E129,Kura!$A$4:$Z$301,26,0)","v":"ELANUR DEMİR (İST)"},{"$f":"+Kura!AJ129","v":0},{"$f":"+Kura!AK129","v":0},{"$f":"+Kura!AL129","v":0},{"$f":"+Kura!AM129","v":0},{"$f":"+Kura!AN129","v":0},{"$f":"+Kura!#REF!","v":{"$error":"#REF!"}}]
[85,33,0,0,38,{"$f":"VLOOKUP(E130,Kura!$A$4:$Z$301,26,0)","v":"BERRA BAHTİYAR (SKR)"},{"$f":"+Kura!AJ130","v":0},{"$f":"+Kura!AK130","v":0},{"$f":"+Kura!AL130","v":0},{"$f":"+Kura!AM130","v":0},{"$f":"+Kura!AN130","v":0},{"$f":"+Kura!#REF!","v":{"$error":"#REF!"}},null,null,null,null,null,null,null,null,null,null,null,null,null,null,null,null,null,null,null,null,null,null,null,0,0,null,null,null,{"$f":"IF(AND(AJ130=0,AK130=0),\"\",IF(AJ130>AK130,AH126,AH133))","v":""}]
[null,null,null,null,null,null,null,3,0,null,null,43,{"$f":"IF(AND(H131=0,I131=0),\"\",IF(H131>I131,F130,F132))","v":"BERRA BAHTİYAR (SKR)"},null,null,null,null,null,null,{"$f":"IF(AND(H131=0,I131=0),\"\",IF(H131>I131,F130,F132))","v":"BERRA BAHTİYAR (SKR)"},null,null,null,null,null,86]
[86,65,64,1,84,{"$f":"VLOOKUP(E132,Kura!$A$4:$Z$301,26,0)","v":"NİSA GÜN (AMS)"},{"$f":"+Kura!AJ132","v":0},{"$f":"+Kura!AK132","v":0},{"$f":"+Kura!AL132","v":0},{"$f":"+Kura!AM132","v":0},{"$f":"+Kura!AN132","v":0},{"$f":"+Kura!#REF!","v":{"$error":"#REF!"}},null,null,null,null,null,null,null,null,null,null,null,null,null,86]
[87,65,32,33,85,{"$f":"VLOOKUP(E133,Kura!$A$4:$Z$301,26,0)","v":"EBRAR NİSA TORU (AMS)"},{"$f":"+Kura!AJ133","v":0},{"$f":"+Kura!AK133","v":0},{"$f":"+Kura!AL133","v":0},{"$f":"+Kura!AM133","v":0},{"$f":"+Kura!AN133","v":0},{"$f":"+Kura!#REF!","v":{"$error":"#REF!"}},null,null,null,null,null,null,null,null,null,0,3,null,null,null,{"$f":"IF(AND(V133=0,W133=0),\"\",IF(V133>W133,T131,T134))","v":"IRMAK BÜŞRA UNCU (KST)"},null,null,null,null,null,null,{"$f":"IF(AND(V133=0,W133=0),\"\",IF(V133>W133,T131,T134))","v":"IRMAK BÜŞRA UNCU (KST)"}]
[null,null,null,null,null,null,null,0,3,null,null,44,{"$f":"IF(AND(H134=0,I134=0),\"\",IF(H134>I134,F133,F135))","v":"IRMAK BÜŞRA UNCU (KST)"},null,null,null,null,null,null,{"$f":"IF(AND(H134=0,I134=0),\"\",IF(H134>I134,F133,F135))","v":"IRMAK BÜŞRA UNCU (KST)"}]
[88,17,0,0,22,{"$f":"VLOOKUP(E135,Kura!$A$4:$Z$301,26,0)","v":"IRMAK BÜŞRA UNCU (KST)"},{"$f":"+Kura!AJ135","v":0},{"$f":"+Kura!AK135","v":0},{"$f":"+Kura!AL135","v":0},{"$f":"+Kura!AM135","v":0},{"$f":"+Kura!AN135","v":0},{"$f":"+Kura!#REF!","v":{"$error":"#REF!"}}]
[89,17,0,0,27,{"$f":"VLOOKUP(E136,Kura!$A$4:$Z$301,26,0)","v":"ECEMSU ÇİÇEK (İZM)"},{"$f":"+Kura!AJ136","v":0},{"$f":"+Kura!AK136","v":0},{"$f":"+Kura!AL136","v":0},{"$f":"+Kura!AM136","v":0},{"$f":"+Kura!AN136","v":0},{"$f":"+Kura!#REF!","v":{"$error":"#REF!"}}]
[null,null,null,null,null,null,null,3,1,null,null,45,{"$f":"IF(AND(H137=0,I137=0),\"\",IF(H137>I137,F136,F138))","v":"ECEMSU ÇİÇEK (İZM)"},null,null,null,null,null,null,{"$f":"IF(AND(H137=0,I137=0),\"\",IF(H137>I137,F136,F138))","v":"ECEMSU ÇİÇEK (İZM)"},null,null,null,null,null,87]
[90,65,24,41,86,{"$f":"VLOOKUP(E138,Kura!$A$4:$Z$301,26,0)","v":"ELİF DURU BECER (ÇRM)"},{"$f":"+Kura!AJ138","v":0},{"$f":"+Kura!AK138","v":0},{"$f":"+Kura!AL138","v":0},{"$f":"+Kura!AM138","v":0},{"$f":"+Kura!AN138","v":0},{"$f":"+Kura!#REF!","v":{"$error":"#REF!"}},null,null,null,null,null,null,null,null,null,null,null,null,null,87,null,null,null,null,null,null,null,{"$f":"IF(AND(V139=0,W139=0),\"\",IF(V139>W139,T137,T140))","v":"NAZLINUR AKGÜN (ANT)"}]
[91,65,56,9,87,{"$f":"VLOOKUP(E139,Kura!$A$4:$Z$301,26,0)","v":"ZEYNEB KOÇ (ZNG)"},{"$f":"+Kura!AJ139","v":0},{"$f":"+Kura!AK139","v":0},{"$f":"+Kura!AL139","v":0},{"$f":"+Kura!AM139","v":0},{"$f":"+Kura!AN139","v":0},{"$f":"+Kura!#REF!","v":{"$error":"#REF!"}},null,null,null,null,null,null,null,null,null,2,3,null,null,null,{"$f":"IF(AND(V139=0,W139=0),\"\",IF(V139>W139,T137,T140))","v":"NAZLINUR AKGÜN (ANT)"},null,null,null,null,null,null,null,null,null,null,null,null,108]
[null,null,null,null,null,null,null,0,3,null,null,46,{"$f":"IF(AND(H140=0,I140=0),\"\",IF(H140>I140,F139,F141))","v":"NAZLINUR AKGÜN (ANT)"},null,null,null,null,null,null,{"$f":"IF(AND(H140=0,I140=0),\"\",IF(H140>I140,F139,F141))","v":"NAZLINUR AKGÜN (ANT)"}]
[92,33,0,0,88,{"$f":"VLOOKUP(E141,Kura!$A$4:$Z$301,26,0)","v":"NAZLINUR AKGÜN (ANT)"},{"$f":"+Kura!AJ141","v":0},{"$f":"+Kura!AK141","v":0},{"$f":"+Kura!AL141","v":0},{"$f":"+Kura!AM141","v":0},{"$f":"+Kura!AN141","v":0},{"$f":"+Kura!#REF!","v":{"$error":"#REF!"}}]
[93,33,0,0,999,{"$f":"VLOOKUP(E142,Kura!$A$4:$Z$301,26,0)","v":{"$error":"#N/A"}},{"$f":"+Kura!AJ142","v":0},{"$f":"+Kura!AK142","v":0},{"$f":"+Kura!AL142","v":0},{"$f":"+Kura!AM142","v":0},{"$f":"+Kura!AN142","v":0},{"$f":"+Kura!#REF!","v":{"$error":"#REF!"}},null,null,null,null,null,null,null,null,null,null,null,null,null,null,null,null,null,null,null,null,null,null,null,0,0,null,null,null,{"$f":"IF(AND(AJ142=0,AK142=0),\"\",IF(AJ142>AK142,AH138,AH145))","v":""}]
[null,null,null,null,null,null,null,0,0,null,null,47,{"$f":"IF(AND(H143=0,I143=0),\"\",IF(H143>I143,F142,F144))","v":""},null,null,null,null,null,null,{"$f":"IF(AND(H143=0,I143=0),\"\",IF(H143>I143,F142,F144))","v":""},null,null,null,null,null,88]
[94,65,40,25,999,{"$f":"VLOOKUP(E144,Kura!$A$4:$Z$301,26,0)","v":{"$error":"#N/A"}},{"$f":"+Kura!AJ144","v":0},{"$f":"+Kura!AK144","v":0},{"$f":"+Kura!AL144","v":0},{"$f":"+Kura!AM144","v":0},{"$f":"+Kura!AN144","v":0},{"$f":"+Kura!#REF!","v":{"$error":"#REF!"}},null,null,null,null,null,null,null,null,null,null,null,null,null,88]
[95,65,8,57,999,{"$f":"VLOOKUP(E145,Kura!$A$4:$Z$301,26,0)","v":{"$error":"#N/A"}},{"$f":"+Kura!AJ145","v":0},{"$f":"+Kura!AK145","v":0},{"$f":"+Kura!AL145","v":0},{"$f":"+Kura!AM145","v":0},{"$f":"+Kura!AN145","v":0},{"$f":"+Kura!#REF!","v":{"$error":"#REF!"}},null,null,null,null,null,null,null,null,null,0,3,null,null,null,{"$f":"IF(AND(V145=0,W145=0),\"\",IF(V145>W145,T143,T146))","v":"DURU KIRBAÇ (İST)"},null,null,null,null,null,null,{"$f":"IF(AND(V145=0,W145=0),\"\",IF(V145>W145,T143,T146))","v":"DURU KIRBAÇ (İST)"}]
[null,null,null,null,null,null,null,0,3,null,null,48,{"$f":"IF(AND(H146=0,I146=0),\"\",IF(H146>I146,F145,F147))","v":"DURU KIRBAÇ (İST)"},null,null,null,null,null,null,{"$f":"IF(AND(H146=0,I146=0),\"\",IF(H146>I146,F145,F147))","v":"DURU KIRBAÇ (İST)"}]
[96,5,0,0,6,{"$f":"VLOOKUP(E147,Kura!$A$4:$Z$301,26,0)","v":"DURU KIRBAÇ (İST)"},{"$f":"+Kura!AJ147","v":0},{"$f":"+Kura!AK147","v":0},{"$f":"+Kura!AL147","v":0},{"$f":"+Kura!AM147","v":0},{"$f":"+Kura!AN147","v":0},{"$f":"+Kura!#REF!","v":{"$error":"#REF!"}}]
[97,5,0,0,7,{"$f":"VLOOKUP(E148,Kura!$A$4:$Z$301,26,0)","v":"ZEYNEP ADA ER (ANK)"},{"$f":"+Kura!AJ148","v":0},{"$f":"+Kura!AK148","v":0},{"$f":"+Kura!AL148","v":0},{"$f":"+Kura!AM148","v":0},{"$f":"+Kura!AN148","v":0},{"$f":"+Kura!#REF!","v":{"$error":"#REF!"}}]
[null,null,null,null,null,null,null,3,0,null,null,49,{"$f":"IF(AND(H149=0,I149=0),\"\",IF(H149>I149,F148,F150))","v":"ZEYNEP ADA ER (ANK)"},null,null,null,null,null,null,{"$f":"IF(AND(H149=0,I149=0),\"\",IF(H149>I149,F148,F150))","v":"ZEYNEP ADA ER (ANK)"},null,null,null,null,null,89]
[98,65,6,59,999,{"$f":"VLOOKUP(E150,Kura!$A$4:$Z$301,26,0)","v":{"$error":"#N/A"}},{"$f":"+Kura!AJ150","v":0},{"$f":"+Kura!AK150","v":0},{"$f":"+Kura!AL150","v":0},{"$f":"+Kura!AM150","v":0},{"$f":"+Kura!AN150","v":0},{"$f":"+Kura!#REF!","v":{"$error":"#REF!"}},null,null,null,null,null,null,null,null,null,null,null,null,null,89,null,null,null,null,null,null,null,{"$f":"IF(AND(V151=0,W151=0),\"\",IF(V151>W151,T149,T152))","v":"ZEYNEP ADA ER (ANK)"}]
[99,65,38,27,999,{"$f":"VLOOKUP(E151,Kura!$A$4:$Z$301,26,0)","v":{"$error":"#N/A"}},{"$f":"+Kura!AJ151","v":0},{"$f":"+Kura!AK151","v":0},{"$f":"+Kura!AL151","v":0},{"$f":"+Kura!AM151","v":0},{"$f":"+Kura!AN151","v":0},{"$f":"+Kura!#REF!","v":{"$error":"#REF!"}},null,null,null,null,null,null,null,null,null,3,0,null,null,null,{"$f":"IF(AND(V151=0,W151=0),\"\",IF(V151>W151,T149,T152))","v":"ZEYNEP ADA ER (ANK)"},null,null,null,null,null,null,null,null,null,null,null,null,109]
[null,null,null,null,null,null,null,0,0,null,null,50,{"$f":"IF(AND(H152=0,I152=0),\"\",IF(H152>I152,F151,F153))","v":""},null,null,null,null,null,null,{"$f":"IF(AND(H152=0,I152=0),\"\",IF(H152>I152,F151,F153))","v":""}]
[100,33,0,0,999,{"$f":"VLOOKUP(E153,Kura!$A$4:$Z$301,26,0)","v":{"$error":"#N/A"}},{"$f":"+Kura!AJ153","v":0},{"$f":"+Kura!AK153","v":0},{"$f":"+Kura!AL153","v":0},{"$f":"+Kura!AM153","v":0},{"$f":"+Kura!AN153","v":0},{"$f":"+Kura!#REF!","v":{"$error":"#REF!"}}]
[101,33,0,0,89,{"$f":"VLOOKUP(E154,Kura!$A$4:$Z$301,26,0)","v":"HİLAL ECEM MUSLU (ZNG)"},{"$f":"+Kura!AJ154","v":0},{"$f":"+Kura!AK154","v":0},{"$f":"+Kura!AL154","v":0},{"$f":"+Kura!AM154","v":0},{"$f":"+Kura!AN154","v":0},{"$f":"+Kura!#REF!","v":{"$error":"#REF!"}},null,null,null,null,null,null,null,null,null,null,null,null,null,null,null,null,null,null,null,null,null,null,null,0,0,null,null,null,{"$f":"IF(AND(AJ154=0,AK154=0),\"\",IF(AJ154>AK154,AH150,AH157))","v":""}]
[null,null,null,null,null,null,null,0,3,null,null,51,{"$f":"IF(AND(H155=0,I155=0),\"\",IF(H155>I155,F154,F156))","v":"ASLINUR USLU (BRS)"},null,null,null,null,null,null,{"$f":"IF(AND(H155=0,I155=0),\"\",IF(H155>I155,F154,F156))","v":"ASLINUR USLU (BRS)"},null,null,null,null,null,90]
[102,65,54,11,90,{"$f":"VLOOKUP(E156,Kura!$A$4:$Z$301,26,0)","v":"ASLINUR USLU (BRS)"},{"$f":"+Kura!AJ156","v":0},{"$f":"+Kura!AK156","v":0},{"$f":"+Kura!AL156","v":0},{"$f":"+Kura!AM156","v":0},{"$f":"+Kura!AN156","v":0},{"$f":"+Kura!#REF!","v":{"$error":"#REF!"}},null,null,null,null,null,null,null,null,null,null,null,null,null,90]
[103,65,22,43,91,{"$f":"VLOOKUP(E157,Kura!$A$4:$Z$301,26,0)","v":"ZEYNEP HÜMA YILMAZ (SMS)"},{"$f":"+Kura!AJ157","v":0},{"$f":"+Kura!AK157","v":0},{"$f":"+Kura!AL157","v":0},{"$f":"+Kura!AM157","v":0},{"$f":"+Kura!AN157","v":0},{"$f":"+Kura!#REF!","v":{"$error":"#REF!"}},null,null,null,null,null,null,null,null,null,0,3,null,null,null,{"$f":"IF(AND(V157=0,W157=0),\"\",IF(V157>W157,T155,T158))","v":"ELVİN KALE (YLV)"},null,null,null,null,null,null,{"$f":"IF(AND(V157=0,W157=0),\"\",IF(V157>W157,T155,T158))","v":"ELVİN KALE (YLV)"}]
[null,null,null,null,null,null,null,0,3,null,null,52,{"$f":"IF(AND(H158=0,I158=0),\"\",IF(H158>I158,F157,F159))","v":"ELVİN KALE (YLV)"},null,null,null,null,null,null,{"$f":"IF(AND(H158=0,I158=0),\"\",IF(H158>I158,F157,F159))","v":"ELVİN KALE (YLV)"}]
[104,17,0,0,26,{"$f":"VLOOKUP(E159,Kura!$A$4:$Z$301,26,0)","v":"ELVİN KALE (YLV)"},{"$f":"+Kura!AJ159","v":0},{"$f":"+Kura!AK159","v":0},{"$f":"+Kura!AL159","v":0},{"$f":"+Kura!AM159","v":0},{"$f":"+Kura!AN159","v":0},{"$f":"+Kura!#REF!","v":{"$error":"#REF!"}}]
[105,17,0,0,23,{"$f":"VLOOKUP(E160,Kura!$A$4:$Z$301,26,0)","v":"DAMLA AVŞAR (VAN)"},{"$f":"+Kura!AJ160","v":0},{"$f":"+Kura!AK160","v":0},{"$f":"+Kura!AL160","v":0},{"$f":"+Kura!AM160","v":0},{"$f":"+Kura!AN160","v":0},{"$f":"+Kura!#REF!","v":{"$error":"#REF!"}}]
[null,null,null,null,null,null,null,3,0,null,null,53,{"$f":"IF(AND(H161=0,I161=0),\"\",IF(H161>I161,F160,F162))","v":"DAMLA AVŞAR (VAN)"},null,null,null,null,null,null,{"$f":"IF(AND(H161=0,I161=0),\"\",IF(H161>I161,F160,F162))","v":"DAMLA AVŞAR (VAN)"},null,null,null,null,null,91]
[106,65,30,35,92,{"$f":"VLOOKUP(E162,Kura!$A$4:$Z$301,26,0)","v":"AYSEL SENA GÜN (AMS)"},{"$f":"+Kura!AJ162","v":0},{"$f":"+Kura!AK162","v":0},{"$f":"+Kura!AL162","v":0},{"$f":"+Kura!AM162","v":0},{"$f":"+Kura!AN162","v":0},{"$f":"+Kura!#REF!","v":{"$error":"#REF!"}},null,null,null,null,null,null,null,null,null,null,null,null,null,91,null,null,null,null,null,null,null,{"$f":"IF(AND(V163=0,W163=0),\"\",IF(V163>W163,T161,T164))","v":"DAMLA AVŞAR (VAN)"}]
[107,65,62,3,93,{"$f":"VLOOKUP(E163,Kura!$A$4:$Z$301,26,0)","v":"BUSE NUR ÖNDER (BTM)"},{"$f":"+Kura!AJ163","v":0},{"$f":"+Kura!AK163","v":0},{"$f":"+Kura!AL163","v":0},{"$f":"+Kura!AM163","v":0},{"$f":"+Kura!AN163","v":0},{"$f":"+Kura!#REF!","v":{"$error":"#REF!"}},null,null,null,null,null,null,null,null,null,3,1,null,null,null,{"$f":"IF(AND(V163=0,W163=0),\"\",IF(V163>W163,T161,T164))","v":"DAMLA AVŞAR (VAN)"},null,null,null,null,null,null,null,null,null,null,null,null,110]
[null,null,null,null,null,null,null,3,0,null,null,54,{"$f":"IF(AND(H164=0,I164=0),\"\",IF(H164>I164,F163,F165))","v":"BUSE NUR ÖNDER (BTM)"},null,null,null,null,null,null,{"$f":"IF(AND(H164=0,I164=0),\"\",IF(H164>I164,F163,F165))","v":"BUSE NUR ÖNDER (BTM)"}]
[108,33,0,0,39,{"$f":"VLOOKUP(E165,Kura!$A$4:$Z$301,26,0)","v":"ECRİN FİDAN (BRS)"},{"$f":"+Kura!AJ165","v":0},{"$f":"+Kura!AK165","v":0},{"$f":"+Kura!AL165","v":0},{"$f":"+Kura!AM165","v":0},{"$f":"+Kura!AN165","v":0},{"$f":"+Kura!#REF!","v":{"$error":"#REF!"}}]
[109,33,0,0,94,{"$f":"VLOOKUP(E166,Kura!$A$4:$Z$301,26,0)","v":"NEVA NUR KALKAN (AMS)"},{"$f":"+Kura!AJ166","v":0},{"$f":"+Kura!AK166","v":0},{"$f":"+Kura!AL166","v":0},{"$f":"+Kura!AM166","v":0},{"$f":"+Kura!AN166","v":0},{"$f":"+Kura!#REF!","v":{"$error":"#REF!"}},null,null,null,null,null,null,null,null,null,null,null,null,null,null,null,null,null,null,null,null,null,null,null,0,0,null,null,null,{"$f":"IF(AND(AJ166=0,AK166=0),\"\",IF(AJ166>AK166,AH162,AH169))","v":""}]
[null,null,null,null,null,null,null,3,0,null,null,55,{"$f":"IF(AND(H167=0,I167=0),\"\",IF(H167>I167,F166,F168))","v":"NEVA NUR KALKAN (AMS)"},null,null,null,null,null,null,{"$f":"IF(AND(H167=0,I167=0),\"\",IF(H167>I167,F166,F168))","v":"NEVA NUR KALKAN (AMS)"},null,null,null,null,null,92]
[110,65,46,19,95,{"$f":"VLOOKUP(E168,Kura!$A$4:$Z$301,26,0)","v":"BAHAR TUNÇOK (ANK)"},{"$f":"+Kura!AJ168","v":0},{"$f":"+Kura!AK168","v":0},{"$f":"+Kura!AL168","v":0},{"$f":"+Kura!AM168","v":0},{"$f":"+Kura!AN168","v":0},{"$f":"+Kura!#REF!","v":{"$error":"#REF!"}},null,null,null,null,null,null,null,null,null,null,null,null,null,92]
[111,65,14,51,96,{"$f":"VLOOKUP(E169,Kura!$A$4:$Z$301,26,0)","v":"EDA TUNA (ANT)"},{"$f":"+Kura!AJ169","v":0},{"$f":"+Kura!AK169","v":0},{"$f":"+Kura!AL169","v":0},{"$f":"+Kura!AM169","v":0},{"$f":"+Kura!AN169","v":0},{"$f":"+Kura!#REF!","v":{"$error":"#REF!"}},null,null,null,null,null,null,null,null,null,1,3,null,null,null,{"$f":"IF(AND(V169=0,W169=0),\"\",IF(V169>W169,T167,T170))","v":"BUSE KOÇAK (ANK)"},null,null,null,null,null,null,{"$f":"IF(AND(V169=0,W169=0),\"\",IF(V169>W169,T167,T170))","v":"BUSE KOÇAK (ANK)"}]
[null,null,null,null,null,null,null,0,3,null,null,56,{"$f":"IF(AND(H170=0,I170=0),\"\",IF(H170>I170,F169,F171))","v":"BUSE KOÇAK (ANK)"},null,null,null,null,null,null,{"$f":"IF(AND(H170=0,I170=0),\"\",IF(H170>I170,F169,F171))","v":"BUSE KOÇAK (ANK)"}]
[112,9,0,0,10,{"$f":"VLOOKUP(E171,Kura!$A$4:$Z$301,26,0)","v":"BUSE KOÇAK (ANK)"},{"$f":"+Kura!AJ171","v":0},{"$f":"+Kura!AK171","v":0},{"$f":"+Kura!AL171","v":0},{"$f":"+Kura!AM171","v":0},{"$f":"+Kura!AN171","v":0},{"$f":"+Kura!#REF!","v":{"$error":"#REF!"}}]
[113,9,0,0,15,{"$f":"VLOOKUP(E172,Kura!$A$4:$Z$301,26,0)","v":"ÖZLEM KÖSEOĞLU (RİZ)"},{"$f":"+Kura!AJ172","v":0},{"$f":"+Kura!AK172","v":0},{"$f":"+Kura!AL172","v":0},{"$f":"+Kura!AM172","v":0},{"$f":"+Kura!AN172","v":0},{"$f":"+Kura!#REF!","v":{"$error":"#REF!"}}]
[null,null,null,null,null,null,null,3,0,null,null,57,{"$f":"IF(AND(H173=0,I173=0),\"\",IF(H173>I173,F172,F174))","v":"ÖZLEM KÖSEOĞLU (RİZ)"},null,null,null,null,null,null,{"$f":"IF(AND(H173=0,I173=0),\"\",IF(H173>I173,F172,F174))","v":"ÖZLEM KÖSEOĞLU (RİZ)"},null,null,null,null,null,93]
[114,65,10,55,97,{"$f":"VLOOKUP(E174,Kura!$A$4:$Z$301,26,0)","v":"DEFNE DEMİR (ORD)"},{"$f":"+Kura!AJ174","v":0},{"$f":"+Kura!AK174","v":0},{"$f":"+Kura!AL174","v":0},{"$f":"+Kura!AM174","v":0},{"$f":"+Kura!AN174","v":0},{"$f":"+Kura!#REF!","v":{"$error":"#REF!"}},null,null,null,null,null,null,null,null,null,null,null,null,null,93,null,null,null,null,null,null,null,{"$f":"IF(AND(V175=0,W175=0),\"\",IF(V175>W175,T173,T176))","v":"ÖZLEM KÖSEOĞLU (RİZ)"}]
[115,65,42,23,98,{"$f":"VLOOKUP(E175,Kura!$A$4:$Z$301,26,0)","v":0},{"$f":"+Kura!AJ175","v":0},{"$f":"+Kura!AK175","v":0},{"$f":"+Kura!AL175","v":0},{"$f":"+Kura!AM175","v":0},{"$f":"+Kura!AN175","v":0},{"$f":"+Kura!#REF!","v":{"$error":"#REF!"}},null,null,null,null,null,null,null,null,null,3,0,null,null,null,{"$f":"IF(AND(V175=0,W175=0),\"\",IF(V175>W175,T173,T176))","v":"ÖZLEM KÖSEOĞLU (RİZ)"},null,null,null,null,null,null,null,null,null,null,null,null,111]
[null,null,null,null,null,null,null,0,0,null,null,58,{"$f":"IF(AND(H176=0,I176=0),\"\",IF(H176>I176,F175,F177))","v":""},null,null,null,null,null,null,{"$f":"IF(AND(H176=0,I176=0),\"\",IF(H176>I176,F175,F177))","v":""}]
[116,33,0,0,99,{"$f":"VLOOKUP(E177,Kura!$A$4:$Z$301,26,0)","v":0},{"$f":"+Kura!AJ177","v":0},{"$f":"+Kura!AK177","v":0},{"$f":"+Kura!AL177","v":0},{"$f":"+Kura!AM177","v":0},{"$f":"+Kura!AN177","v":0},{"$f":"+Kura!#REF!","v":{"$error":"#REF!"}}]
[117,33,0,0,34,{"$f":"VLOOKUP(E178,Kura!$A$4:$Z$301,26,0)","v":"ELİF BEYZA AKDEMİR (BTM)"},{"$f":"+Kura!AJ178","v":0},{"$f":"+Kura!AK178","v":0},{"$f":"+Kura!AL178","v":0},{"$f":"+Kura!AM178","v":0},{"$f":"+Kura!AN178","v":0},{"$f":"+Kura!#REF!","v":{"$error":"#REF!"}},null,null,null,null,null,null,null,null,null,null,null,null,null,null,null,null,null,null,null,null,null,null,null,0,0,null,null,null,{"$f":"IF(AND(AJ178=0,AK178=0),\"\",IF(AJ178>AK178,AH174,AH181))","v":""}]
[null,null,null,null,null,null,null,3,0,null,null,59,{"$f":"IF(AND(H179=0,I179=0),\"\",IF(H179>I179,F178,F180))","v":"ELİF BEYZA AKDEMİR (BTM)"},null,null,null,null,null,null,{"$f":"IF(AND(H179=0,I179=0),\"\",IF(H179>I179,F178,F180))","v":"ELİF BEYZA AKDEMİR (BTM)"},null,null,null,null,null,94]
[118,65,58,7,100,{"$f":"VLOOKUP(E180,Kura!$A$4:$Z$301,26,0)","v":0},{"$f":"+Kura!AJ180","v":0},{"$f":"+Kura!AK180","v":0},{"$f":"+Kura!AL180","v":0},{"$f":"+Kura!AM180","v":0},{"$f":"+Kura!AN180","v":0},{"$f":"+Kura!#REF!","v":{"$error":"#REF!"}},null,null,null,null,null,null,null,null,null,null,null,null,null,94]
[119,65,26,39,101,{"$f":"VLOOKUP(E181,Kura!$A$4:$Z$301,26,0)","v":0},{"$f":"+Kura!AJ181","v":0},{"$f":"+Kura!AK181","v":0},{"$f":"+Kura!AL181","v":0},{"$f":"+Kura!AM181","v":0},{"$f":"+Kura!AN181","v":0},{"$f":"+Kura!#REF!","v":{"$error":"#REF!"}},null,null,null,null,null,null,null,null,null,3,1,null,null,null,{"$f":"IF(AND(V181=0,W181=0),\"\",IF(V181>W181,T179,T182))","v":"ELİF BEYZA AKDEMİR (BTM)"},null,null,null,null,null,null,{"$f":"IF(AND(V181=0,W181=0),\"\",IF(V181>W181,T179,T182))","v":"ELİF BEYZA AKDEMİR (BTM)"}]
[null,null,null,null,null,null,null,0,3,null,null,60,{"$f":"IF(AND(H182=0,I182=0),\"\",IF(H182>I182,F181,F183))","v":"MERVE MENGENE (RİZ)"},null,null,null,null,null,null,{"$f":"IF(AND(H182=0,I182=0),\"\",IF(H182>I182,F181,F183))","v":"MERVE MENGENE (RİZ)"}]
[120,17,0,0,18,{"$f":"VLOOKUP(E183,Kura!$A$4:$Z$301,26,0)","v":"MERVE MENGENE (RİZ)"},{"$f":"+Kura!AJ183","v":0},{"$f":"+Kura!AK183","v":0},{"$f":"+Kura!AL183","v":0},{"$f":"+Kura!AM183","v":0},{"$f":"+Kura!AN183","v":0},{"$f":"+Kura!#REF!","v":{"$error":"#REF!"}}]
[121,17,0,0,31,{"$f":"VLOOKUP(E184,Kura!$A$4:$Z$301,26,0)","v":"ARMİN AYDIN (İST)"},{"$f":"+Kura!AJ184","v":0},{"$f":"+Kura!AK184","v":0},{"$f":"+Kura!AL184","v":0},{"$f":"+Kura!AM184","v":0},{"$f":"+Kura!AN184","v":0},{"$f":"+Kura!#REF!","v":{"$error":"#REF!"}}]
[null,null,null,null,null,null,null,3,0,null,null,61,{"$f":"IF(AND(H185=0,I185=0),\"\",IF(H185>I185,F184,F186))","v":"ARMİN AYDIN (İST)"},null,null,null,null,null,null,{"$f":"IF(AND(H185=0,I185=0),\"\",IF(H185>I185,F184,F186))","v":"ARMİN AYDIN (İST)"},null,null,null,null,null,95]
[122,65,18,47,102,{"$f":"VLOOKUP(E186,Kura!$A$4:$Z$301,26,0)","v":0},{"$f":"+Kura!AJ186","v":0},{"$f":"+Kura!AK186","v":0},{"$f":"+Kura!AL186","v":0},{"$f":"+Kura!AM186","v":0},{"$f":"+Kura!AN186","v":0},{"$f":"+Kura!#REF!","v":{"$error":"#REF!"}},null,null,null,null,null,null,null,null,null,null,null,null,null,95,null,null,null,null,null,null,null,{"$f":"IF(AND(V187=0,W187=0),\"\",IF(V187>W187,T185,T188))","v":"ARMİN AYDIN (İST)"}]
[123,65,50,15,103,{"$f":"VLOOKUP(E187,Kura!$A$4:$Z$301,26,0)","v":0},{"$f":"+Kura!AJ187","v":0},{"$f":"+Kura!AK187","v":0},{"$f":"+Kura!AL187","v":0},{"$f":"+Kura!AM187","v":0},{"$f":"+Kura!AN187","v":0},{"$f":"+Kura!#REF!","v":{"$error":"#REF!"}},null,null,null,null,null,null,null,null,null,3,0,null,null,null,{"$f":"IF(AND(V187=0,W187=0),\"\",IF(V187>W187,T185,T188))","v":"ARMİN AYDIN (İST)"},null,null,null,null,null,null,null,null,null,null,null,null,112]
[null,null,null,null,null,null,null,0,0,null,null,62,{"$f":"IF(AND(H188=0,I188=0),\"\",IF(H188>I188,F187,F189))","v":""},null,null,null,null,null,null,{"$f":"IF(AND(H188=0,I188=0),\"\",IF(H188>I188,F187,F189))","v":""}]
[124,33,0,0,104,{"$f":"VLOOKUP(E189,Kura!$A$4:$Z$301,26,0)","v":0},{"$f":"+Kura!AJ189","v":0},{"$f":"+Kura!AK189","v":0},{"$f":"+Kura!AL189","v":0},{"$f":"+Kura!AM189","v":0},{"$f":"+Kura!AN189","v":0},{"$f":"+Kura!#REF!","v":{"$error":"#REF!"}}]
[125,33,0,0,999,{"$f":"VLOOKUP(E190,Kura!$A$4:$Z$301,26,0)","v":{"$error":"#N/A"}},{"$f":"+Kura!AJ190","v":0},{"$f":"+Kura!AK190","v":0},{"$f":"+Kura!AL190","v":0},{"$f":"+Kura!AM190","v":0},{"$f":"+Kura!AN190","v":0},{"$f":"+Kura!#REF!","v":{"$error":"#REF!"}},null,null,null,null,null,null,null,null,null,null,null,null,null,null,null,null,null,null,null,null,null,null,null,0,0,null,null,null,{"$f":"IF(AND(AJ190=0,AK190=0),\"\",IF(AJ190>AK190,AH186,AH193))","v":""}]
[null,null,null,null,null,null,null,0,0,null,null,63,{"$f":"IF(AND(H191=0,I191=0),\"\",IF(H191>I191,F190,F192))","v":""},null,null,null,null,null,null,{"$f":"IF(AND(H191=0,I191=0),\"\",IF(H191>I191,F190,F192))","v":""},null,null,null,null,null,96]
[126,65,34,31,999,{"$f":"VLOOKUP(E192,Kura!$A$4:$Z$301,26,0)","v":{"$error":"#N/A"}},{"$f":"+Kura!AJ192","v":0},{"$f":"+Kura!AK192","v":0},{"$f":"+Kura!AL192","v":0},{"$f":"+Kura!AM192","v":0},{"$f":"+Kura!AN192","v":0},{"$f":"+Kura!#REF!","v":{"$error":"#REF!"}},null,null,null,null,null,null,null,null,null,null,null,null,null,96]
[127,65,2,63,999,{"$f":"VLOOKUP(E193,Kura!$A$4:$Z$301,26,0)","v":{"$error":"#N/A"}},{"$f":"+Kura!AJ193","v":0},{"$f":"+Kura!AK193","v":0},{"$f":"+Kura!AL193","v":0},{"$f":"+Kura!AM193","v":0},{"$f":"+Kura!AN193","v":0},{"$f":"+Kura!#REF!","v":{"$error":"#REF!"}},null,null,null,null,null,null,null,null,null,0,3,null,null,null,{"$f":"IF(AND(V193=0,W193=0),\"\",IF(V193>W193,T191,T194))","v":"GÜLCE DÖNMEZ (KNY)"},null,null,null,null,null,null,{"$f":"IF(AND(V193=0,W193=0),\"\",IF(V193>W193,T191,T194))","v":"GÜLCE DÖNMEZ (KNY)"}]
[null,null,null,null,null,null,null,0,3,null,null,64,{"$f":"IF(AND(H194=0,I194=0),\"\",IF(H194>I194,F193,F195))","v":"GÜLCE DÖNMEZ (KNY)"},null,null,null,null,null,null,{"$f":"IF(AND(H194=0,I194=0),\"\",IF(H194>I194,F193,F195))","v":"GÜLCE DÖNMEZ (KNY)"}]
[128,2,0,0,2,{"$f":"VLOOKUP(E195,Kura!$A$4:$Z$301,26,0)","v":"GÜLCE DÖNMEZ (KNY)"},{"$f":"+Kura!AJ195","v":0},{"$f":"+Kura!AK195","v":0},{"$f":"+Kura!AL195","v":0},{"$f":"+Kura!AM195","v":0},{"$f":"+Kura!AN195","v":0},{"$f":"+Kura!#REF!","v":{"$error":"#REF!"}}]

{"sheet":"Ana_Tablo(128)","index":4,"n_rows":98,"n_cols":105,"rows_kept":98,"cut":false,"hidden":false,"merged":[[27,15,27,21],[39,15,39,21],[32,15,32,21],[24,15,24,21],[31,29,31,35],[62,22,62,28],[12,50,12,56],[42,29,42,35],[25,8,25,14],[50,22,50,28],[31,8,31,14],[37,8,37,14],[28,8,28,14],[34,8,34,14],[40,8,40,14],[43,8,43,14],[44,15,44,21],[46,8,46,14],[37,50,37,56],[56,29,56,35],[17,29,17,35],[61,15,61,21],[5,1,5,7],[6,1,6,7],[8,1,8,7],[9,1,9,7],[11,1,11,7],[0,24,2,46],[3,24,3,46],[4,24,4,46],[0,1,0,7],[2,1,2,7],[3,1,3,7],[1,8,1,14],[4,8,4,14],[3,15,3,21],[6,29,6,35],[18,1,18,7],[20,1,20,7],[21,1,21,7],[23,1,23,7],[19,8,19,14],[22,8,22,14],[20,15,20,21],[18,22,18,28],[14,1,14,7],[15,1,15,7],[17,1,17,7],[16,8,16,14],[15,15,15,21],[79,15,79,21],[12,1,12,7],[7,8,7,14],[10,8,10,14],[13,8,13,14],[8,15,8,21],[24,1,24,7],[50,8,50,14],[52,8,52,14],[41,1,41,7],[42,1,42,7],[44,1,44,7],[45,1,45,7],[47,1,47,7],[33,1,33,7],[35,1,35,7],[36,1,36,7],[38,1,38,7],[39,1,39,7],[26,1,26,7],[27,1,27,7],[29,1,29,7],[30,1,30,7],[32,1,32,7],[74,8,74,14],[76,8,76,14],[78,8,78,14],[80,8,80,14],[54,8,54,14],[60,8,60,14],[66,8,66,14],[72,8,72,14],[68,8,68,14],[70,8,70,14],[64,8,64,14],[58,8,58,14],[62,8,62,14],[56,8,56,14],[24,64,24,70],[54,64,54,70],[74,36,74,42],[60,57,60,63],[48,57,48,63],[62,64,62,70],[94,36,94,42],[95,43,95,49],[93,43,93,49],[82,36,82,42],[85,36,85,42],[88,43,88,49],[73,50,73,56],[75,50,75,56],[77,43,77,49],[79,43,79,49],[38,71,38,77],[49,15,49,21],[51,15,51,21],[67,15,67,21],[71,15,71,21],[66,22,66,28],[48,29,48,35],[50,36,50,42],[58,36,58,42],[66,36,66,42],[54,43,54,49],[71,43,71,49],[48,43,48,49],[64,43,64,49],[51,50,51,56],[68,50,68,56],[55,15,55,21],[53,15,53,21],[54,22,54,28],[69,15,69,21],[70,22,70,28],[63,15,63,21],[59,15,59,21],[57,15,57,21],[78,22,78,28],[52,29,52,35],[60,29,60,35],[68,29,68,35],[76,29,76,35],[64,29,64,35],[72,29,72,35],[75,15,75,21],[58,22,58,28],[65,15,65,21],[73,15,73,21],[77,15,77,21],[74,22,74,28],[97,43,97,49],[81,43,81,49],[83,50,83,56],[87,50,87,56],[78,50,78,56],[56,71,56,77],[88,29,88,35],[91,29,91,35],[80,36,80,42],[83,36,83,42],[86,43,86,49],[80,50,80,56],[85,50,85,56],[89,50,89,56],[76,57,76,63],[70,57,70,63],[89,36,89,42],[91,43,91,49],[74,57,74,63],[93,29,93,35],[96,36,96,42],[84,43,84,49],[92,36,92,42],[90,29,90,35]]}
[1,{"$f":"IF(OR(Kura!$AW$1=1,Kura!$AW$1=6,Kura!$AW$1=7),Eleme!AA7,Eleme!T5)","v":"NİL BAŞARAN (İST)"},null,null,null,null,null,null,null,null,null,null,null,null,null,null,null,null,null,null,null,null,null,null,{"$f":"Kura!AC1","v":"TÜRKİYE MASA TENİSİ FEDERASYONU\nKÜÇÜKLER FEDERASYON KUPASI"},null,null,null,null,null,null,null,null,null,null,null,null,null,null,null,null,null,null,null,null,null,null,null,null,null,null,null,null,null,null,null,null,null,null,null,null,null,null,null,null,null,null,null,null,null,null,null,null,null,null,null,null,null,null,null,null,null,null,null,null,null,null,null,null,null,null,null,null,null,null,null,null,null,null,null,null,null,null,"1.Tur (1-16)",3]
[null,null,null,3,0,"Y1",null,1,{"$f":"IF(AND(D2=0,E2=0),\"\",IF(D2>E2,B1,B3))","v":"NİL BAŞARAN (İST)"},null,null,null,null,null,null,null,null,null,null,null,null,null,null,null,null,null,null,null,null,null,null,null,null,null,null,null,null,null,null,null,null,null,null,null,null,null,null,null,null,null,null,null,null,null,null,null,null,null,null,null,null,null,null,null,null,null,null,null,null,null,null,null,null,null,null,null,null,null,null,null,null,null,null,null,null,null,null,null,null,null,null,null,null,null,null,null,null,null,null,null,null,null,null,"2.Tur (17-32)"]
[2,{"$f":"IF(Kura!$AW$1=2,Eleme!T8,Eleme!AA13)","v":"ŞEVVAL ALAŞ (BTM)"},null,null,null,null,null,null,null,null,null,null,null,null,17,null,null,null,null,null,null,null,null,null,null,null,null,null,null,null,null,null,null,null,null,null,null,null,null,null,null,null,null,null,null,null,null,null,null,null,null,null,null,null,null,null,null,null,null,null,null,null,null,null,null,null,null,null,null,null,null,null,null,null,null,null,null,null,null,null,null,null,null,null,null,null,null,null,null,null,null,null,null,null,null,null,null,null,null,null,null,null,null,"3.Tur (33-44)"]
[3,{"$f":"IF(Kura!$AW$1=2,Eleme!T11,Eleme!AA19)","v":"ELA SU YÖNTER (ANK)"},null,null,null,null,null,null,null,null,3,2,"Y17",null,null,{"$f":"IF(AND(K4=0,L4=0),\"\",IF(K4>L4,I2,I5))","v":"NİL BAŞARAN (İST)"},null,null,null,null,null,null,null,null,{"$f":"+Kura!AC2","v":"TEK KIZ [15-16 Nisan Amasya]"},null,null,null,null,null,null,null,null,null,null,null,null,null,null,null,null,null,null,null,null,null,null,null,null,null,null,null,null,null,null,null,null,null,null,null,null,null,null,null,null,null,null,null,null,null,null,null,null,null,null,null,null,null,null,null,null,null,null,null,null,null,null,null,null,null,null,null,null,null,null,null,null,null,null,null,null,null,null,"4.Tur (45-48)"]
[null,null,null,3,1,"Y2",null,2,{"$f":"IF(AND(D5=0,E5=0),\"\",IF(D5>E5,B4,B6))","v":"ELA SU YÖNTER (ANK)"},null,null,null,null,null,null,null,null,null,null,null,null,33,null,null,{"$f":"+Kura!AE3","v":"[ Ana Tablo ]"},null,null,null,null,null,null,null,null,null,null,null,null,null,null,null,null,null,null,null,null,null,null,null,null,null,null,null,null,null,null,null,null,null,null,null,null,null,null,null,null,null,null,null,null,null,null,null,null,null,null,null,null,null,null,null,null,null,null,null,null,null,null,null,null,null,null,null,null,null,null,null,null,null,null,null,null,null,null,"5.Tur (49-56)"]
[4,{"$f":"IF(Kura!$AW$1=2,Eleme!T14,Eleme!AA25)","v":"CEYLİN AKDANALI (ÇRM)"},null,null,null,null,null,null,null,null,null,null,null,null,null,null,null,null,null,null,null,null,null,null,null,null,null,null,null,null,null,null,null,null,null,null,null,null,null,null,null,null,null,null,null,null,null,null,null,null,null,null,null,null,null,null,null,null,null,null,null,null,null,null,null,null,null,null,null,null,null,null,null,null,null,null,null,null,null,null,null,null,null,null,null,null,null,null,null,null,null,null,null,null,null,null,null,null,null,null,null,null,null,"6.Tur (57-62)"]
[5,{"$f":"IF(Kura!$AW$1=2,Eleme!T17,Eleme!AA31)","v":"ELİZAN BAŞAR (ANK)"},null,null,null,null,null,null,null,null,null,null,null,null,null,null,null,3,0,"Y25",null,null,null,null,null,null,null,null,null,{"$f":"IF(AND(R7=0,S7=0),\"\",IF(R7>S7,P4,P9))","v":"NİL BAŞARAN (İST)"},null,null,null,null,null,null,null,null,null,null,null,null,null,null,null,null,null,null,null,null,null,null,null,null,null,null,null,null,null,null,null,null,null,null,null,null,null,null,null,null,null,null,null,null,null,null,null,null,null,null,null,null,null,null,null,null,null,null,null,null,null,null,null,null,null,null,null,null,null,null,null,null,null,"7.Tur (63-67)"]
[null,null,null,3,0,"Y3",null,3,{"$f":"IF(AND(D8=0,E8=0),\"\",IF(D8>E8,B7,B9))","v":"ELİZAN BAŞAR (ANK)"},null,null,null,null,null,null,null,null,null,null,null,null,null,null,null,null,null,null,null,null,null,null,null,null,null,null,49,null,null,null,null,null,null,null,null,null,null,null,null,null,null,null,null,null,null,null,null,null,null,null,null,null,null,null,null,null,null,null,null,null,null,null,null,null,null,null,null,null,null,null,null,null,null,null,null,null,null,null,null,null,null,null,null,null,null,null,null,null,null,null,null,null,null,null,"8.Tur (68-70)"]
[6,{"$f":"IF(Kura!$AW$1=2,Eleme!T20,Eleme!AA37)","v":"NİSA ÜZÜMCÜ (BTM)"},null,null,null,null,null,null,null,null,null,null,null,null,18,{"$f":"IF(AND(K10=0,L10=0),\"\",IF(K10>L10,I8,I11))","v":"ELİZAN BAŞAR (ANK)"},null,null,null,null,null,null,null,null,null,null,null,null,null,null,null,null,null,null,null,null,null,null,null,null,null,null,null,null,null,null,null,null,null,null,null,null,null,null,null,null,null,null,null,null,null,null,null,null,null,null,null,null,null,null,null,null,null,null,null,null,null,null,null,null,null,null,null,null,null,null,null,null,null,null,null,null,null,null,null,null,null,null,null,null,null,null,null,"9.Tur (71)"]
[7,{"$f":"IF(Kura!$AW$1=2,Eleme!T23,Eleme!AA43)","v":"ESİLA SU YALÇIN (SKR)"},null,null,null,null,null,null,null,null,3,1,"Y18",null,null,null,null,null,null,null,null,null,null,null,null,null,null,null,null,null,null,null,null,null,null,null,null,null,null,null,null,null,null,null,null,null,null,null,null,null,null,null,null,null,null,null,null,null,null,null,null,null,null,null,null,null,null,null,null,null,null,null,null,null,null,null,null,null,null,null,null,null,null,null,null,null,null,null,null,null,null,null,null,null,null,null,null,null,null,null,null,null,null,"10.Tur (72)"]
[null,null,null,3,2,"Y4",null,4,{"$f":"IF(AND(D11=0,E11=0),\"\",IF(D11>E11,B10,B12))","v":"ESİLA SU YALÇIN (SKR)"}]
[8,{"$f":"IF(Kura!$AW$1=2,Eleme!T26,Eleme!AA49)","v":"DURU ŞENDOĞAN (RİZ)"}]
[9,{"$f":"IF(Kura!$AW$1=2,Eleme!T29,Eleme!AA55)","v":"EYLÜL ŞEVVAL AYDIN (İST)"},null,null,null,null,null,null,null,null,null,null,null,null,null,null,null,null,null,null,null,null,null,null,null,null,null,null,null,null,null,3,0,"Y29",null,null,null,null,null,null,null,null,null,null,null,null,null,null,null,null,{"$f":"IF(AND(AF13=0,AG13=0),\"\",IF(AF13>AG13,AD7,AD18))","v":"NİL BAŞARAN (İST)"}]
[null,null,null,3,0,"Y5",null,5,{"$f":"IF(AND(D14=0,E14=0),\"\",IF(D14>E14,B13,B15))","v":"EYLÜL ŞEVVAL AYDIN (İST)"},null,null,null,null,null,null,null,null,null,null,null,null,null,null,null,null,null,null,null,null,null,null,null,null,null,null,null,null,null,null,null,null,null,null,null,null,null,null,null,null,null,null,null,null,null,null,null,68]
[10,{"$f":"IF(Kura!$AW$1=2,Eleme!T32,Eleme!AA61)","v":"ELANUR YILMAZ (BRS)"},null,null,null,null,null,null,null,null,null,null,null,null,19]
[11,{"$f":"IF(Kura!$AW$1=2,Eleme!T35,Eleme!AA67)","v":"DİLAY BALABAN (RİZ)"},null,null,null,null,null,null,null,null,3,0,"Y19",null,null,{"$f":"IF(AND(K16=0,L16=0),\"\",IF(K16>L16,I14,I17))","v":"EYLÜL ŞEVVAL AYDIN (İST)"}]
[null,null,null,3,2,"Y6",null,6,{"$f":"IF(AND(D17=0,E17=0),\"\",IF(D17>E17,B16,B18))","v":"DİLAY BALABAN (RİZ)"},null,null,null,null,null,null,null,null,null,null,null,null,34]
[12,{"$f":"IF(Kura!$AW$1=2,Eleme!T38,Eleme!AA73)","v":"ZEYNEP NAZ EKER (KRL)"},null,null,null,null,null,null,null,null,null,null,null,null,null,null,null,null,null,null,null,null,null,null,null,null,null,null,null,{"$f":"IF(AND(R19=0,S19=0),\"\",IF(R19>S19,P16,P21))","v":"HATİCE ELİF GÜVELİ (İST)"}]
[13,{"$f":"IF(Kura!$AW$1=2,Eleme!T41,Eleme!AA79)","v":"İPEK ERTUNA (ANK)"},null,null,null,null,null,null,null,null,null,null,null,null,null,null,null,1,3,"Y26"]
[null,null,null,2,3,"Y7",null,7,{"$f":"IF(AND(D20=0,E20=0),\"\",IF(D20>E20,B19,B21))","v":"MASAL ERYILMAZ (İST)"}]
[14,{"$f":"IF(Kura!$AW$1=2,Eleme!T44,Eleme!AA85)","v":"MASAL ERYILMAZ (İST)"},null,null,null,null,null,null,null,null,null,null,null,null,20,{"$f":"IF(AND(K22=0,L22=0),\"\",IF(K22>L22,I20,I23))","v":"HATİCE ELİF GÜVELİ (İST)"}]
[15,{"$f":"IF(Kura!$AW$1=2,Eleme!T47,Eleme!AA91)","v":"ZEYNEP DURAN (İST)"},null,null,null,null,null,null,null,null,0,3,"Y20"]
[null,null,null,2,3,"Y8",null,8,{"$f":"IF(AND(D23=0,E23=0),\"\",IF(D23>E23,B22,B24))","v":"HATİCE ELİF GÜVELİ (İST)"}]
[16,{"$f":"IF(Kura!$AW$1=2,Eleme!T50,Eleme!AA97)","v":"HATİCE ELİF GÜVELİ (İST)"}]
[17,{"$f":"IF(Kura!$AW$1=2,Eleme!T53,Eleme!AA103)","v":"ELİF ECE AKYÜREK (ADN)"},null,null,null,null,null,null,null,null,null,null,null,null,null,null,null,null,null,null,null,null,null,null,null,null,null,null,null,null,null,null,null,null,null,null,null,null,null,null,null,null,null,null,null,null,null,null,null,null,null,null,0,3,"Y31",null,null,null,null,null,null,null,null,null,{"$f":"IF(AND(BA25=0,BB25=0),\"\",IF(BA25>BB25,AY13,AY38))","v":"ELİF ECE AKYÜREK (ADN)"}]
[null,null,null,3,0,"Y9",null,9,{"$f":"IF(AND(D26=0,E26=0),\"\",IF(D26>E26,B25,B27))","v":"ELİF ECE AKYÜREK (ADN)"},null,null,null,null,null,null,null,null,null,null,null,null,null,null,null,null,null,null,null,null,null,null,null,null,null,null,null,null,null,null,null,null,null,null,null,null,null,null,null,null,null,null,null,null,null,null,null,null,null,null,null,null,null,null,null,null,null,null,null,null,null,72]
[18,{"$f":"IF(Kura!$AW$1=2,Eleme!T56,Eleme!AA109)","v":"EYLÜL KENANOĞLU (KST)"},null,null,null,null,null,null,null,null,null,null,null,null,21]
[19,{"$f":"IF(Kura!$AW$1=2,Eleme!T59,Eleme!AA115)","v":"ESMA SULTAN SARI (SKR)"},null,null,null,null,null,null,null,null,3,0,"Y21",null,null,{"$f":"IF(AND(K28=0,L28=0),\"\",IF(K28>L28,I26,I29))","v":"ELİF ECE AKYÜREK (ADN)"}]
[null,null,null,3,1,"Y10",null,10,{"$f":"IF(AND(D29=0,E29=0),\"\",IF(D29>E29,B28,B30))","v":"ESMA SULTAN SARI (SKR)"},null,null,null,null,null,null,null,null,null,null,null,null,35]
[20,{"$f":"IF(Kura!$AW$1=2,Eleme!T62,Eleme!AA121)","v":"ELANUR ALAÇAM (AMS)"}]
[21,{"$f":"IF(Kura!$AW$1=2,Eleme!T65,Eleme!AA127)","v":"AYTEN CEREN KAHRAMAN (KYS)"},null,null,null,null,null,null,null,null,null,null,null,null,null,null,null,3,1,"Y27"]
[null,null,null,3,0,"Y11",null,11,{"$f":"IF(AND(D32=0,E32=0),\"\",IF(D32>E32,B31,B33))","v":"AYTEN CEREN KAHRAMAN (KYS)"},null,null,null,null,null,null,null,null,null,null,null,null,null,null,null,null,null,null,null,null,{"$f":"IF(AND(R31=0,S31=0),\"\",IF(R31>S31,P28,P33))","v":"ELİF ECE AKYÜREK (ADN)"}]
[22,{"$f":"IF(Kura!$AW$1=2,Eleme!T68,Eleme!AA133)","v":"IRMAK BÜŞRA UNCU (KST)"},null,null,null,null,null,null,null,null,null,null,null,null,22,{"$f":"IF(AND(K34=0,L34=0),\"\",IF(K34>L34,I32,I35))","v":"AYTEN CEREN KAHRAMAN (KYS)"},null,null,null,null,null,null,null,null,null,null,null,null,null,null,null,null,null,null,null,50]
[23,{"$f":"IF(Kura!$AW$1=2,Eleme!T71,Eleme!AA139)","v":"NAZLINUR AKGÜN (ANT)"},null,null,null,null,null,null,null,null,3,1,"Y22"]
[null,null,null,0,3,"Y12",null,12,{"$f":"IF(AND(D35=0,E35=0),\"\",IF(D35>E35,B34,B36))","v":"DURU KIRBAÇ (İST)"}]
[24,{"$f":"IF(Kura!$AW$1=2,Eleme!T74,Eleme!AA145)","v":"DURU KIRBAÇ (İST)"}]
[25,{"$f":"IF(Kura!$AW$1=2,Eleme!T77,Eleme!AA151)","v":"ZEYNEP ADA ER (ANK)"}]
[null,null,null,3,2,"Y13",null,13,{"$f":"IF(AND(D38=0,E38=0),\"\",IF(D38>E38,B37,B39))","v":"ZEYNEP ADA ER (ANK)"},null,null,null,null,null,null,null,null,null,null,null,null,null,null,null,null,null,null,null,null,null,null,3,1,"Y30",null,null,null,null,null,null,null,null,null,null,null,null,null,null,null,null,{"$f":"IF(AND(AF38=0,AG38=0),\"\",IF(AF38>AG38,AD32,AD43))","v":"ELİF ECE AKYÜREK (ADN)"}]
[26,{"$f":"IF(Kura!$AW$1=2,Eleme!T80,Eleme!AA157)","v":"ELVİN KALE (YLV)"},null,null,null,null,null,null,null,null,null,null,null,null,23,null,null,null,null,null,null,null,null,null,null,null,null,null,null,null,null,null,null,null,null,null,null,null,null,null,null,null,null,null,null,null,null,null,null,null,null,null,null,null,null,null,null,null,null,null,null,null,null,null,null,null,1,3,"Y32",null,null,{"$f":"IF(AND(BO39=0,BP39=0),\"\",IF(BO39>BP39,BM25,BM55))","v":"NİL BAŞARAN (İST)"},null,null,null,null,null,null,"1."]
[27,{"$f":"IF(Kura!$AW$1=2,Eleme!T83,Eleme!AA163)","v":"DAMLA AVŞAR (VAN)"},null,null,null,null,null,null,null,null,2,3,"Y23",null,null,{"$f":"IF(AND(K40=0,L40=0),\"\",IF(K40>L40,I38,I41))","v":"BUSE KOÇAK (ANK)"}]
[null,null,null,0,3,"Y14",null,14,{"$f":"IF(AND(D41=0,E41=0),\"\",IF(D41>E41,B40,B42))","v":"BUSE KOÇAK (ANK)"},null,null,null,null,null,null,null,null,null,null,null,null,36]
[28,{"$f":"IF(Kura!$AW$1=2,Eleme!T86,Eleme!AA169)","v":"BUSE KOÇAK (ANK)"}]
[29,{"$f":"IF(Kura!$AW$1=2,Eleme!T89,Eleme!AA175)","v":"ÖZLEM KÖSEOĞLU (RİZ)"},null,null,null,null,null,null,null,null,null,null,null,null,null,null,null,3,0,"Y28",null,null,null,null,null,null,null,null,null,{"$f":"IF(AND(R43=0,S43=0),\"\",IF(R43>S43,P40,P45))","v":"BUSE KOÇAK (ANK)"}]
[null,null,null,2,3,"Y15",null,15,{"$f":"IF(AND(D44=0,E44=0),\"\",IF(D44>E44,B43,B45))","v":"ELİF BEYZA AKDEMİR (BTM)"}]
[30,{"$f":"IF(Kura!$AW$1=2,Eleme!T92,Eleme!AA181)","v":"ELİF BEYZA AKDEMİR (BTM)"},null,null,null,null,null,null,null,null,null,null,null,null,24,{"$f":"IF(AND(K46=0,L46=0),\"\",IF(K46>L46,I44,I47))","v":"GÜLCE DÖNMEZ (KNY)"}]
[31,{"$f":"IF(Kura!$AW$1=2,Eleme!T95,Eleme!AA187)","v":"ARMİN AYDIN (İST)"},null,null,null,null,null,null,null,null,0,3,"Y24"]
[null,null,null,1,3,"Y16",null,16,{"$f":"IF(AND(D47=0,E47=0),\"\",IF(D47>E47,B46,B48))","v":"GÜLCE DÖNMEZ (KNY)"}]
[32,{"$f":"IF(Kura!$AW$1=2,Eleme!T98,Eleme!AA193)","v":"GÜLCE DÖNMEZ (KNY)"}]
[null,null,null,null,null,null,null,null,null,null,null,null,null,null,null,null,null,null,null,null,null,null,null,null,null,null,null,null,"Y25",{"$f":"IF(AND(R7=0,S7=0),\"\",IF(R7<S7,P4,P9))","v":"ELİZAN BAŞAR (ANK)"},null,null,null,null,null,null,null,null,null,null,null,null,"Y30",{"$f":"IF(AND(AF38=0,AG38=0),\"\",IF(AF38<AG38,AD32,AD43))","v":"BUSE KOÇAK (ANK)"},null,null,null,null,null,null,null,null,null,null,null,null,"Y31",{"$f":"IF(AND(BA25=0,BB25=0),\"\",IF(BA25<BB25,AY13,AY38))","v":"NİL BAŞARAN (İST)"}]
[null,null,null,null,null,null,null,null,null,null,null,null,null,null,"Y24",{"$f":"IF(AND(K46=0,L46=0),\"\",IF(K46<L46,I44,I47))","v":"ELİF BEYZA AKDEMİR (BTM)"},null,null,null,null,null,null,null,null,null,null,null,null,null,null,null,null,null,null,null,51,null,null,null,null,null,null,null,null,null,null,null,null,null,63,null,null,null,null,null,null,null,null,null,null,null,null,null,71]
[null,null,null,null,null,null,null,"Y1",{"$f":"IF(AND(D2=0,E2=0),\"\",IF(D2<E2,B1,B3))","v":"ŞEVVAL ALAŞ (BTM)"},null,null,null,null,null,null,null,null,0,3,"YE",null,37,{"$f":"IF(AND(R51=0,S51=0),\"\",IF(R51>S51,P50,P52))","v":"CEYLİN AKDANALI (ÇRM)"},null,null,null,null,null,null,null,null,0,3,"Y37",null,null,{"$f":"IF(AND(AF51=0,AG51=0),\"\",IF(AF51>AG51,AD49,AD53))","v":"DURU ŞENDOĞAN (RİZ)"}]
[null,null,null,null,null,null,null,null,null,null,0,3,"Y.Elenir",null,25,{"$f":"IF(AND(K52=0,L52=0),\"\",IF(K52>L52,I51,I53))","v":"CEYLİN AKDANALI (ÇRM)"},null,null,null,null,null,null,null,null,null,null,null,null,45,null,null,null,null,null,null,null,null,null,null,null,null,null,57,null,null,null,null,null,null,null,{"$f":"IF(AND(AT53=0,AU53=0),\"\",IF(AT53>AU53,AR49,AR55))","v":"BUSE KOÇAK (ANK)"}]
[null,null,null,null,null,null,null,"Y2",{"$f":"IF(AND(D5=0,E5=0),\"\",IF(D5<E5,B4,B6))","v":"CEYLİN AKDANALI (ÇRM)"},null,null,null,null,null,null,null,null,null,null,null,null,null,null,null,null,0,3,"Y33",null,{"$f":"IF(AND(Z53=0,AA53=0),\"\",IF(Z53>AA53,W51,W55))","v":"DURU ŞENDOĞAN (RİZ)"},null,null,null,null,null,null,null,null,null,null,null,null,null,null,null,3,0,"Y43",null,null,null,null,null,null,null,null,69]
[null,null,null,null,null,null,null,null,null,null,null,null,null,null,"Y23",{"$f":"IF(AND(K40=0,L40=0),\"\",IF(K40<L40,I38,I41))","v":"ZEYNEP ADA ER (ANK)"}]
[null,null,null,null,null,null,null,"Y3",{"$f":"IF(AND(D8=0,E8=0),\"\",IF(D8<E8,B7,B9))","v":"NİSA ÜZÜMCÜ (BTM)"},null,null,null,null,null,null,null,null,2,3,"YE",null,38,{"$f":"IF(AND(R55=0,S55=0),\"\",IF(R55>S55,P54,P56))","v":"DURU ŞENDOĞAN (RİZ)"},null,null,null,null,null,null,null,null,null,null,null,null,null,null,null,null,null,null,null,null,{"$f":"IF(AND(AM56=0,AN56=0),\"\",IF(AM56>AN56,AK51,AK59))","v":"DURU KIRBAÇ (İST)"},null,null,null,null,null,null,null,null,null,null,null,null,null,null,null,null,3,0,"Y46",null,{"$f":"IF(AND(BI55=0,BJ55=0),\"\",IF(BI55>BJ55,BF49,BF61))","v":"NİL BAŞARAN (İST)"}]
[null,null,null,null,null,null,null,null,null,null,1,3,"YE",null,26,{"$f":"IF(AND(K56=0,L56=0),\"\",IF(K56>L56,I55,I57))","v":"DURU ŞENDOĞAN (RİZ)"},null,null,null,null,null,null,null,null,null,null,null,null,null,null,null,null,null,null,null,null,null,null,0,3,"Y41"]
[null,null,null,null,null,null,null,"Y4",{"$f":"IF(AND(D11=0,E11=0),\"\",IF(D11<E11,B10,B12))","v":"DURU ŞENDOĞAN (RİZ)"},null,null,null,null,null,null,null,null,null,null,null,null,null,null,null,null,null,null,null,"Y26",{"$f":"IF(AND(R19=0,S19=0),\"\",IF(R19<S19,P16,P21))","v":"EYLÜL ŞEVVAL AYDIN (İST)"},null,null,null,null,null,null,null,null,null,null,null,null,null,null,null,null,null,null,null,null,null,null,null,null,null,null,null,null,null,null,null,null,null,null,null,null,null,null,null,null,"Y32",{"$f":"IF(AND(BO39=0,BP39=0),\"\",IF(BO39<BP39,BM25,BM55))","v":"ELİF ECE AKYÜREK (ADN)"},null,null,null,null,null,null,"2."]
[null,null,null,null,null,null,null,null,null,null,null,null,null,null,"Y22",{"$f":"IF(AND(K34=0,L34=0),\"\",IF(K34<L34,I32,I35))","v":"DURU KIRBAÇ (İST)"},null,null,null,null,null,null,null,null,null,null,null,null,null,null,null,null,null,null,null,52]
[null,null,null,null,null,null,null,"Y5",{"$f":"IF(AND(D14=0,E14=0),\"\",IF(D14<E14,B13,B15))","v":"ELANUR YILMAZ (BRS)"},null,null,null,null,null,null,null,null,3,1,"YE",null,39,{"$f":"IF(AND(R59=0,S59=0),\"\",IF(R59>S59,P58,P60))","v":"DURU KIRBAÇ (İST)"},null,null,null,null,null,null,null,null,0,3,"Y38",null,null,{"$f":"IF(AND(AF59=0,AG59=0),\"\",IF(AF59>AG59,AD57,AD61))","v":"DURU KIRBAÇ (İST)"}]
[null,null,null,null,null,null,null,null,null,null,0,3,"YE",null,27,{"$f":"IF(AND(K60=0,L60=0),\"\",IF(K60>L60,I59,I61))","v":"ZEYNEP NAZ EKER (KRL)"},null,null,null,null,null,null,null,null,null,null,null,null,46]
[null,null,null,null,null,null,null,"Y6",{"$f":"IF(AND(D17=0,E17=0),\"\",IF(D17<E17,B16,B18))","v":"ZEYNEP NAZ EKER (KRL)"},null,null,null,null,null,null,null,null,null,null,null,null,null,null,null,null,3,1,"Y34",null,{"$f":"IF(AND(Z61=0,AA61=0),\"\",IF(Z61>AA61,W59,W63))","v":"DURU KIRBAÇ (İST)"},null,null,null,null,null,null,null,null,null,null,null,null,null,null,null,null,null,null,null,null,null,null,0,3,"Y45",null,null,{"$f":"IF(AND(BA61=0,BB61=0),\"\",IF(BA61>BB61,AY52,AY69))","v":"HATİCE ELİF GÜVELİ (İST)"}]
[null,null,null,null,null,null,null,null,null,null,null,null,null,null,"Y21",{"$f":"IF(AND(K28=0,L28=0),\"\",IF(K28<L28,I26,I29))","v":"ESMA SULTAN SARI (SKR)"}]
[null,null,null,null,null,null,null,"Y7",{"$f":"IF(AND(D20=0,E20=0),\"\",IF(D20<E20,B19,B21))","v":"İPEK ERTUNA (ANK)"},null,null,null,null,null,null,null,null,2,3,"YE",null,40,{"$f":"IF(AND(R63=0,S63=0),\"\",IF(R63>S63,P62,P64))","v":"İPEK ERTUNA (ANK)"},null,null,null,null,null,null,null,null,null,null,null,null,null,null,null,null,null,null,null,null,null,null,null,null,null,null,null,null,null,null,null,null,null,null,null,null,null,null,null,null,"Y46",{"$f":"IF(AND(BI55=0,BJ55=0),\"\",IF(BI55<BJ55,BF49,BF61))","v":"HATİCE ELİF GÜVELİ (İST)"},null,null,null,null,null,null,"3."]
[null,null,null,null,null,null,null,null,null,null,3,1,"YE",null,28,{"$f":"IF(AND(K64=0,L64=0),\"\",IF(K64>L64,I63,I65))","v":"İPEK ERTUNA (ANK)"}]
[null,null,null,null,null,null,null,"Y8",{"$f":"IF(AND(D23=0,E23=0),\"\",IF(D23<E23,B22,B24))","v":"ZEYNEP DURAN (İST)"},null,null,null,null,null,null,null,null,null,null,null,null,null,null,null,null,null,null,null,"Y27",{"$f":"IF(AND(R31=0,S31=0),\"\",IF(R31<S31,P28,P33))","v":"AYTEN CEREN KAHRAMAN (KYS)"},null,null,null,null,null,null,null,null,null,null,null,null,"Y29",{"$f":"IF(AND(AF13=0,AG13=0),\"\",IF(AF13<AG13,AD7,AD18))","v":"HATİCE ELİF GÜVELİ (İST)"}]
[null,null,null,null,null,null,null,null,null,null,null,null,null,null,"Y20",{"$f":"IF(AND(K22=0,L22=0),\"\",IF(K22<L22,I20,I23))","v":"MASAL ERYILMAZ (İST)"},null,null,null,null,null,null,null,null,null,null,null,null,null,null,null,null,null,null,null,53,null,null,null,null,null,null,null,null,null,null,null,null,null,64]
[null,null,null,null,null,null,null,"Y9",{"$f":"IF(AND(D26=0,E26=0),\"\",IF(D26<E26,B25,B27))","v":"EYLÜL KENANOĞLU (KST)"},null,null,null,null,null,null,null,null,3,0,"YE",null,41,{"$f":"IF(AND(R67=0,S67=0),\"\",IF(R67>S67,P66,P68))","v":"MASAL ERYILMAZ (İST)"},null,null,null,null,null,null,null,null,3,0,"Y39",null,null,{"$f":"IF(AND(AF67=0,AG67=0),\"\",IF(AF67>AG67,AD65,AD69))","v":"AYTEN CEREN KAHRAMAN (KYS)"}]
[null,null,null,null,null,null,null,null,null,null,0,3,"YE",null,29,{"$f":"IF(AND(K68=0,L68=0),\"\",IF(K68>L68,I67,I69))","v":"ELANUR ALAÇAM (AMS)"},null,null,null,null,null,null,null,null,null,null,null,null,47]
[null,null,null,null,null,null,null,"Y10",{"$f":"IF(AND(D29=0,E29=0),\"\",IF(D29<E29,B28,B30))","v":"ELANUR ALAÇAM (AMS)"},null,null,null,null,null,null,null,null,null,null,null,null,null,null,null,null,3,2,"Y35",null,{"$f":"IF(AND(Z69=0,AA69=0),\"\",IF(Z69>AA69,W67,W71))","v":"MASAL ERYILMAZ (İST)"},null,null,null,null,null,null,null,null,null,null,null,null,58,null,null,3,0,"Y44",null,null,{"$f":"IF(AND(AT69=0,AU69=0),\"\",IF(AT69>AU69,AR65,AR72))","v":"HATİCE ELİF GÜVELİ (İST)"}]
[null,null,null,null,null,null,null,null,null,null,null,null,null,null,"Y19",{"$f":"IF(AND(K16=0,L16=0),\"\",IF(K16<L16,I14,I17))","v":"DİLAY BALABAN (RİZ)"}]
[null,null,null,null,null,null,null,"Y11",{"$f":"IF(AND(D32=0,E32=0),\"\",IF(D32<E32,B31,B33))","v":"IRMAK BÜŞRA UNCU (KST)"},null,null,null,null,null,null,null,null,1,3,"YE",null,42,{"$f":"IF(AND(R71=0,S71=0),\"\",IF(R71>S71,P70,P72))","v":"IRMAK BÜŞRA UNCU (KST)"},null,null,null,null,null,null,null,null,null,null,null,null,null,null,null,null,null,null,null,null,null,null,null,null,null,null,null,null,null,null,null,null,null,"Y45",{"$f":"IF(AND(BA61=0,BB61=0),\"\",IF(BA61<BB61,AY52,AY69))","v":"BUSE KOÇAK (ANK)"},null,null,null,null,null,null,"4."]
[null,null,null,null,null,null,null,null,null,null,3,0,"YE",null,30,{"$f":"IF(AND(K72=0,L72=0),\"\",IF(K72>L72,I71,I73))","v":"IRMAK BÜŞRA UNCU (KST)"},null,null,null,null,null,null,null,null,null,null,null,null,null,null,null,null,null,null,null,null,null,null,0,3,"Y42",null,null,{"$f":"IF(AND(AM72=0,AN72=0),\"\",IF(AM72>AN72,AK67,AK75))","v":"GÜLCE DÖNMEZ (KNY)"}]
[null,null,null,null,null,null,null,"Y12",{"$f":"IF(AND(D35=0,E35=0),\"\",IF(D35<E35,B34,B36))","v":"NAZLINUR AKGÜN (ANT)"},null,null,null,null,null,null,null,null,null,null,null,null,null,null,null,null,null,null,null,"Y28",{"$f":"IF(AND(R43=0,S43=0),\"\",IF(R43<S43,P40,P45))","v":"GÜLCE DÖNMEZ (KNY)"}]
[null,null,null,null,null,null,null,null,null,null,null,null,null,null,"Y18",{"$f":"IF(AND(K10=0,L10=0),\"\",IF(K10<L10,I8,I11))","v":"ESİLA SU YALÇIN (SKR)"},null,null,null,null,null,null,null,null,null,null,null,null,null,null,null,null,null,null,null,54,null,null,null,null,null,null,null,null,null,null,null,null,null,"Y43",{"$f":"IF(AND(AT53=0,AU53=0),\"\",IF(AT53<AU53,AR49,AR55))","v":"DURU KIRBAÇ (İST)"}]
[null,null,null,null,null,null,null,"Y13",{"$f":"IF(AND(D38=0,E38=0),\"\",IF(D38<E38,B37,B39))","v":"ELVİN KALE (YLV)"},null,null,null,null,null,null,null,null,0,3,"YE",null,43,{"$f":"IF(AND(R75=0,S75=0),\"\",IF(R75>S75,P74,P76))","v":"ELVİN KALE (YLV)"},null,null,null,null,null,null,null,null,3,1,"Y40",null,null,{"$f":"IF(AND(AF75=0,AG75=0),\"\",IF(AF75>AG75,AD73,AD77))","v":"GÜLCE DÖNMEZ (KNY)"},null,null,null,null,null,null,null,null,null,null,null,null,null,null,null,1,3,"Y56",null,70,{"$f":"IF(AND(BA75=0,BB75=0),\"\",IF(BA75>BB75,AY74,AY76))","v":"GÜLCE DÖNMEZ (KNY)"},null,null,null,null,null,null,"5."]
[null,null,null,null,null,null,null,null,null,null,3,0,"YE",null,31,{"$f":"IF(AND(K76=0,L76=0),\"\",IF(K76>L76,I75,I77))","v":"ELVİN KALE (YLV)"},null,null,null,null,null,null,null,null,null,null,null,null,48,null,null,null,null,null,null,null,null,null,null,null,null,null,null,null,null,null,null,null,null,"Y44",{"$f":"IF(AND(AT69=0,AU69=0),\"\",IF(AT69<AU69,AR65,AR72))","v":"GÜLCE DÖNMEZ (KNY)"}]
[null,null,null,null,null,null,null,"Y14",{"$f":"IF(AND(D41=0,E41=0),\"\",IF(D41<E41,B40,B42))","v":"DAMLA AVŞAR (VAN)"},null,null,null,null,null,null,null,null,null,null,null,null,null,null,null,null,3,2,"Y36",null,{"$f":"IF(AND(Z77=0,AA77=0),\"\",IF(Z77>AA77,W75,W79))","v":"ELVİN KALE (YLV)"},null,null,null,null,null,null,null,null,null,null,null,null,null,null,null,null,null,null,null,null,null,null,null,null,null,null,"Y56",{"$f":"IF(AND(BA75=0,BB75=0),\"\",IF(BA75<BB75,AY74,AY76))","v":"DURU KIRBAÇ (İST)"},null,null,null,null,null,null,"6."]
[null,null,null,null,null,null,null,null,null,null,null,null,null,null,"Y17",{"$f":"IF(AND(K4=0,L4=0),\"\",IF(K4<L4,I2,I5))","v":"ELA SU YÖNTER (ANK)"},null,null,null,null,null,null,null,null,null,null,null,null,null,null,null,null,null,null,null,null,null,null,null,null,null,null,"Y41",{"$f":"IF(AND(AM56=0,AN56=0),\"\",IF(AM56<AN56,AK51,AK59))","v":"DURU ŞENDOĞAN (RİZ)"}]
[null,null,null,null,null,null,null,"Y15",{"$f":"IF(AND(D44=0,E44=0),\"\",IF(D44<E44,B43,B45))","v":"ÖZLEM KÖSEOĞLU (RİZ)"},null,null,null,null,null,null,null,null,3,2,"YE",null,44,{"$f":"IF(AND(R79=0,S79=0),\"\",IF(R79>S79,P78,P80))","v":"ELA SU YÖNTER (ANK)"},null,null,null,null,null,null,null,null,null,null,null,null,null,null,null,null,null,null,null,null,null,null,1,3,"Y53",null,65,{"$f":"IF(AND(AT79=0,AU79=0),\"\",IF(AT79>AU79,AR78,AR80))","v":"AYTEN CEREN KAHRAMAN (KYS)"},null,null,null,null,null,null,"7."]
[null,null,null,null,null,null,null,null,null,null,2,3,"YE",null,32,{"$f":"IF(AND(K80=0,L80=0),\"\",IF(K80>L80,I79,I81))","v":"ARMİN AYDIN (İST)"},null,null,null,null,null,null,null,null,null,null,null,null,null,null,null,null,null,null,null,null,null,null,null,null,null,null,"Y42",{"$f":"IF(AND(AM72=0,AN72=0),\"\",IF(AM72<AN72,AK67,AK75))","v":"AYTEN CEREN KAHRAMAN (KYS)"}]
[null,null,null,null,null,null,null,"Y16",{"$f":"IF(AND(D47=0,E47=0),\"\",IF(D47<E47,B46,B48))","v":"ARMİN AYDIN (İST)"},null,null,null,null,null,null,null,null,null,null,null,null,null,null,null,null,null,null,null,null,null,null,null,null,null,null,"Y37",{"$f":"IF(AND(AF51=0,AG51=0),\"\",IF(AF51<AG51,AD49,AD53))","v":"ELİZAN BAŞAR (ANK)"},null,null,null,null,null,null,null,null,null,null,null,null,"Y53",{"$f":"IF(AND(AT79=0,AU79=0),\"\",IF(AT79<AU79,AR78,AR80))","v":"DURU ŞENDOĞAN (RİZ)"},null,null,null,null,null,null,"8."]
[null,null,null,null,null,null,null,null,null,null,null,null,null,null,null,null,null,null,null,null,null,null,null,null,null,null,null,null,null,null,null,null,null,null,null,null,null,null,3,2,"Y49",null,59,{"$f":"IF(AND(AM82=0,AN82=0),\"\",IF(AM82>AN82,AK81,AK83))","v":"ELİZAN BAŞAR (ANK)"}]
[null,null,null,null,null,null,null,null,null,null,null,null,null,null,null,null,null,null,null,null,null,null,null,null,null,null,null,null,null,null,null,null,null,null,null,"Y38",{"$f":"IF(AND(AF59=0,AG59=0),\"\",IF(AF59<AG59,AD57,AD61))","v":"EYLÜL ŞEVVAL AYDIN (İST)"},null,null,null,null,null,null,null,null,null,null,null,null,66]
[null,null,null,null,null,null,null,null,null,null,null,null,null,null,null,null,null,null,null,null,null,null,null,null,null,null,null,null,null,null,null,null,null,null,null,"Y39",{"$f":"IF(AND(AF67=0,AG67=0),\"\",IF(AF67<AG67,AD65,AD69))","v":"MASAL ERYILMAZ (İST)"},null,null,null,null,null,null,null,null,0,3,"Y54",null,null,{"$f":"IF(AND(AT84=0,AU84=0),\"\",IF(AT84>AU84,AR82,AR85))","v":"ELVİN KALE (YLV)"},null,null,null,null,null,null,"9."]
[null,null,null,null,null,null,null,null,null,null,null,null,null,null,null,null,null,null,null,null,null,null,null,null,null,null,null,null,null,null,null,null,null,null,null,null,null,null,1,3,"Y50",null,60,{"$f":"IF(AND(AM85=0,AN85=0),\"\",IF(AM85>AN85,AK84,AK86))","v":"ELVİN KALE (YLV)"}]
[null,null,null,null,null,null,null,null,null,null,null,null,null,null,null,null,null,null,null,null,null,null,null,null,null,null,null,null,null,null,null,null,null,null,null,"Y40",{"$f":"IF(AND(AF75=0,AG75=0),\"\",IF(AF75<AG75,AD73,AD77))","v":"ELVİN KALE (YLV)"},null,null,null,null,null,null,null,null,null,null,null,null,"Y54",{"$f":"IF(AND(AT84=0,AU84=0),\"\",IF(AT84<AU84,AR82,AR85))","v":"ELİZAN BAŞAR (ANK)"},null,null,null,null,null,null,"10."]
[null,null,null,null,null,null,null,null,null,null,null,null,null,null,null,null,null,null,null,null,null,null,null,null,null,null,null,null,null,null,null,null,null,null,null,null,null,null,null,null,null,null,"Y49",{"$f":"IF(AND(AM82=0,AN82=0),\"\",IF(AM82<AN82,AK81,AK83))","v":"EYLÜL ŞEVVAL AYDIN (İST)"}]
[null,null,null,null,null,null,null,null,null,null,null,null,null,null,null,null,null,null,null,null,null,null,null,null,null,null,null,null,null,null,null,null,null,null,null,null,null,null,null,null,null,null,null,null,null,1,3,"Y55",null,67,{"$f":"IF(AND(AT88=0,AU88=0),\"\",IF(AT88>AU88,AR87,AR89))","v":"MASAL ERYILMAZ (İST)"},null,null,null,null,null,null,"11."]
[null,null,null,null,null,null,null,null,null,null,null,null,null,null,null,null,null,null,null,null,null,null,null,null,null,null,null,null,"Y33",{"$f":"IF(AND(Z53=0,AA53=0),\"\",IF(Z53<AA53,W51,W55))","v":"CEYLİN AKDANALI (ÇRM)"},null,null,null,null,null,null,null,null,null,null,null,null,"Y50",{"$f":"IF(AND(AM85=0,AN85=0),\"\",IF(AM85<AN85,AK84,AK86))","v":"MASAL ERYILMAZ (İST)"}]
[null,null,null,null,null,null,null,null,null,null,null,null,null,null,null,null,null,null,null,null,null,null,null,null,null,null,null,null,null,null,null,3,0,"Y47",null,55,{"$f":"IF(AND(AF90=0,AG90=0),\"\",IF(AF90>AG90,AD89,AD91))","v":"CEYLİN AKDANALI (ÇRM)"},null,null,null,null,null,null,null,null,null,null,null,null,"Y55",{"$f":"IF(AND(AT88=0,AU88=0),\"\",IF(AT88<AU88,AR87,AR89))","v":"EYLÜL ŞEVVAL AYDIN (İST)"},null,null,null,null,null,null,"12."]
[null,null,null,null,null,null,null,null,null,null,null,null,null,null,null,null,null,null,null,null,null,null,null,null,null,null,null,null,"Y34",{"$f":"IF(AND(Z61=0,AA61=0),\"\",IF(Z61<AA61,W59,W63))","v":"İPEK ERTUNA (ANK)"},null,null,null,null,null,null,null,null,null,null,null,null,61]
[null,null,null,null,null,null,null,null,null,null,null,null,null,null,null,null,null,null,null,null,null,null,null,null,null,null,null,null,"Y35",{"$f":"IF(AND(Z69=0,AA69=0),\"\",IF(Z69<AA69,W67,W71))","v":"IRMAK BÜŞRA UNCU (KST)"},null,null,null,null,null,null,null,null,0,3,"Y51",null,null,{"$f":"IF(AND(AM92=0,AN92=0),\"\",IF(AM92>AN92,AK90,AK93))","v":"ELA SU YÖNTER (ANK)"},null,null,null,null,null,null,"13."]
[null,null,null,null,null,null,null,null,null,null,null,null,null,null,null,null,null,null,null,null,null,null,null,null,null,null,null,null,null,null,null,0,3,"Y48",null,56,{"$f":"IF(AND(AF93=0,AG93=0),\"\",IF(AF93>AG93,AD92,AD94))","v":"ELA SU YÖNTER (ANK)"}]
[null,null,null,null,null,null,null,null,null,null,null,null,null,null,null,null,null,null,null,null,null,null,null,null,null,null,null,null,"Y36",{"$f":"IF(AND(Z77=0,AA77=0),\"\",IF(Z77<AA77,W75,W79))","v":"ELA SU YÖNTER (ANK)"},null,null,null,null,null,null,null,null,null,null,null,null,"Y51",{"$f":"IF(AND(AM92=0,AN92=0),\"\",IF(AM92<AN92,AK90,AK93))","v":"CEYLİN AKDANALI (ÇRM)"},null,null,null,null,null,null,"14."]
[null,null,null,null,null,null,null,null,null,null,null,null,null,null,null,null,null,null,null,null,null,null,null,null,null,null,null,null,null,null,null,null,null,null,null,"Y47",{"$f":"IF(AND(AF90=0,AG90=0),\"\",IF(AF90<AG90,AD89,AD91))","v":"İPEK ERTUNA (ANK)"}]
[null,null,null,null,null,null,null,null,null,null,null,null,null,null,null,null,null,null,null,null,null,null,null,null,null,null,null,null,null,null,null,null,null,null,null,null,null,null,1,3,"Y52",null,62,{"$f":"IF(AND(AM96=0,AN96=0),\"\",IF(AM96>AN96,AK95,AK97))","v":"IRMAK BÜŞRA UNCU (KST)"},null,null,null,null,null,null,"15."]
[null,null,null,null,null,null,null,null,null,null,null,null,null,null,null,null,null,null,null,null,null,null,null,null,null,null,null,null,null,null,null,null,null,null,null,"Y48",{"$f":"IF(AND(AF93=0,AG93=0),\"\",IF(AF93<AG93,AD92,AD94))","v":"IRMAK BÜŞRA UNCU (KST)"}]
[null,null,null,null,null,null,null,null,null,null,null,null,null,null,null,null,null,null,null,null,null,null,null,null,null,null,null,null,null,null,null,null,null,null,null,null,null,null,null,null,null,null,"Y52",{"$f":"IF(AND(AM96=0,AN96=0),\"\",IF(AM96<AN96,AK95,AK97))","v":"İPEK ERTUNA (ANK)"},null,null,null,null,null,null,"16."]

{"sheet":"Ana_Tablo(128_16)","index":5,"n_rows":88,"n_cols":105,"rows_kept":88,"cut":false,"hidden":false,"merged":[[48,36,48,42],[60,36,60,42],[86,29,86,35],[50,57,50,63],[87,36,87,42],[61,43,61,49],[62,50,62,56],[63,43,63,49],[64,50,64,56],[82,29,82,35],[83,36,83,42],[84,29,84,35],[85,36,85,42],[77,36,77,42],[78,29,78,35],[78,43,78,49],[80,36,80,42],[72,29,72,35],[73,36,73,42],[74,29,74,35],[74,43,74,49],[75,36,75,42],[76,43,76,49],[67,36,67,42],[49,22,49,28],[50,29,50,35],[50,43,50,49],[52,36,52,42],[53,22,53,28],[54,29,54,35],[62,29,62,35],[59,50,59,56],[54,50,54,56],[54,15,54,21],[55,22,55,28],[56,15,56,21],[61,22,61,28],[50,15,50,21],[51,22,51,28],[52,15,52,21],[62,15,62,21],[51,64,51,70],[55,57,55,63],[56,36,56,42],[57,22,57,28],[58,29,58,35],[58,43,58,49],[114,64,114,70],[110,8,110,14],[110,22,110,28],[110,36,110,42],[111,15,111,21],[112,8,112,14],[112,29,112,35],[64,15,64,21],[58,15,58,21],[59,22,59,28],[60,15,60,21],[65,36,65,42],[66,43,66,49],[63,22,63,28],[68,29,68,35],[68,43,68,49],[69,36,69,42],[70,29,70,35],[71,43,71,49],[81,22,81,28],[83,22,83,28],[77,22,77,28],[79,22,79,28],[100,29,100,35],[100,43,100,49],[100,57,100,63],[101,15,101,21],[102,8,102,14],[102,22,102,28],[102,36,102,42],[112,57,112,63],[113,15,113,21],[108,71,108,77],[109,15,109,21],[103,15,103,21],[103,50,103,56],[104,8,104,14],[104,29,104,35],[105,15,105,21],[106,8,106,14],[106,22,106,28],[106,43,106,49],[106,64,106,70],[107,15,107,21],[108,8,108,14],[108,29,108,35],[43,8,43,14],[44,1,44,7],[44,15,44,21],[45,1,45,7],[46,8,46,14],[47,1,47,7],[37,64,37,70],[39,1,39,7],[39,15,39,21],[40,8,40,14],[41,1,41,7],[42,1,42,7],[42,29,42,35],[47,50,47,56],[34,8,34,14],[35,1,35,7],[36,1,36,7],[37,8,37,14],[37,50,37,56],[38,1,38,7],[30,1,30,7],[31,8,31,14],[31,29,31,35],[32,1,32,7],[32,15,32,21],[33,1,33,7],[25,8,25,14],[26,1,26,7],[27,1,27,7],[27,15,27,21],[28,8,28,14],[29,1,29,7],[21,1,21,7],[22,8,22,14],[23,1,23,7],[24,1,24,7],[24,57,24,63],[17,1,17,7],[17,29,17,35],[18,1,18,7],[19,8,19,14],[20,1,20,7],[20,15,20,21],[12,50,12,56],[13,8,13,14],[14,1,14,7],[15,1,15,7],[15,15,15,21],[16,8,16,14],[9,1,9,7],[10,8,10,14],[11,1,11,7],[12,1,12,7],[4,8,4,14],[4,24,4,46],[5,1,5,7],[6,1,6,7],[6,29,6,35],[7,8,7,14],[0,1,0,7],[0,24,2,46],[1,8,1,14],[2,1,2,7],[3,1,3,7],[3,15,3,21],[3,24,3,46],[8,1,8,7],[8,15,8,21]]}
[1,{"$f":"IF(Kura!$AW$1=2,Eleme!T5,Eleme!AA7)","v":"NİL BAŞARAN (İST)"},null,null,null,null,null,null,null,null,null,null,null,null,null,null,null,null,null,null,null,null,null,null,{"$f":"Kura!AC1","v":"TÜRKİYE MASA TENİSİ FEDERASYONU\nKÜÇÜKLER FEDERASYON KUPASI"},null,null,null,null,null,null,null,null,null,null,null,null,null,null,null,null,null,null,null,null,null,null,null,null,null,null,null,null,null,null,null,null,null,null,null,null,null,null,null,null,null,null,null,null,null,null,null,null,null,null,null,null,null,null,null,null,null,null,null,null,null,null,null,null,null,null,null,null,null,null,null,null,null,null,null,null,null,null,"1.Tur (1-16)",1]
[null,null,null,0,0,null,null,1,{"$f":"IF(AND(D2=0,E2=0),\"\",IF(D2>E2,B1,B3))","v":""},null,null,null,null,null,null,null,null,null,null,null,null,null,null,null,null,null,null,null,null,null,null,null,null,null,null,null,null,null,null,null,null,null,null,null,null,null,null,null,null,null,null,null,null,null,null,null,null,null,null,null,null,null,null,null,null,null,null,null,null,null,null,null,null,null,null,null,null,null,null,null,null,null,null,null,null,null,null,null,null,null,null,null,null,null,null,null,null,null,null,null,null,null,null,"2.Tur (17-24)"]
[2,{"$f":"IF(Kura!$AW$1=2,Eleme!T8,Eleme!AA13)","v":"ŞEVVAL ALAŞ (BTM)"},null,null,null,null,null,null,null,null,null,null,null,null,17,null,null,null,null,null,null,null,null,null,null,null,null,null,null,null,null,null,null,null,null,null,null,null,null,null,null,null,null,null,null,null,null,null,null,null,null,null,null,null,null,null,null,null,null,null,null,null,null,null,null,null,null,null,null,null,null,null,null,null,null,null,null,null,null,null,null,null,null,null,null,null,null,null,null,null,null,null,null,null,null,null,null,null,null,null,null,null,null,"3.Tur (25-32)"]
[3,{"$f":"IF(Kura!$AW$1=2,Eleme!T11,Eleme!AA19)","v":"ELA SU YÖNTER (ANK)"},null,null,null,null,null,null,null,null,0,0,"Y1",null,null,{"$f":"IF(AND(K4=0,L4=0),\"\",IF(K4>L4,I2,I5))","v":""},null,null,null,null,null,null,null,null,{"$f":"+Kura!AC2","v":"TEK KIZ [15-16 Nisan Amasya]"},null,null,null,null,null,null,null,null,null,null,null,null,null,null,null,null,null,null,null,null,null,null,null,null,null,null,null,null,null,null,null,null,null,null,null,null,null,null,null,null,null,null,null,null,null,null,null,null,null,null,null,null,null,null,null,null,null,null,null,null,null,null,null,null,null,null,null,null,null,null,null,null,null,null,null,null,null,null,"4.Tur (33-38)"]
[null,null,null,0,0,null,null,2,{"$f":"IF(AND(D5=0,E5=0),\"\",IF(D5>E5,B4,B6))","v":""},null,null,null,null,null,null,null,null,null,null,null,null,25,null,null,{"$f":"+Kura!AE3","v":"[ Ana Tablo ]"},null,null,null,null,null,null,null,null,null,null,null,null,null,null,null,null,null,null,null,null,null,null,null,null,null,null,null,null,null,null,null,null,null,null,null,null,null,null,null,null,null,null,null,null,null,null,null,null,null,null,null,null,null,null,null,null,null,null,null,null,null,null,null,null,null,null,null,null,null,null,null,null,null,null,null,null,null,null,"5.Tur (39-46)"]
[4,{"$f":"IF(Kura!$AW$1=2,Eleme!T14,Eleme!AA25)","v":"CEYLİN AKDANALI (ÇRM)"},null,null,null,null,null,null,null,null,null,null,null,null,null,null,null,null,null,null,null,null,null,null,null,null,null,null,null,null,null,null,null,null,null,null,null,null,null,null,null,null,null,null,null,null,null,null,null,null,null,null,null,null,null,null,null,null,null,null,null,null,null,null,null,null,null,null,null,null,null,null,null,null,null,null,null,null,null,null,null,null,null,null,null,null,null,null,null,null,null,null,null,null,null,null,null,null,null,null,null,null,null,"6.Tur (47-51)"]
[5,{"$f":"IF(Kura!$AW$1=2,Eleme!T17,Eleme!AA31)","v":"ELİZAN BAŞAR (ANK)"},null,null,null,null,null,null,null,null,null,null,null,null,null,null,null,0,0,"Y9",null,null,null,null,null,null,null,null,null,{"$f":"IF(AND(R7=0,S7=0),\"\",IF(R7>S7,P4,P9))","v":""},null,null,null,null,null,null,null,null,null,null,null,null,null,null,null,null,null,null,null,null,null,null,null,null,null,null,null,null,null,null,null,null,null,null,null,null,null,null,null,null,null,null,null,null,null,null,null,null,null,null,null,null,null,null,null,null,null,null,null,null,null,null,null,null,null,null,null,null,null,null,null,null,null,"7.Tur (52-53)"]
[null,null,null,0,0,null,null,3,{"$f":"IF(AND(D8=0,E8=0),\"\",IF(D8>E8,B7,B9))","v":""},null,null,null,null,null,null,null,null,null,null,null,null,null,null,null,null,null,null,null,null,null,null,null,null,null,null,39,null,null,null,null,null,null,null,null,null,null,null,null,null,null,null,null,null,null,null,null,null,null,null,null,null,null,null,null,null,null,null,null,null,null,null,null,null,null,null,null,null,null,null,null,null,null,null,null,null,null,null,null,null,null,null,null,null,null,null,null,null,null,null,null,null,null,null,"8.Tur (54-55)"]
[6,{"$f":"IF(Kura!$AW$1=2,Eleme!T20,Eleme!AA37)","v":"NİSA ÜZÜMCÜ (BTM)"},null,null,null,null,null,null,null,null,null,null,null,null,18,{"$f":"IF(AND(K10=0,L10=0),\"\",IF(K10>L10,I8,I11))","v":""},null,null,null,null,null,null,null,null,null,null,null,null,null,null,null,null,null,null,null,null,null,null,null,null,null,null,null,null,null,null,null,null,null,null,null,null,null,null,null,null,null,null,null,null,null,null,null,null,null,null,null,null,null,null,null,null,null,null,null,null,null,null,null,null,null,null,null,null,null,null,null,null,null,null,null,null,null,null,null,null,null,null,null,null,null,null,null,"9.Tur (56)"]
[7,{"$f":"IF(Kura!$AW$1=2,Eleme!T23,Eleme!AA43)","v":"ESİLA SU YALÇIN (SKR)"},null,null,null,null,null,null,null,null,0,0,"Y2"]
[null,null,null,0,0,null,null,4,{"$f":"IF(AND(D11=0,E11=0),\"\",IF(D11>E11,B10,B12))","v":""}]
[8,{"$f":"IF(Kura!$AW$1=2,Eleme!T26,Eleme!AA49)","v":"DURU ŞENDOĞAN (RİZ)"}]
[9,{"$f":"IF(Kura!$AW$1=2,Eleme!T29,Eleme!AA55)","v":"EYLÜL ŞEVVAL AYDIN (İST)"},null,null,null,null,null,null,null,null,null,null,null,null,null,null,null,null,null,null,null,null,null,null,null,null,null,null,null,null,null,0,0,"Y13",null,null,null,null,null,null,null,null,null,null,null,null,null,null,null,null,{"$f":"IF(AND(AF13=0,AG13=0),\"\",IF(AF13>AG13,AD7,AD18))","v":""}]
[null,null,null,0,0,null,null,5,{"$f":"IF(AND(D14=0,E14=0),\"\",IF(D14>E14,B13,B15))","v":""},null,null,null,null,null,null,null,null,null,null,null,null,null,null,null,null,null,null,null,null,null,null,null,null,null,null,null,null,null,null,null,null,null,null,null,null,null,null,null,null,null,null,null,null,null,null,null,54]
[10,{"$f":"IF(Kura!$AW$1=2,Eleme!T32,Eleme!AA61)","v":"ELANUR YILMAZ (BRS)"},null,null,null,null,null,null,null,null,null,null,null,null,19]
[11,{"$f":"IF(Kura!$AW$1=2,Eleme!T35,Eleme!AA67)","v":"DİLAY BALABAN (RİZ)"},null,null,null,null,null,null,null,null,0,0,"Y3",null,null,{"$f":"IF(AND(K16=0,L16=0),\"\",IF(K16>L16,I14,I17))","v":""}]
[null,null,null,0,0,null,null,6,{"$f":"IF(AND(D17=0,E17=0),\"\",IF(D17>E17,B16,B18))","v":""},null,null,null,null,null,null,null,null,null,null,null,null,26]
[12,{"$f":"IF(Kura!$AW$1=2,Eleme!T38,Eleme!AA73)","v":"ZEYNEP NAZ EKER (KRL)"},null,null,null,null,null,null,null,null,null,null,null,null,null,null,null,null,null,null,null,null,null,null,null,null,null,null,null,{"$f":"IF(AND(R19=0,S19=0),\"\",IF(R19>S19,P16,P21))","v":""}]
[13,{"$f":"IF(Kura!$AW$1=2,Eleme!T41,Eleme!AA79)","v":"İPEK ERTUNA (ANK)"},null,null,null,null,null,null,null,null,null,null,null,null,null,null,null,0,0,"Y10"]
[null,null,null,0,0,null,null,7,{"$f":"IF(AND(D20=0,E20=0),\"\",IF(D20>E20,B19,B21))","v":""}]
[14,{"$f":"IF(Kura!$AW$1=2,Eleme!T44,Eleme!AA85)","v":"MASAL ERYILMAZ (İST)"},null,null,null,null,null,null,null,null,null,null,null,null,20,{"$f":"IF(AND(K22=0,L22=0),\"\",IF(K22>L22,I20,I23))","v":""}]
[15,{"$f":"IF(Kura!$AW$1=2,Eleme!T47,Eleme!AA91)","v":"ZEYNEP DURAN (İST)"},null,null,null,null,null,null,null,null,0,0,"Y4"]
[null,null,null,0,0,null,null,8,{"$f":"IF(AND(D23=0,E23=0),\"\",IF(D23>E23,B22,B24))","v":""}]
[16,{"$f":"IF(Kura!$AW$1=2,Eleme!T50,Eleme!AA97)","v":"HATİCE ELİF GÜVELİ (İST)"}]
[17,{"$f":"IF(Kura!$AW$1=2,Eleme!T53,Eleme!AA103)","v":"ELİF ECE AKYÜREK (ADN)"},null,null,null,null,null,null,null,null,null,null,null,null,null,null,null,null,null,null,null,null,null,null,null,null,null,null,null,null,null,null,null,null,null,null,null,null,null,null,null,null,null,null,null,null,null,null,null,null,null,null,0,0,"Y15",null,null,{"$f":"IF(AND(BA25=0,BB25=0),\"\",IF(BA25>BB25,AY13,AY38))","v":""}]
[null,null,null,0,0,null,null,9,{"$f":"IF(AND(D26=0,E26=0),\"\",IF(D26>E26,B25,B27))","v":""},null,null,null,null,null,null,null,null,null,null,null,null,null,null,null,null,null,null,null,null,null,null,null,null,null,null,null,null,null,null,null,null,null,null,null,null,null,null,null,null,null,null,null,null,null,null,null,null,null,null,null,null,null,null,56]
[18,{"$f":"IF(Kura!$AW$1=2,Eleme!T56,Eleme!AA109)","v":"EYLÜL KENANOĞLU (KST)"},null,null,null,null,null,null,null,null,null,null,null,null,21]
[19,{"$f":"IF(Kura!$AW$1=2,Eleme!T59,Eleme!AA115)","v":"ESMA SULTAN SARI (SKR)"},null,null,null,null,null,null,null,null,0,0,"Y5",null,null,{"$f":"IF(AND(K28=0,L28=0),\"\",IF(K28>L28,I26,I29))","v":""}]
[null,null,null,0,0,null,null,10,{"$f":"IF(AND(D29=0,E29=0),\"\",IF(D29>E29,B28,B30))","v":""},null,null,null,null,null,null,null,null,null,null,null,null,27]
[20,{"$f":"IF(Kura!$AW$1=2,Eleme!T62,Eleme!AA121)","v":"ELANUR ALAÇAM (AMS)"}]
[21,{"$f":"IF(Kura!$AW$1=2,Eleme!T65,Eleme!AA127)","v":"AYTEN CEREN KAHRAMAN (KYS)"},null,null,null,null,null,null,null,null,null,null,null,null,null,null,null,0,0,"Y11"]
[null,null,null,0,0,null,null,11,{"$f":"IF(AND(D32=0,E32=0),\"\",IF(D32>E32,B31,B33))","v":""},null,null,null,null,null,null,null,null,null,null,null,null,null,null,null,null,null,null,null,null,{"$f":"IF(AND(R31=0,S31=0),\"\",IF(R31>S31,P28,P33))","v":""}]
[22,{"$f":"IF(Kura!$AW$1=2,Eleme!T68,Eleme!AA133)","v":"IRMAK BÜŞRA UNCU (KST)"},null,null,null,null,null,null,null,null,null,null,null,null,22,{"$f":"IF(AND(K34=0,L34=0),\"\",IF(K34>L34,I32,I35))","v":""},null,null,null,null,null,null,null,null,null,null,null,null,null,null,null,null,null,null,null,40]
[23,{"$f":"IF(Kura!$AW$1=2,Eleme!T71,Eleme!AA139)","v":"NAZLINUR AKGÜN (ANT)"},null,null,null,null,null,null,null,null,0,0,"Y6"]
[null,null,null,0,0,null,null,12,{"$f":"IF(AND(D35=0,E35=0),\"\",IF(D35>E35,B34,B36))","v":""}]
[24,{"$f":"IF(Kura!$AW$1=2,Eleme!T74,Eleme!AA145)","v":"DURU KIRBAÇ (İST)"}]
[25,{"$f":"IF(Kura!$AW$1=2,Eleme!T77,Eleme!AA151)","v":"ZEYNEP ADA ER (ANK)"}]
[null,null,null,0,0,null,null,13,{"$f":"IF(AND(D38=0,E38=0),\"\",IF(D38>E38,B37,B39))","v":""},null,null,null,null,null,null,null,null,null,null,null,null,null,null,null,null,null,null,null,null,null,null,0,0,"Y14",null,null,null,null,null,null,null,null,null,null,null,null,null,null,null,null,{"$f":"IF(AND(AF38=0,AG38=0),\"\",IF(AF38>AG38,AD32,AD43))","v":""},null,null,null,null,null,null,null,null,0,0,"Y16",null,null,{"$f":"IF(AND(BH38=0,BI38=0),\"\",IF(BH38>BI38,BF25,BF51))","v":""},null,null,null,null,null,null,"1."]
[26,{"$f":"IF(Kura!$AW$1=2,Eleme!T80,Eleme!AA157)","v":"ELVİN KALE (YLV)"},null,null,null,null,null,null,null,null,null,null,null,null,23]
[27,{"$f":"IF(Kura!$AW$1=2,Eleme!T83,Eleme!AA163)","v":"DAMLA AVŞAR (VAN)"},null,null,null,null,null,null,null,null,0,0,"Y7",null,null,{"$f":"IF(AND(K40=0,L40=0),\"\",IF(K40>L40,I38,I41))","v":""}]
[null,null,null,0,0,null,null,14,{"$f":"IF(AND(D41=0,E41=0),\"\",IF(D41>E41,B40,B42))","v":""},null,null,null,null,null,null,null,null,null,null,null,null,28]
[28,{"$f":"IF(Kura!$AW$1=2,Eleme!T86,Eleme!AA169)","v":"BUSE KOÇAK (ANK)"}]
[29,{"$f":"IF(Kura!$AW$1=2,Eleme!T89,Eleme!AA175)","v":"ÖZLEM KÖSEOĞLU (RİZ)"},null,null,null,null,null,null,null,null,null,null,null,null,null,null,null,0,0,"Y12",null,null,null,null,null,null,null,null,null,{"$f":"IF(AND(R43=0,S43=0),\"\",IF(R43>S43,P40,P45))","v":""}]
[null,null,null,0,0,null,null,15,{"$f":"IF(AND(D44=0,E44=0),\"\",IF(D44>E44,B43,B45))","v":""}]
[30,{"$f":"IF(Kura!$AW$1=2,Eleme!T92,Eleme!AA181)","v":"ELİF BEYZA AKDEMİR (BTM)"},null,null,null,null,null,null,null,null,null,null,null,null,24,{"$f":"IF(AND(K46=0,L46=0),\"\",IF(K46>L46,I44,I47))","v":""}]
[31,{"$f":"IF(Kura!$AW$1=2,Eleme!T95,Eleme!AA187)","v":"ARMİN AYDIN (İST)"},null,null,null,null,null,null,null,null,0,0,"Y8"]
[null,null,null,0,0,null,null,16,{"$f":"IF(AND(D47=0,E47=0),\"\",IF(D47>E47,B46,B48))","v":""}]
[32,{"$f":"IF(Kura!$AW$1=2,Eleme!T98,Eleme!AA193)","v":"GÜLCE DÖNMEZ (KNY)"},null,null,null,null,null,null,null,null,null,null,null,null,null,null,null,null,null,null,null,null,null,null,null,null,null,null,null,null,null,null,null,null,null,null,null,null,null,null,null,null,null,null,null,null,null,null,null,"Y15",{"$f":"IF(AND(BA25=0,BB25=0),\"\",IF(BA25<BB25,AY13,AY38))","v":""}]
[null,null,null,null,null,null,null,null,null,null,null,null,null,null,null,null,null,null,null,null,null,null,null,null,null,null,null,null,null,null,null,null,null,null,null,"Y13",{"$f":"IF(AND(AF13=0,AG13=0),\"\",IF(AF13<AG13,AD7,AD18))","v":""},null,null,null,null,null,null,null,null,null,null,null,null,null,null,null,null,null,null,null,55]
[null,null,null,null,null,null,null,null,null,null,null,null,null,null,null,null,null,null,null,null,null,"Y12",{"$f":"IF(AND(R43=0,S43=0),\"\",IF(R43<S43,P40,P45))","v":""},null,null,null,null,null,null,null,null,null,null,null,null,null,null,null,null,null,null,null,47]
[null,null,null,null,null,null,null,null,null,null,null,null,null,null,"Y1",{"$f":"IF(AND(K4=0,L4=0),\"\",IF(K4<L4,I2,I5))","v":""},null,null,null,null,null,null,null,null,0,0,"Y21",null,33,{"$f":"IF(AND(Y51=0,Z51=0),\"\",IF(Y51>Z51,W50,W52))","v":""},null,null,null,null,null,null,null,null,0,0,"Y33",null,null,{"$f":"IF(AND(AM51=0,AN51=0),\"\",IF(AM51>AN51,AK49,AK53))","v":""},null,null,null,null,null,null,null,null,null,null,null,null,null,{"$f":"IF(AND(BA52=0,BB52=0),\"\",IF(BA52>BB52,AY48,AY55))","v":""}]
[null,null,null,null,null,null,null,null,null,null,null,null,null,null,null,null,null,0,0,"Y17",null,29,{"$f":"IF(AND(R52=0,S52=0),\"\",IF(R52>S52,P51,P53))","v":""},null,null,null,null,null,null,null,null,null,null,null,null,41,null,null,null,null,null,null,null,null,null,null,null,null,null,52,null,null,0,0,"Y40",null,null,null,null,null,null,null,null,"Y16",{"$f":"IF(AND(BH38=0,BI38=0),\"\",IF(BH38<BI38,BF25,BF51))","v":""},null,null,null,null,null,null,"2."]
[null,null,null,null,null,null,null,null,null,null,null,null,null,null,"Y2",{"$f":"IF(AND(K10=0,L10=0),\"\",IF(K10<L10,I8,I11))","v":""},null,null,null,null,null,null,null,null,null,null,null,null,null,null,null,0,0,"Y27",null,null,{"$f":"IF(AND(AF53=0,AG53=0),\"\",IF(AF53>AG53,AD51,AD55))","v":""}]
[null,null,null,null,null,null,null,null,null,null,null,null,null,null,null,null,null,null,null,null,null,"Y11",{"$f":"IF(AND(R31=0,S31=0),\"\",IF(R31<S31,P28,P33))","v":""}]
[null,null,null,null,null,null,null,null,null,null,null,null,null,null,"Y3",{"$f":"IF(AND(K16=0,L16=0),\"\",IF(K16<L16,I14,I17))","v":""},null,null,null,null,null,null,null,null,0,0,"Y22",null,34,{"$f":"IF(AND(Y55=0,Z55=0),\"\",IF(Y55>Z55,W54,W56))","v":""},null,null,null,null,null,null,null,null,null,null,null,null,null,null,null,0,0,"Y38",null,null,{"$f":"IF(AND(AT55=0,AU55=0),\"\",IF(AT55>AU55,AR51,AR59))","v":""}]
[null,null,null,null,null,null,null,null,null,null,null,null,null,null,null,null,null,0,0,"Y18",null,30,{"$f":"IF(AND(R56=0,S56=0),\"\",IF(R56>S56,P55,P57))","v":""},null,null,null,null,null,null,null,null,null,null,null,null,null,null,null,null,null,null,null,null,null,null,null,null,null,null,null,null,null,null,null,null,null,"Y40",{"$f":"IF(AND(BA52=0,BB52=0),\"\",IF(BA52<BB52,AY48,AY55))","v":""},null,null,null,null,null,null,"3."]
[null,null,null,null,null,null,null,null,null,null,null,null,null,null,"Y4",{"$f":"IF(AND(K22=0,L22=0),\"\",IF(K22<L22,I20,I23))","v":""},null,null,null,null,null,null,null,null,null,null,null,null,null,null,null,null,null,null,null,"Y14",{"$f":"IF(AND(AF38=0,AG38=0),\"\",IF(AF38<AG38,AD32,AD43))","v":""}]
[null,null,null,null,null,null,null,null,null,null,null,null,null,null,null,null,null,null,null,null,null,"Y10",{"$f":"IF(AND(R19=0,S19=0),\"\",IF(R19<S19,P16,P21))","v":""},null,null,null,null,null,null,null,null,null,null,null,null,null,null,null,null,null,null,null,48]
[null,null,null,null,null,null,null,null,null,null,null,null,null,null,"Y5",{"$f":"IF(AND(K28=0,L28=0),\"\",IF(K28<L28,I26,I29))","v":""},null,null,null,null,null,null,null,null,0,0,"Y23",null,35,{"$f":"IF(AND(Y59=0,Z59=0),\"\",IF(Y59>Z59,W58,W60))","v":""},null,null,null,null,null,null,null,null,0,0,"Y34",null,null,{"$f":"IF(AND(AM59=0,AN59=0),\"\",IF(AM59>AN59,AK57,AK61))","v":""}]
[null,null,null,null,null,null,null,null,null,null,null,null,null,null,null,null,null,0,0,"Y19",null,31,{"$f":"IF(AND(R60=0,S60=0),\"\",IF(R60>S60,P59,P61))","v":""},null,null,null,null,null,null,null,null,null,null,null,null,42,null,null,null,null,null,null,null,null,null,null,null,null,null,"Y38",{"$f":"IF(AND(AT55=0,AU55=0),\"\",IF(AT55<AU55,AR51,AR59))","v":""},null,null,null,null,null,null,"4."]
[null,null,null,null,null,null,null,null,null,null,null,null,null,null,"Y6",{"$f":"IF(AND(K34=0,L34=0),\"\",IF(K34<L34,I32,I35))","v":""},null,null,null,null,null,null,null,null,null,null,null,null,null,null,null,0,0,"Y28",null,null,{"$f":"IF(AND(AF61=0,AG61=0),\"\",IF(AF61>AG61,AD59,AD63))","v":""}]
[null,null,null,null,null,null,null,null,null,null,null,null,null,null,null,null,null,null,null,null,null,"Y9",{"$f":"IF(AND(R7=0,S7=0),\"\",IF(R7<S7,P4,P9))","v":""},null,null,null,null,null,null,null,null,null,null,null,null,null,null,null,null,null,null,null,"Y33",{"$f":"IF(AND(AM51=0,AN51=0),\"\",IF(AM51<AN51,AK49,AK53))","v":""}]
[null,null,null,null,null,null,null,null,null,null,null,null,null,null,"Y7",{"$f":"IF(AND(K40=0,L40=0),\"\",IF(K40<L40,I38,I41))","v":""},null,null,null,null,null,null,null,null,0,0,"Y24",null,36,{"$f":"IF(AND(Y63=0,Z63=0),\"\",IF(Y63>Z63,W62,W64))","v":""},null,null,null,null,null,null,null,null,null,null,null,null,null,null,null,0,0,"Y39",null,53,{"$f":"IF(AND(AT63=0,AU63=0),\"\",IF(AT63>AU63,AR62,AR64))","v":""},null,null,null,null,null,null,"5."]
[null,null,null,null,null,null,null,null,null,null,null,null,null,null,null,null,null,0,0,"Y20",null,32,{"$f":"IF(AND(R64=0,S64=0),\"\",IF(R64>S64,P63,P65))","v":""},null,null,null,null,null,null,null,null,null,null,null,null,null,null,null,null,null,null,null,"Y34",{"$f":"IF(AND(AM59=0,AN59=0),\"\",IF(AM59<AN59,AK57,AK61))","v":""}]
[null,null,null,null,null,null,null,null,null,null,null,null,null,null,"Y8",{"$f":"IF(AND(K46=0,L46=0),\"\",IF(K46<L46,I44,I47))","v":""},null,null,null,null,null,null,null,null,null,null,null,null,null,null,null,null,null,null,null,null,null,null,null,null,null,null,null,null,null,null,null,null,null,"Y39",{"$f":"IF(AND(AT63=0,AU63=0),\"\",IF(AT63<AU63,AR62,AR64))","v":""},null,null,null,null,null,null,"6."]
[null,null,null,null,null,null,null,null,null,null,null,null,null,null,null,null,null,null,null,null,null,null,null,null,null,null,null,null,null,null,null,null,null,null,null,"Y27",{"$f":"IF(AND(AF53=0,AG53=0),\"\",IF(AF53<AG53,AD51,AD55))","v":""}]
[null,null,null,null,null,null,null,null,null,null,null,null,null,null,null,null,null,null,null,null,null,null,null,null,null,null,null,null,null,null,null,null,null,null,null,null,null,null,0,0,"Y35",null,49,{"$f":"IF(AND(AM67=0,AN67=0),\"\",IF(AM67>AN67,AK66,AK68))","v":""},null,null,null,null,null,null,"7."]
[null,null,null,null,null,null,null,null,null,null,null,null,null,null,null,null,null,null,null,null,null,null,null,null,null,null,null,null,null,null,null,null,null,null,null,"Y28",{"$f":"IF(AND(AF61=0,AG61=0),\"\",IF(AF61<AG61,AD59,AD63))","v":""}]
[null,null,null,null,null,null,null,null,null,null,null,null,null,null,null,null,null,null,null,null,null,null,null,null,null,null,null,null,"Y21",{"$f":"IF(AND(Y51=0,Z51=0),\"\",IF(Y51<Z51,W50,W52))","v":""},null,null,null,null,null,null,null,null,null,null,null,null,"Y35",{"$f":"IF(AND(AM67=0,AN67=0),\"\",IF(AM67<AN67,AK66,AK68))","v":""},null,null,null,null,null,null,"8."]
[null,null,null,null,null,null,null,null,null,null,null,null,null,null,null,null,null,null,null,null,null,null,null,null,null,null,null,null,null,null,null,0,0,"Y29",null,43,{"$f":"IF(AND(AF70=0,AG70=0),\"\",IF(AF70>AG70,AD69,AD71))","v":""}]
[null,null,null,null,null,null,null,null,null,null,null,null,null,null,null,null,null,null,null,null,null,null,null,null,null,null,null,null,"Y22",{"$f":"IF(AND(Y55=0,Z55=0),\"\",IF(Y55<Z55,W54,W56))","v":""},null,null,null,null,null,null,null,null,null,null,null,null,50]
[null,null,null,null,null,null,null,null,null,null,null,null,null,null,null,null,null,null,null,null,null,null,null,null,null,null,null,null,null,null,null,null,null,null,null,null,null,null,0,0,"Y36",null,null,{"$f":"IF(AND(AM72=0,AN72=0),\"\",IF(AM72>AN72,AK70,AK74))","v":""},null,null,null,null,null,null,"9."]
[null,null,null,null,null,null,null,null,null,null,null,null,null,null,null,null,null,null,null,null,null,null,null,null,null,null,null,null,"Y23",{"$f":"IF(AND(Y59=0,Z59=0),\"\",IF(Y59<Z59,W58,W60))","v":""}]
[null,null,null,null,null,null,null,null,null,null,null,null,null,null,null,null,null,null,null,null,null,null,null,null,null,null,null,null,null,null,null,0,0,"Y30",null,44,{"$f":"IF(AND(AF74=0,AG74=0),\"\",IF(AF74>AG74,AD73,AD75))","v":""}]
[null,null,null,null,null,null,null,null,null,null,null,null,null,null,null,null,null,null,null,null,null,null,null,null,null,null,null,null,"Y24",{"$f":"IF(AND(Y63=0,Z63=0),\"\",IF(Y63<Z63,W62,W64))","v":""},null,null,null,null,null,null,null,null,null,null,null,null,"Y36",{"$f":"IF(AND(AM72=0,AN72=0),\"\",IF(AM72<AN72,AK70,AK74))","v":""},null,null,null,null,null,null,"10."]
[null,null,null,null,null,null,null,null,null,null,null,null,null,null,null,null,null,null,null,null,null,null,null,null,null,null,null,null,null,null,null,null,null,null,null,"Y29",{"$f":"IF(AND(AF70=0,AG70=0),\"\",IF(AF70<AG70,AD69,AD71))","v":""}]
[null,null,null,null,null,null,null,null,null,null,null,null,null,null,null,null,null,null,null,null,null,null,null,null,null,null,null,null,null,null,null,null,null,null,null,null,null,null,0,0,"Y37",null,51,{"$f":"IF(AND(AM77=0,AN77=0),\"\",IF(AM77>AN77,AK76,AK78))","v":""},null,null,null,null,null,null,"11."]
[null,null,null,null,null,null,null,null,null,null,null,null,null,null,null,null,null,null,null,null,null,"Y17",{"$f":"IF(AND(R52=0,S52=0),\"\",IF(R52<S52,P51,P53))","v":""},null,null,null,null,null,null,null,null,null,null,null,null,"Y30",{"$f":"IF(AND(AF74=0,AG74=0),\"\",IF(AF74<AG74,AD73,AD75))","v":""}]
[null,null,null,null,null,null,null,null,null,null,null,null,null,null,null,null,null,null,null,null,null,null,null,null,0,0,"Y25",null,37,{"$f":"IF(AND(Y79=0,Z79=0),\"\",IF(Y79>Z79,W78,W80))","v":""},null,null,null,null,null,null,null,null,null,null,null,null,"Y37",{"$f":"IF(AND(AM77=0,AN77=0),\"\",IF(AM77<AN77,AK76,AK78))","v":""},null,null,null,null,null,null,"12."]
[null,null,null,null,null,null,null,null,null,null,null,null,null,null,null,null,null,null,null,null,null,"Y18",{"$f":"IF(AND(R56=0,S56=0),\"\",IF(R56<S56,P55,P57))","v":""},null,null,null,null,null,null,null,null,null,null,null,null,45]
[null,null,null,null,null,null,null,null,null,null,null,null,null,null,null,null,null,null,null,null,null,null,null,null,null,null,null,null,null,null,null,0,0,"Y31",null,null,{"$f":"IF(AND(AF81=0,AG81=0),\"\",IF(AF81>AG81,AD79,AD83))","v":""},null,null,null,null,null,null,"13."]
[null,null,null,null,null,null,null,null,null,null,null,null,null,null,null,null,null,null,null,null,null,"Y19",{"$f":"IF(AND(R60=0,S60=0),\"\",IF(R60<S60,P59,P61))","v":""}]
[null,null,null,null,null,null,null,null,null,null,null,null,null,null,null,null,null,null,null,null,null,null,null,null,0,0,"Y26",null,38,{"$f":"IF(AND(Y83=0,Z83=0),\"\",IF(Y83>Z83,W82,W84))","v":""}]
[null,null,null,null,null,null,null,null,null,null,null,null,null,null,null,null,null,null,null,null,null,"Y20",{"$f":"IF(AND(R64=0,S64=0),\"\",IF(R64<S64,P63,P65))","v":""},null,null,null,null,null,null,null,null,null,null,null,null,"Y31",{"$f":"IF(AND(AF81=0,AG81=0),\"\",IF(AF81<AG81,AD79,AD83))","v":""},null,null,null,null,null,null,"14."]
[null,null,null,null,null,null,null,null,null,null,null,null,null,null,null,null,null,null,null,null,null,null,null,null,null,null,null,null,"Y25",{"$f":"IF(AND(Y79=0,Z79=0),\"\",IF(Y79<Z79,W78,W80))","v":""}]
[null,null,null,null,null,null,null,null,null,null,null,null,null,null,null,null,null,null,null,null,null,null,null,null,null,null,null,null,null,null,null,0,0,"Y32",null,46,{"$f":"IF(AND(AF86=0,AG86=0),\"\",IF(AF86>AG86,AD85,AD87))","v":""},null,null,null,null,null,null,"15."]
[null,null,null,null,null,null,null,null,null,null,null,null,null,null,null,null,null,null,null,null,null,null,null,null,null,null,null,null,"Y26",{"$f":"IF(AND(Y83=0,Z83=0),\"\",IF(Y83<Z83,W82,W84))","v":""}]
[null,null,null,null,null,null,null,null,null,null,null,null,null,null,null,null,null,null,null,null,null,null,null,null,null,null,null,null,null,null,null,null,null,null,null,"Y32",{"$f":"IF(AND(AF86=0,AG86=0),\"\",IF(AF86<AG86,AD85,AD87))","v":""},null,null,null,null,null,null,"16."]

{"sheet":"Ana_Tablo","index":6,"n_rows":63,"n_cols":105,"rows_kept":63,"cut":false,"hidden":false,"merged":[[59,22,59,28],[60,29,60,35],[61,22,61,28],[62,29,62,35],[54,15,54,21],[55,29,55,35],[56,15,56,21],[57,22,57,28],[58,15,58,21],[58,29,58,35],[50,29,50,35],[51,36,51,42],[52,15,52,21],[52,29,52,35],[53,22,53,28],[53,36,53,42],[37,43,37,49],[49,22,49,28],[49,36,49,42],[39,8,39,14],[39,43,39,49],[40,29,40,35],[41,36,41,42],[42,29,42,35],[43,22,43,28],[43,36,43,42],[44,29,44,35],[45,22,45,28],[46,36,46,42],[47,22,47,28],[48,29,48,35],[38,15,38,21],[38,36,38,42],[33,8,33,14],[33,22,33,28],[33,36,33,42],[34,15,34,21],[36,15,36,21],[36,36,36,42],[37,8,37,14],[37,22,37,28],[34,43,34,49],[35,8,35,14],[35,29,35,35],[29,43,29,49],[30,15,30,21],[30,50,30,55],[31,8,31,14],[31,29,31,35],[32,15,32,21],[26,15,26,21],[27,8,27,14],[27,29,27,35],[28,15,28,21],[29,8,29,14],[29,22,29,28],[25,57,25,63],[20,1,20,7],[20,15,20,21],[21,1,21,7],[22,8,22,14],[23,1,23,7],[23,29,23,35],[24,15,24,21],[24,50,24,56],[25,8,25,14],[25,22,25,28],[25,36,25,42],[17,1,17,7],[18,1,18,7],[18,22,18,28],[18,57,18,63],[19,8,19,14],[19,43,19,49],[17,22,17,28],[12,50,12,56],[13,8,13,14],[14,1,14,7],[15,1,15,7],[15,15,15,21],[16,8,16,14],[8,1,8,7],[8,15,8,21],[9,1,9,7],[10,8,10,14],[11,1,11,7],[12,1,12,7],[7,8,7,14],[0,1,0,7],[0,24,2,46],[1,8,1,14],[2,1,2,7],[3,1,3,7],[3,15,3,21],[3,24,3,46],[4,8,4,14],[4,24,4,46],[5,1,5,7],[6,1,6,7],[6,22,6,28]]}
[1,{"$f":"IF(Kura!$AW$1=1,Eleme!AO10,IF(Kura!$AW$1=2,Eleme!AA7,IF(Kura!$AW$1=3,Eleme!M5,IF(Kura!$AW$1=4,Eleme!M5,IF(Kura!$AW$1=5,Eleme!M5)))))","v":false},null,null,null,null,null,null,null,null,null,null,null,null,null,null,null,null,null,null,null,null,null,null,{"$f":"Kura!AC1","v":"TÜRKİYE MASA TENİSİ FEDERASYONU\nKÜÇÜKLER FEDERASYON KUPASI"},null,null,null,null,null,null,null,null,null,null,null,null,null,null,null,null,null,null,null,null,null,null,null,null,null,null,null,null,null,null,null,null,null,null,null,null,null,null,null,null,null,null,null,null,null,null,null,null,null,null,null,null,null,null,null,null,null,null,null,null,null,null,null,null,null,null,null,null,null,null,null,null,null,null,null,null,null,null,"1.Tur (1-8)",1]
[null,null,null,0,0,"Y1",null,1,{"$f":"IF(AND(D2=0,E2=0),\"\",IF(D2>E2,B1,B3))","v":""},null,null,null,null,null,null,null,null,null,null,null,null,null,null,null,null,null,null,null,null,null,null,null,null,null,null,null,null,null,null,null,null,null,null,null,null,null,null,null,null,null,null,null,null,null,null,null,null,null,null,null,null,null,null,null,null,null,null,null,null,null,null,null,null,null,null,null,null,null,null,null,null,null,null,null,null,null,null,null,null,null,null,null,null,null,null,null,null,null,null,null,null,null,null,"2.Tur (9-16)"]
[2,{"$f":"IF(Kura!AW1=1,Eleme!AO22,IF(Kura!AW1=2,Eleme!AA13,IF(Kura!AW1=3,Eleme!M8,IF(Kura!AW1=4,Eleme!M8,IF(Kura!AW1=5,Eleme!M8)))))","v":false},null,null,null,null,null,null,null,null,null,null,null,null,9,null,null,null,null,null,null,null,null,null,null,null,null,null,null,null,null,null,null,null,null,null,null,null,null,null,null,null,null,null,null,null,null,null,null,null,null,null,null,null,null,null,null,null,null,null,null,null,null,null,null,null,null,null,null,null,null,null,null,null,null,null,null,null,null,null,null,null,null,null,null,null,null,null,null,null,null,null,null,null,null,null,null,null,null,null,null,null,null,"3.Tur (17-24)"]
[3,{"$f":"IF(Kura!$AW$1=1,Eleme!AO34,IF(Kura!$AW$1=2,Eleme!AA19,IF(Kura!$AW$1=3,Eleme!M11,IF(Kura!$AW$1=4,Eleme!M11,IF(Kura!$AW$1=5,Eleme!M11)))))","v":false},null,null,null,null,null,null,null,null,0,0,"Y17",null,null,{"$f":"IF(AND(K4=0,L4=0),\"\",IF(K4>L4,I2,I5))","v":""},null,null,null,null,null,null,null,null,{"$f":"+Kura!AC2","v":"TEK KIZ [15-16 Nisan Amasya]"},null,null,null,null,null,null,null,null,null,null,null,null,null,null,null,null,null,null,null,null,null,null,null,null,null,null,null,null,null,null,null,null,null,null,null,null,null,null,null,null,null,null,null,null,null,null,null,null,null,null,null,null,null,null,null,null,null,null,null,null,null,null,null,null,null,null,null,null,null,null,null,null,null,null,null,null,null,null,"4.Tur (25-31)"]
[null,null,null,0,0,"Y2",null,2,{"$f":"IF(AND(D5=0,E5=0),\"\",IF(D5>E5,B4,B6))","v":""},null,null,null,null,null,null,null,null,null,null,null,null,17,null,null,{"$f":"+Kura!AE3","v":"[ Ana Tablo ]"},null,null,null,null,null,null,null,null,null,null,null,null,null,null,null,null,null,null,null,null,null,null,null,null,null,null,null,null,null,null,null,null,null,null,null,null,null,null,null,null,null,null,null,null,null,null,null,null,null,null,null,null,null,null,null,null,null,null,null,null,null,null,null,null,null,null,null,null,null,null,null,null,null,null,null,null,null,null,"5.Tur (32-36)"]
[4,{"$f":"IF(Kura!$AW$1=1,Eleme!AO46,IF(Kura!$AW$1=2,Eleme!AA25,IF(Kura!$AW$1=3,Eleme!M14,IF(Kura!$AW$1=4,Eleme!M14,IF(Kura!$AW$1=5,Eleme!M14)))))","v":false},null,null,null,null,null,null,null,null,null,null,null,null,null,null,null,null,null,null,null,null,null,null,null,null,null,null,null,null,null,null,null,null,null,null,null,null,null,null,null,null,null,null,null,null,null,null,null,null,null,null,null,null,null,null,null,null,null,null,null,null,null,null,null,null,null,null,null,null,null,null,null,null,null,null,null,null,null,null,null,null,null,null,null,null,null,null,null,null,null,null,null,null,null,null,null,null,null,null,null,null,null,"6.Tur (37-38)"]
[5,{"$f":"IF(Kura!$AW$1=1,Eleme!AO58,IF(Kura!$AW$1=2,Eleme!AA31,IF(Kura!$AW$1=3,Eleme!M17,IF(Kura!$AW$1=4,Eleme!M17,IF(Kura!$AW$1=5,Eleme!M17)))))","v":false},null,null,null,null,null,null,null,null,null,null,null,null,null,null,null,0,0,"Y25",null,null,{"$f":"IF(AND(R7=0,S7=0),\"\",IF(R7>S7,P4,P9))","v":""},null,null,null,null,null,null,null,null,null,null,null,null,null,null,null,null,null,null,null,null,null,null,null,null,null,null,null,null,null,null,null,null,null,null,null,null,null,null,null,null,null,null,null,null,null,null,null,null,null,null,null,null,null,null,null,null,null,null,null,null,null,null,null,null,null,null,null,null,null,null,null,null,null,null,null,null,null,null,null,null,"7.Tur (39)"]
[null,null,null,0,0,"Y3",null,3,{"$f":"IF(AND(D8=0,E8=0),\"\",IF(D8>E8,B7,B9))","v":""},null,null,null,null,null,null,null,null,null,null,null,null,null,null,null,null,null,null,null,25,null,null,null,null,null,null,null,null,null,null,null,null,null,null,null,null,null,null,null,null,null,null,null,null,null,null,null,null,null,null,null,null,null,null,null,null,null,null,null,null,null,null,null,null,null,null,null,null,null,null,null,null,null,null,null,null,null,null,null,null,null,null,null,null,null,null,null,null,null,null,null,null,null,null,"8.Tur (40)"]
[6,{"$f":"IF(Kura!$AW$1=1,Eleme!AO70,IF(Kura!$AW$1=2,Eleme!AA37,IF(Kura!$AW$1=3,Eleme!M20,IF(Kura!$AW$1=4,Eleme!M20,IF(Kura!$AW$1=5,Eleme!M20)))))","v":false},null,null,null,null,null,null,null,null,null,null,null,null,10,{"$f":"IF(AND(K10=0,L10=0),\"\",IF(K10>L10,I8,I11))","v":""}]
[7,{"$f":"IF(Kura!$AW$1=1,Eleme!AO82,IF(Kura!$AW$1=2,Eleme!AA43,IF(Kura!$AW$1=3,Eleme!M23,IF(Kura!$AW$1=4,Eleme!M23,IF(Kura!$AW$1=5,Eleme!M23)))))","v":false},null,null,null,null,null,null,null,null,0,0,"Y18"]
[null,null,null,0,0,"Y4",null,4,{"$f":"IF(AND(D11=0,E11=0),\"\",IF(D11>E11,B10,B12))","v":""}]
[8,{"$f":"IF(Kura!$AW$1=1,Eleme!AO94,IF(Kura!$AW$1=2,Eleme!AA49,IF(Kura!$AW$1=3,Eleme!M26,IF(Kura!$AW$1=4,Eleme!M26,IF(Kura!$AW$1=5,Eleme!M26)))))","v":false}]
[9,{"$f":"IF(Kura!$AW$1=1,Eleme!AO106,IF(Kura!$AW$1=2,Eleme!AA55,IF(Kura!$AW$1=3,Eleme!M29,IF(Kura!$AW$1=4,Eleme!M29,IF(Kura!$AW$1=5,Eleme!M29)))))","v":false},null,null,null,null,null,null,null,null,null,null,null,null,null,null,null,null,null,null,null,null,null,null,0,0,"Y33",null,null,null,null,null,null,null,null,null,null,null,null,null,null,null,null,null,null,null,null,null,null,null,{"$f":"IF(AND(Y13=0,Z13=0),\"\",IF(Y13>Z13,W7,W18))","v":""}]
[null,null,null,0,0,"Y5",null,5,{"$f":"IF(AND(D14=0,E14=0),\"\",IF(D14>E14,B13,B15))","v":""},null,null,null,null,null,null,null,null,null,null,null,null,null,null,null,null,null,null,null,null,null,null,null,null,null,null,null,null,null,null,null,null,null,null,null,null,null,null,null,null,null,null,null,null,null,null,null,40]
[10,{"$f":"IF(Kura!$AW$1=1,Eleme!AO118,IF(Kura!$AW$1=2,Eleme!AA61,IF(Kura!$AW$1=3,Eleme!M32,IF(Kura!$AW$1=4,Eleme!M32,IF(Kura!$AW$1=5,Eleme!M32)))))","v":false},null,null,null,null,null,null,null,null,null,null,null,null,11]
[11,{"$f":"IF(Kura!$AW$1=1,Eleme!AO130,IF(Kura!$AW$1=2,Eleme!AA67,IF(Kura!$AW$1=3,Eleme!M35,IF(Kura!$AW$1=4,Eleme!M35,IF(Kura!$AW$1=5,Eleme!M35)))))","v":false},null,null,null,null,null,null,null,null,0,0,"Y19",null,null,{"$f":"IF(AND(K16=0,L16=0),\"\",IF(K16>L16,I14,I17))","v":""}]
[null,null,null,0,0,"Y6",null,6,{"$f":"IF(AND(D17=0,E17=0),\"\",IF(D17>E17,B16,B18))","v":""},null,null,null,null,null,null,null,null,null,null,null,null,18]
[12,{"$f":"IF(Kura!$AW$1=1,Eleme!AO142,IF(Kura!$AW$1=2,Eleme!AA73,IF(Kura!$AW$1=3,Eleme!M38,IF(Kura!$AW$1=4,Eleme!M38,IF(Kura!$AW$1=5,Eleme!M38)))))","v":false},null,null,null,null,null,null,null,null,null,null,null,null,null,null,null,null,null,null,null,null,{"$f":"IF(AND(R19=0,S19=0),\"\",IF(R19>S19,P16,P21))","v":""}]
[13,{"$f":"IF(Kura!$AW$1=1,Eleme!AO154,IF(Kura!$AW$1=2,Eleme!AA79,IF(Kura!$AW$1=3,Eleme!M41,IF(Kura!$AW$1=4,Eleme!M41,IF(Kura!$AW$1=5,Eleme!M41)))))","v":false},null,null,null,null,null,null,null,null,null,null,null,null,null,null,null,0,0,"Y26",null,null,null,null,null,null,null,null,null,null,null,null,null,null,null,null,null,null,null,null,null,null,null,null,null,null,null,null,null,null,null,null,0,0,"Y48",null,null,{"$f":"IF(AND(BA19=0,BB19=0),\"\",IF(BA19>BB19,AY13,AY25))","v":""},null,null,null,null,null,null,"1."]
[null,null,null,0,0,"Y7",null,7,{"$f":"IF(AND(D20=0,E20=0),\"\",IF(D20>E20,B19,B21))","v":""},null,null,null,null,null,null,null,null,null,null,null,null,null,null,null,null,null,null,null,null,null,null,null,null,null,null,null,null,null,null,null,null,null,"Y33",{"$f":"IF(AND(Y13=0,Z13=0),\"\",IF(Y13<Z13,W7,W18))","v":""}]
[14,{"$f":"IF(Kura!$AW$1=1,Eleme!AO166,IF(Kura!$AW$1=2,Eleme!AA85,IF(Kura!$AW$1=3,Eleme!M44,IF(Kura!$AW$1=4,Eleme!M44,IF(Kura!$AW$1=5,Eleme!M44)))))","v":false},null,null,null,null,null,null,null,null,null,null,null,null,12,{"$f":"IF(AND(K22=0,L22=0),\"\",IF(K22>L22,I20,I23))","v":""},null,null,null,null,null,null,null,null,null,null,null,null,null,null,null,null,null,null,null,null,null,null,null,null,null,null,null,null,null,null,null,null,null,39]
[15,{"$f":"IF(Kura!$AW$1=1,Eleme!AO178,IF(Kura!$AW$1=2,Eleme!AA91,IF(Kura!$AW$1=3,Eleme!M47,IF(Kura!$AW$1=4,Eleme!M47,IF(Kura!$AW$1=5,Eleme!M47)))))","v":false},null,null,null,null,null,null,null,null,0,0,"Y20"]
[null,null,null,0,0,"Y8",null,8,{"$f":"IF(AND(D23=0,E23=0),\"\",IF(D23>E23,B22,B24))","v":""}]
[16,{"$f":"IF(Kura!$AW$1=1,Eleme!AO190,IF(Kura!$AW$1=2,Eleme!AA97,IF(Kura!$AW$1=3,Eleme!M50,IF(Kura!$AW$1=4,Eleme!M50,IF(Kura!$AW$1=5,Eleme!M50)))))","v":false},null,null,null,null,null,null,null,null,null,null,null,null,null,null,null,null,null,null,null,null,null,null,null,null,null,null,"Y25",{"$f":"IF(AND(R7=0,S7=0),\"\",IF(R7<S7,P4,P9))","v":""}]
[null,null,null,null,null,null,null,null,null,null,null,null,null,null,"Y20",{"$f":"IF(AND(K22=0,L22=0),\"\",IF(K22<L22,I20,I23))","v":""},null,null,null,null,null,null,null,null,null,null,null,null,null,null,null,null,null,null,null,32,null,null,null,null,null,null,null,null,null,0,0,"Y47",null,null,{"$f":"IF(AND(AT25=0,AU25=0),\"\",IF(AT25>AU25,AR20,AR30))","v":""}]
[null,null,null,null,null,null,null,"Y1",{"$f":"IF(AND(D2=0,E2=0),\"\",IF(D2<E2,B1,B3))","v":""},null,null,null,null,null,null,null,null,0,0,"Y27",null,19,{"$f":"IF(AND(R26=0,S26=0),\"\",IF(R26>S26,P25,P27))","v":""},null,null,null,null,null,null,null,null,0,0,"Y40",null,null,{"$f":"IF(AND(AF26=0,AG26=0),\"\",IF(AF26>AG26,AD24,AD28))","v":""},null,null,null,null,null,null,null,null,null,null,null,null,null,null,null,null,null,null,null,"Y48",{"$f":"IF(AND(BA19=0,BB19=0),\"\",IF(BA19<BB19,AY13,AY25))","v":""},null,null,null,null,null,null,"2."]
[null,null,null,null,null,null,null,null,null,null,0,0,"Y21",null,13,{"$f":"IF(AND(K27=0,L27=0),\"\",IF(K27>L27,I26,I28))","v":""},null,null,null,null,null,null,null,null,null,null,null,null,26,null,null,null,null,null,null,null,null,null,null,null,null,null,37]
[null,null,null,null,null,null,null,"Y2",{"$f":"IF(AND(D5=0,E5=0),\"\",IF(D5<E5,B4,B6))","v":""},null,null,null,null,null,null,null,null,null,null,null,null,null,null,null,0,0,"Y34",null,null,{"$f":"IF(AND(Y28=0,Z28=0),\"\",IF(Y28>Z28,W26,W30))","v":""}]
[null,null,null,null,null,null,null,null,null,null,null,null,null,null,"Y19",{"$f":"IF(AND(K16=0,L16=0),\"\",IF(K16<L16,I14,I17))","v":""}]
[null,null,null,null,null,null,null,"Y3",{"$f":"IF(AND(D8=0,E8=0),\"\",IF(D8<E8,B7,B9))","v":""},null,null,null,null,null,null,null,null,0,0,"Y28",null,20,{"$f":"IF(AND(R30=0,S30=0),\"\",IF(R30>S30,P29,P31))","v":""},null,null,null,null,null,null,null,null,null,null,null,null,null,null,null,0,0,"Y45",null,null,{"$f":"IF(AND(AM30=0,AN30=0),\"\",IF(AM30>AN30,AK26,AK34))","v":""}]
[null,null,null,null,null,null,null,null,null,null,0,0,"Y22",null,14,{"$f":"IF(AND(K31=0,L31=0),\"\",IF(K31>L31,I30,I32))","v":""},null,null,null,null,null,null,null,null,null,null,null,null,null,null,null,null,null,null,null,null,null,null,null,null,null,null,null,null,null,null,null,null,null,"Y47",{"$f":"IF(AND(AT25=0,AU25=0),\"\",IF(AT25<AU25,AR20,AR30))","v":""},null,null,null,null,null,"3."]
[null,null,null,null,null,null,null,"Y4",{"$f":"IF(AND(D11=0,E11=0),\"\",IF(D11<E11,B10,B12))","v":""},null,null,null,null,null,null,null,null,null,null,null,null,null,null,null,null,null,null,null,"Y26",{"$f":"IF(AND(R19=0,S19=0),\"\",IF(R19<S19,P16,P21))","v":""}]
[null,null,null,null,null,null,null,null,null,null,null,null,null,null,"Y18",{"$f":"IF(AND(K10=0,L10=0),\"\",IF(K10<L10,I8,I11))","v":""},null,null,null,null,null,null,null,null,null,null,null,null,null,null,null,null,null,null,null,33]
[null,null,null,null,null,null,null,"Y5",{"$f":"IF(AND(D14=0,E14=0),\"\",IF(D14<E14,B13,B15))","v":""},null,null,null,null,null,null,null,null,0,0,"Y29",null,21,{"$f":"IF(AND(R34=0,S34=0),\"\",IF(R34>S34,P33,P35))","v":""},null,null,null,null,null,null,null,null,0,0,"Y41",null,null,{"$f":"IF(AND(AF34=0,AG34=0),\"\",IF(AF34>AG34,AD32,AD36))","v":""}]
[null,null,null,null,null,null,null,null,null,null,0,0,"Y23",null,15,{"$f":"IF(AND(K35=0,L35=0),\"\",IF(K35>L35,I34,I36))","v":""},null,null,null,null,null,null,null,null,null,null,null,null,27,null,null,null,null,null,null,null,null,null,null,null,null,null,"Y45",{"$f":"IF(AND(AM30=0,AN30=0),\"\",IF(AM30<AN30,AK26,AK34))","v":""},null,null,null,null,null,null,"4."]
[null,null,null,null,null,null,null,"Y6",{"$f":"IF(AND(D17=0,E17=0),\"\",IF(D17<E17,B16,B18))","v":""},null,null,null,null,null,null,null,null,null,null,null,null,null,null,null,0,0,"Y35",null,null,{"$f":"IF(AND(Y36=0,Z36=0),\"\",IF(Y36>Z36,W34,W38))","v":""}]
[null,null,null,null,null,null,null,null,null,null,null,null,null,null,"Y17",{"$f":"IF(AND(K4=0,L4=0),\"\",IF(K4<L4,I2,I5))","v":""},null,null,null,null,null,null,null,null,null,null,null,null,null,null,null,null,null,null,null,"Y40",{"$f":"IF(AND(AF26=0,AG26=0),\"\",IF(AF26<AG26,AD24,AD28))","v":""}]
[null,null,null,null,null,null,null,"Y7",{"$f":"IF(AND(D20=0,E20=0),\"\",IF(D20<E20,B19,B21))","v":""},null,null,null,null,null,null,null,null,0,0,"Y30",null,22,{"$f":"IF(AND(R38=0,S38=0),\"\",IF(R38>S38,P37,P39))","v":""},null,null,null,null,null,null,null,null,null,null,null,null,null,null,null,0,0,"Y46",null,38,{"$f":"IF(AND(AM38=0,AN38=0),\"\",IF(AM38>AN38,AK37,AK39))","v":""},null,null,null,null,null,null,"5."]
[null,null,null,null,null,null,null,null,null,null,0,0,"Y24",null,16,{"$f":"IF(AND(K39=0,L39=0),\"\",IF(K39>L39,I38,I40))","v":""},null,null,null,null,null,null,null,null,null,null,null,null,null,null,null,null,null,null,null,"Y41",{"$f":"IF(AND(AF34=0,AG34=0),\"\",IF(AF34<AG34,AD32,AD36))","v":""}]
[null,null,null,null,null,null,null,"Y8",{"$f":"IF(AND(D23=0,E23=0),\"\",IF(D23<E23,B22,B24))","v":""},null,null,null,null,null,null,null,null,null,null,null,null,null,null,null,null,null,null,null,null,null,null,null,null,null,null,null,null,null,null,null,null,null,"Y46",{"$f":"IF(AND(AM38=0,AN38=0),\"\",IF(AM38<AN38,AK37,AK39))","v":""},null,null,null,null,null,null,"6."]
[null,null,null,null,null,null,null,null,null,null,null,null,null,null,null,null,null,null,null,null,null,null,null,null,null,null,null,null,"Y34",{"$f":"IF(AND(Y28=0,Z28=0),\"\",IF(Y28<Z28,W26,W30))","v":""}]
[null,null,null,null,null,null,null,null,null,null,null,null,null,null,null,null,null,null,null,null,null,null,null,null,null,null,null,null,null,null,null,0,0,"Y42",null,34,{"$f":"IF(AND(AF42=0,AG42=0),\"\",IF(AF42>AG42,AD41,AD43))","v":""},null,null,null,null,null,null,"7."]
[null,null,null,null,null,null,null,null,null,null,null,null,null,null,null,null,null,null,null,null,null,null,null,null,null,null,null,null,"Y35",{"$f":"IF(AND(Y36=0,Z36=0),\"\",IF(Y36<Z36,W34,W38))","v":""}]
[null,null,null,null,null,null,null,null,null,null,null,null,null,null,null,null,null,null,null,null,null,"Y27",{"$f":"IF(AND(R26=0,S26=0),\"\",IF(R26<S26,P25,P27))","v":""},null,null,null,null,null,null,null,null,null,null,null,null,"Y42",{"$f":"IF(AND(AF42=0,AG42=0),\"\",IF(AF42<AG42,AD41,AD43))","v":""},null,null,null,null,null,null,"8."]
[null,null,null,null,null,null,null,null,null,null,null,null,null,null,null,null,null,null,null,null,null,null,null,null,0,0,"Y36",null,28,{"$f":"IF(AND(Y45=0,Z45=0),\"\",IF(Y45>Z45,W44,W46))","v":""}]
[null,null,null,null,null,null,null,null,null,null,null,null,null,null,null,null,null,null,null,null,null,"Y28",{"$f":"IF(AND(R30=0,S30=0),\"\",IF(R30<S30,P29,P31))","v":""},null,null,null,null,null,null,null,null,null,null,null,null,35]
[null,null,null,null,null,null,null,null,null,null,null,null,null,null,null,null,null,null,null,null,null,null,null,null,null,null,null,null,null,null,null,0,0,"Y43",null,null,{"$f":"IF(AND(AF47=0,AG47=0),\"\",IF(AF47>AG47,AD45,AD49))","v":""},null,null,null,null,null,null,"9."]
[null,null,null,null,null,null,null,null,null,null,null,null,null,null,null,null,null,null,null,null,null,"Y29",{"$f":"IF(AND(R34=0,S34=0),\"\",IF(R34<S34,P33,P35))","v":""}]
[null,null,null,null,null,null,null,null,null,null,null,null,null,null,null,null,null,null,null,null,null,null,null,null,0,0,"Y37",null,29,{"$f":"IF(AND(Y49=0,Z49=0),\"\",IF(Y49>Z49,W48,W50))","v":""}]
[null,null,null,null,null,null,null,null,null,null,null,null,null,null,null,null,null,null,null,null,null,"Y30",{"$f":"IF(AND(R38=0,S38=0),\"\",IF(R38<S38,P37,P39))","v":""},null,null,null,null,null,null,null,null,null,null,null,null,"Y43",{"$f":"IF(AND(AF47=0,AG47=0),\"\",IF(AF47<AG47,AD45,AD49))","v":""},null,null,null,null,null,null,"10."]
[null,null,null,null,null,null,null,null,null,null,null,null,null,null,null,null,null,null,null,null,null,null,null,null,null,null,null,null,"Y36",{"$f":"IF(AND(Y45=0,Z45=0),\"\",IF(Y45<Z45,W44,W46))","v":""}]
[null,null,null,null,null,null,null,null,null,null,null,null,null,null,null,null,null,null,null,null,null,null,null,null,null,null,null,null,null,null,null,0,0,"Y44",null,36,{"$f":"IF(AND(AF52=0,AG52=0),\"\",IF(AF52>AG52,AD51,AD53))","v":""},null,null,null,null,null,null,"11."]
[null,null,null,null,null,null,null,null,null,null,null,null,null,null,"Y21",{"$f":"IF(AND(K27=0,L27=0),\"\",IF(K27<L27,I26,I28))","v":""},null,null,null,null,null,null,null,null,null,null,null,null,"Y37",{"$f":"IF(AND(Y49=0,Z49=0),\"\",IF(Y49<Z49,W48,W50))","v":""}]
[null,null,null,null,null,null,null,null,null,null,null,null,null,null,null,null,null,0,0,"Y31",null,23,{"$f":"IF(AND(R54=0,S54=0),\"\",IF(R54>S54,P53,P55))","v":""},null,null,null,null,null,null,null,null,null,null,null,null,"Y44",{"$f":"IF(AND(AF52=0,AG52=0),\"\",IF(AF52<AG52,AD51,AD53))","v":""},null,null,null,null,null,null,"12."]
[null,null,null,null,null,null,null,null,null,null,null,null,null,null,"Y22",{"$f":"IF(AND(K31=0,L31=0),\"\",IF(K31<L31,I30,I32))","v":""},null,null,null,null,null,null,null,null,null,null,null,null,30]
[null,null,null,null,null,null,null,null,null,null,null,null,null,null,null,null,null,null,null,null,null,null,null,null,0,0,"Y38",null,null,{"$f":"IF(AND(Y56=0,Z56=0),\"\",IF(Y56>Z56,W54,W58))","v":""},null,null,null,null,null,null,"13."]
[null,null,null,null,null,null,null,null,null,null,null,null,null,null,"Y23",{"$f":"IF(AND(K35=0,L35=0),\"\",IF(K35<L35,I34,I36))","v":""}]
[null,null,null,null,null,null,null,null,null,null,null,null,null,null,null,null,null,0,0,"Y32",null,24,{"$f":"IF(AND(R58=0,S58=0),\"\",IF(R58>S58,P57,P59))","v":""}]
[null,null,null,null,null,null,null,null,null,null,null,null,null,null,"Y24",{"$f":"IF(AND(K39=0,L39=0),\"\",IF(K39<L39,I38,I40))","v":""},null,null,null,null,null,null,null,null,null,null,null,null,"Y38",{"$f":"IF(AND(Y56=0,Z56=0),\"\",IF(Y56<Z56,W54,W58))","v":""},null,null,null,null,null,null,"14."]
[null,null,null,null,null,null,null,null,null,null,null,null,null,null,null,null,null,null,null,null,null,"Y31",{"$f":"IF(AND(R54=0,S54=0),\"\",IF(R54<S54,P53,P55))","v":""}]
[null,null,null,null,null,null,null,null,null,null,null,null,null,null,null,null,null,null,null,null,null,null,null,null,0,0,"Y39",null,31,{"$f":"IF(AND(Y61=0,Z61=0),\"\",IF(Y61>Z61,W60,W62))","v":""},null,null,null,null,null,null,"15."]
[null,null,null,null,null,null,null,null,null,null,null,null,null,null,null,null,null,null,null,null,null,"Y32",{"$f":"IF(AND(R58=0,S58=0),\"\",IF(R58<S58,P57,P59))","v":""}]
[null,null,null,null,null,null,null,null,null,null,null,null,null,null,null,null,null,null,null,null,null,null,null,null,null,null,null,null,"Y39",{"$f":"IF(AND(Y61=0,Z61=0),\"\",IF(Y61<Z61,W60,W62))","v":""},null,null,null,null,null,null,"16."]

{"sheet":"Maclar","index":7,"n_rows":113,"n_cols":29,"rows_kept":113,"cut":false,"hidden":false,"merged":[[0,6,0,10],[0,0,0,4],[0,12,0,16],[0,18,0,22],[0,24,0,28]]}
["ÖNELEME",null,null,null,null,null,"ELEME",null,null,null,null,null,"ANATABLO",null,null,null,null,null,"ANATABLO(128)",null,null,null,null,null,"ANATABLO(128)_16"]
[1,{"$f":"IFERROR(On_Eleme!E5,0)","v":"NİSA GÜN (AMS)"},{"$f":"On_Eleme!F5","v":0},{"$f":"On_Eleme!F6","v":0},{"$f":"IFERROR(On_Eleme!E6,0)","v":0},null,1,{"$f":"IFERROR(Eleme!F4,0)","v":"NİL BAŞARAN (İST)"},{"$f":"Eleme!H5","v":3},{"$f":"Eleme!I5","v":0},{"$f":"IFERROR(Eleme!F6,0)","v":0},null,1,{"$f":"IFERROR(Ana_Tablo!B1,0)","v":false},{"$f":"IFERROR(Ana_Tablo!D2,0)","v":0},{"$f":"IFERROR(Ana_Tablo!E2,0)","v":0},{"$f":"IFERROR(Ana_Tablo!B3,0)","v":false},null,1,{"$f":"IFERROR('Ana_Tablo(128)'!B1,0)","v":"NİL BAŞARAN (İST)"},{"$f":"IFERROR('Ana_Tablo(128)'!D2,0)","v":3},{"$f":"IFERROR('Ana_Tablo(128)'!E2,0)","v":0},{"$f":"IFERROR('Ana_Tablo(128)'!B3,0)","v":"ŞEVVAL ALAŞ (BTM)"},null,1,{"$f":"'Ana_Tablo(128_16)'!B1","v":"NİL BAŞARAN (İST)"},{"$f":"IFERROR('Ana_Tablo(128_16)'!D2,0)","v":0},{"$f":"IFERROR('Ana_Tablo(128_16)'!E2,0)","v":0},{"$f":"'Ana_Tablo(128_16)'!B3","v":"ŞEVVAL ALAŞ (BTM)"}]
[2,{"$f":"IFERROR(On_Eleme!E8,0)","v":"ECE ECRİN MELEN (VAN)"},{"$f":"On_Eleme!F8","v":0},{"$f":"On_Eleme!F9","v":0},{"$f":"IFERROR(On_Eleme!E9,0)","v":0},null,2,{"$f":"IFERROR(Eleme!F7,0)","v":0},{"$f":"Eleme!H8","v":0},{"$f":"Eleme!I8","v":0},{"$f":"IFERROR(Eleme!F9,0)","v":0},null,2,{"$f":"IFERROR(Ana_Tablo!B4,0)","v":false},{"$f":"IFERROR(Ana_Tablo!D5,0)","v":0},{"$f":"IFERROR(Ana_Tablo!E5,0)","v":0},{"$f":"IFERROR(Ana_Tablo!B6,0)","v":false},null,2,{"$f":"IFERROR('Ana_Tablo(128)'!B4,0)","v":"ELA SU YÖNTER (ANK)"},{"$f":"IFERROR('Ana_Tablo(128)'!D5,0)","v":3},{"$f":"IFERROR('Ana_Tablo(128)'!E5,0)","v":1},{"$f":"IFERROR('Ana_Tablo(128)'!B6,0)","v":"CEYLİN AKDANALI (ÇRM)"},null,2,{"$f":"'Ana_Tablo(128_16)'!B4","v":"ELA SU YÖNTER (ANK)"},{"$f":"IFERROR('Ana_Tablo(128_16)'!D5,0)","v":0},{"$f":"IFERROR('Ana_Tablo(128_16)'!E5,0)","v":0},{"$f":"'Ana_Tablo(128_16)'!B6","v":"CEYLİN AKDANALI (ÇRM)"}]
[3,{"$f":"IFERROR(On_Eleme!E11,0)","v":"BUSE NUR ÖNDER (BTM)"},{"$f":"On_Eleme!F11","v":0},{"$f":"On_Eleme!F12","v":0},{"$f":"IFERROR(On_Eleme!E12,0)","v":0},null,3,{"$f":"IFERROR(Eleme!F10,0)","v":"ŞEVVAL ALAŞ (BTM)"},{"$f":"Eleme!H11","v":3},{"$f":"Eleme!I11","v":0},{"$f":"IFERROR(Eleme!F12,0)","v":"FİRDEVSNUR BİNGÖL (YLV)"},null,3,{"$f":"IFERROR(Ana_Tablo!B7,0)","v":false},{"$f":"IFERROR(Ana_Tablo!D8,0)","v":0},{"$f":"IFERROR(Ana_Tablo!E8,0)","v":0},{"$f":"IFERROR(Ana_Tablo!B9,0)","v":false},null,3,{"$f":"IFERROR('Ana_Tablo(128)'!B7,0)","v":"ELİZAN BAŞAR (ANK)"},{"$f":"IFERROR('Ana_Tablo(128)'!D8,0)","v":3},{"$f":"IFERROR('Ana_Tablo(128)'!E8,0)","v":0},{"$f":"IFERROR('Ana_Tablo(128)'!B9,0)","v":"NİSA ÜZÜMCÜ (BTM)"},null,3,{"$f":"'Ana_Tablo(128_16)'!B7","v":"ELİZAN BAŞAR (ANK)"},{"$f":"IFERROR('Ana_Tablo(128_16)'!D8,0)","v":0},{"$f":"IFERROR('Ana_Tablo(128_16)'!E8,0)","v":0},{"$f":"'Ana_Tablo(128_16)'!B9","v":"NİSA ÜZÜMCÜ (BTM)"}]
[4,{"$f":"IFERROR(On_Eleme!E14,0)","v":"HİLALSU SAĞLAM (VAN)"},{"$f":"On_Eleme!F14","v":0},{"$f":"On_Eleme!F15","v":0},{"$f":"IFERROR(On_Eleme!E15,0)","v":0},null,4,{"$f":"IFERROR(Eleme!F13,0)","v":"FATMANUR DEMİRCİ (KMŞ)"},{"$f":"Eleme!H14","v":0},{"$f":"Eleme!I14","v":3},{"$f":"IFERROR(Eleme!F15,0)","v":"HATİCE RAVZA GÜLCE (KYS)"},null,4,{"$f":"IFERROR(Ana_Tablo!B10,0)","v":false},{"$f":"IFERROR(Ana_Tablo!D11,0)","v":0},{"$f":"IFERROR(Ana_Tablo!E11,0)","v":0},{"$f":"IFERROR(Ana_Tablo!B12,0)","v":false},null,4,{"$f":"IFERROR('Ana_Tablo(128)'!B10,0)","v":"ESİLA SU YALÇIN (SKR)"},{"$f":"IFERROR('Ana_Tablo(128)'!D11,0)","v":3},{"$f":"IFERROR('Ana_Tablo(128)'!E11,0)","v":2},{"$f":"IFERROR('Ana_Tablo(128)'!B12,0)","v":"DURU ŞENDOĞAN (RİZ)"},null,4,{"$f":"'Ana_Tablo(128_16)'!B10","v":"ESİLA SU YALÇIN (SKR)"},{"$f":"IFERROR('Ana_Tablo(128_16)'!D11,0)","v":0},{"$f":"IFERROR('Ana_Tablo(128_16)'!E11,0)","v":0},{"$f":"'Ana_Tablo(128_16)'!B12","v":"DURU ŞENDOĞAN (RİZ)"}]
[5,{"$f":"IFERROR(On_Eleme!E17,0)","v":"CEREN KOÇAK (KYS)"},{"$f":"On_Eleme!F17","v":0},{"$f":"On_Eleme!F18","v":0},{"$f":"IFERROR(On_Eleme!E18,0)","v":0},null,5,{"$f":"IFERROR(Eleme!F16,0)","v":"ELA SU YÖNTER (ANK)"},{"$f":"Eleme!H17","v":3},{"$f":"Eleme!I17","v":0},{"$f":"IFERROR(Eleme!F18,0)","v":"MEDİNE İREM TÜRKAN (BTM)"},null,5,{"$f":"IFERROR(Ana_Tablo!B13,0)","v":false},{"$f":"IFERROR(Ana_Tablo!D14,0)","v":0},{"$f":"IFERROR(Ana_Tablo!E14,0)","v":0},{"$f":"IFERROR(Ana_Tablo!B15,0)","v":false},null,5,{"$f":"IFERROR('Ana_Tablo(128)'!B13,0)","v":"EYLÜL ŞEVVAL AYDIN (İST)"},{"$f":"IFERROR('Ana_Tablo(128)'!D14,0)","v":3},{"$f":"IFERROR('Ana_Tablo(128)'!E14,0)","v":0},{"$f":"IFERROR('Ana_Tablo(128)'!B15,0)","v":"ELANUR YILMAZ (BRS)"},null,5,{"$f":"'Ana_Tablo(128_16)'!B13","v":"EYLÜL ŞEVVAL AYDIN (İST)"},{"$f":"IFERROR('Ana_Tablo(128_16)'!D14,0)","v":0},{"$f":"IFERROR('Ana_Tablo(128_16)'!E14,0)","v":0},{"$f":"'Ana_Tablo(128_16)'!B15","v":"ELANUR YILMAZ (BRS)"}]
[6,{"$f":"IFERROR(On_Eleme!E20,0)","v":"BERİL ECE ÇARKÇI (ORD)"},{"$f":"On_Eleme!F20","v":0},{"$f":"On_Eleme!F21","v":0},{"$f":"IFERROR(On_Eleme!E21,0)","v":0},null,6,{"$f":"IFERROR(Eleme!F19,0)","v":"SÜEDA SİVAS (AMS)"},{"$f":"Eleme!H20","v":0},{"$f":"Eleme!I20","v":3},{"$f":"IFERROR(Eleme!F21,0)","v":"EMİNE AYDINAY (BRS)"},null,6,{"$f":"IFERROR(Ana_Tablo!B16,0)","v":false},{"$f":"IFERROR(Ana_Tablo!D17,0)","v":0},{"$f":"IFERROR(Ana_Tablo!E17,0)","v":0},{"$f":"IFERROR(Ana_Tablo!B18,0)","v":false},null,6,{"$f":"IFERROR('Ana_Tablo(128)'!B16,0)","v":"DİLAY BALABAN (RİZ)"},{"$f":"IFERROR('Ana_Tablo(128)'!D17,0)","v":3},{"$f":"IFERROR('Ana_Tablo(128)'!E17,0)","v":2},{"$f":"IFERROR('Ana_Tablo(128)'!B18,0)","v":"ZEYNEP NAZ EKER (KRL)"},null,6,{"$f":"'Ana_Tablo(128_16)'!B16","v":"DİLAY BALABAN (RİZ)"},{"$f":"IFERROR('Ana_Tablo(128_16)'!D17,0)","v":0},{"$f":"IFERROR('Ana_Tablo(128_16)'!E17,0)","v":0},{"$f":"'Ana_Tablo(128_16)'!B18","v":"ZEYNEP NAZ EKER (KRL)"}]
[7,{"$f":"IFERROR(On_Eleme!E23,0)","v":0},{"$f":"On_Eleme!F23","v":0},{"$f":"On_Eleme!F24","v":0},{"$f":"IFERROR(On_Eleme!E24,0)","v":0},null,7,{"$f":"IFERROR(Eleme!F22,0)","v":"BERRA ARIKAN (ADN)"},{"$f":"Eleme!H23","v":3},{"$f":"Eleme!I23","v":2},{"$f":"IFERROR(Eleme!F24,0)","v":"AYNUR CANGİR (BTM)"},null,7,{"$f":"IFERROR(Ana_Tablo!B19,0)","v":false},{"$f":"IFERROR(Ana_Tablo!D20,0)","v":0},{"$f":"IFERROR(Ana_Tablo!E20,0)","v":0},{"$f":"IFERROR(Ana_Tablo!B21,0)","v":false},null,7,{"$f":"IFERROR('Ana_Tablo(128)'!B19,0)","v":"İPEK ERTUNA (ANK)"},{"$f":"IFERROR('Ana_Tablo(128)'!D20,0)","v":2},{"$f":"IFERROR('Ana_Tablo(128)'!E20,0)","v":3},{"$f":"IFERROR('Ana_Tablo(128)'!B21,0)","v":"MASAL ERYILMAZ (İST)"},null,7,{"$f":"'Ana_Tablo(128_16)'!B19","v":"İPEK ERTUNA (ANK)"},{"$f":"IFERROR('Ana_Tablo(128_16)'!D20,0)","v":0},{"$f":"IFERROR('Ana_Tablo(128_16)'!E20,0)","v":0},{"$f":"'Ana_Tablo(128_16)'!B21","v":"MASAL ERYILMAZ (İST)"}]
[8,{"$f":"IFERROR(On_Eleme!E26,0)","v":"SÜEDA SİVAS (AMS)"},{"$f":"On_Eleme!F26","v":0},{"$f":"On_Eleme!F27","v":0},{"$f":"IFERROR(On_Eleme!E27,0)","v":0},null,8,{"$f":"IFERROR(Eleme!F25,0)","v":"ELİF KABAAHMETOĞLU (KST)"},{"$f":"Eleme!H26","v":0},{"$f":"Eleme!I26","v":3},{"$f":"IFERROR(Eleme!F27,0)","v":"CEYLİN AKDANALI (ÇRM)"},null,8,{"$f":"IFERROR(Ana_Tablo!B22,0)","v":false},{"$f":"IFERROR(Ana_Tablo!D23,0)","v":0},{"$f":"IFERROR(Ana_Tablo!E23,0)","v":0},{"$f":"IFERROR(Ana_Tablo!B24,0)","v":false},null,8,{"$f":"IFERROR('Ana_Tablo(128)'!B22,0)","v":"ZEYNEP DURAN (İST)"},{"$f":"IFERROR('Ana_Tablo(128)'!D23,0)","v":2},{"$f":"IFERROR('Ana_Tablo(128)'!E23,0)","v":3},{"$f":"IFERROR('Ana_Tablo(128)'!B24,0)","v":"HATİCE ELİF GÜVELİ (İST)"},null,8,{"$f":"'Ana_Tablo(128_16)'!B22","v":"ZEYNEP DURAN (İST)"},{"$f":"IFERROR('Ana_Tablo(128_16)'!D23,0)","v":0},{"$f":"IFERROR('Ana_Tablo(128_16)'!E23,0)","v":0},{"$f":"'Ana_Tablo(128_16)'!B24","v":"HATİCE ELİF GÜVELİ (İST)"}]
[9,{"$f":"IFERROR(On_Eleme!E29,0)","v":"ZEYNEB KOÇ (ZNG)"},{"$f":"On_Eleme!F29","v":0},{"$f":"On_Eleme!F30","v":0},{"$f":"IFERROR(On_Eleme!E30,0)","v":0},null,9,{"$f":"IFERROR(Eleme!F28,0)","v":"ELİZAN BAŞAR (ANK)"},{"$f":"Eleme!H29","v":3},{"$f":"Eleme!I29","v":1},{"$f":"IFERROR(Eleme!F30,0)","v":"TUANA GÜLER (KRL)"},null,9,{"$f":"IFERROR(Ana_Tablo!I2,0)","v":""},{"$f":"IFERROR(Ana_Tablo!K4,0)","v":0},{"$f":"IFERROR(Ana_Tablo!L4,0)","v":0},{"$f":"IFERROR(Ana_Tablo!I5,0)","v":""},null,9,{"$f":"IFERROR('Ana_Tablo(128)'!B25,0)","v":"ELİF ECE AKYÜREK (ADN)"},{"$f":"IFERROR('Ana_Tablo(128)'!D26,0)","v":3},{"$f":"IFERROR('Ana_Tablo(128)'!E26,0)","v":0},{"$f":"IFERROR('Ana_Tablo(128)'!B27,0)","v":"EYLÜL KENANOĞLU (KST)"},null,9,{"$f":"'Ana_Tablo(128_16)'!B25","v":"ELİF ECE AKYÜREK (ADN)"},{"$f":"IFERROR('Ana_Tablo(128_16)'!D26,0)","v":0},{"$f":"IFERROR('Ana_Tablo(128_16)'!E26,0)","v":0},{"$f":"'Ana_Tablo(128_16)'!B27","v":"EYLÜL KENANOĞLU (KST)"}]
[10,{"$f":"IFERROR(On_Eleme!E32,0)","v":"ECRİN ZEYNEP ERCİYAS (ORD)"},{"$f":"On_Eleme!F32","v":0},{"$f":"On_Eleme!F33","v":0},{"$f":"IFERROR(On_Eleme!E33,0)","v":0},null,10,{"$f":"IFERROR(Eleme!F31,0)","v":"ZEYNEP BERRA GÜLOĞLU (VAN)"},{"$f":"Eleme!H32","v":0},{"$f":"Eleme!I32","v":3},{"$f":"IFERROR(Eleme!F33,0)","v":"KAREN GÜRBÜZ (ADN)"},null,10,{"$f":"IFERROR(Ana_Tablo!I8,0)","v":""},{"$f":"IFERROR(Ana_Tablo!K10,0)","v":0},{"$f":"IFERROR(Ana_Tablo!L10,0)","v":0},{"$f":"IFERROR(Ana_Tablo!I11,0)","v":""},null,10,{"$f":"IFERROR('Ana_Tablo(128)'!B28,0)","v":"ESMA SULTAN SARI (SKR)"},{"$f":"IFERROR('Ana_Tablo(128)'!D29,0)","v":3},{"$f":"IFERROR('Ana_Tablo(128)'!E29,0)","v":1},{"$f":"IFERROR('Ana_Tablo(128)'!B30,0)","v":"ELANUR ALAÇAM (AMS)"},null,10,{"$f":"'Ana_Tablo(128_16)'!B28","v":"ESMA SULTAN SARI (SKR)"},{"$f":"IFERROR('Ana_Tablo(128_16)'!D29,0)","v":0},{"$f":"IFERROR('Ana_Tablo(128_16)'!E29,0)","v":0},{"$f":"'Ana_Tablo(128_16)'!B30","v":"ELANUR ALAÇAM (AMS)"}]
[11,{"$f":"IFERROR(On_Eleme!E35,0)","v":"ASLINUR USLU (BRS)"},{"$f":"On_Eleme!F35","v":0},{"$f":"On_Eleme!F36","v":0},{"$f":"IFERROR(On_Eleme!E36,0)","v":0},null,11,{"$f":"IFERROR(Eleme!F34,0)","v":"AYÇA SAVAŞ (KST)"},{"$f":"Eleme!H35","v":3},{"$f":"Eleme!I35","v":0},{"$f":"IFERROR(Eleme!F36,0)","v":"HİLALSU SAĞLAM (VAN)"},null,11,{"$f":"IFERROR(Ana_Tablo!I14,0)","v":""},{"$f":"IFERROR(Ana_Tablo!K16,0)","v":0},{"$f":"IFERROR(Ana_Tablo!L16,0)","v":0},{"$f":"IFERROR(Ana_Tablo!I17,0)","v":""},null,11,{"$f":"IFERROR('Ana_Tablo(128)'!B31,0)","v":"AYTEN CEREN KAHRAMAN (KYS)"},{"$f":"IFERROR('Ana_Tablo(128)'!D32,0)","v":3},{"$f":"IFERROR('Ana_Tablo(128)'!E32,0)","v":0},{"$f":"IFERROR('Ana_Tablo(128)'!B33,0)","v":"IRMAK BÜŞRA UNCU (KST)"},null,11,{"$f":"'Ana_Tablo(128_16)'!B31","v":"AYTEN CEREN KAHRAMAN (KYS)"},{"$f":"IFERROR('Ana_Tablo(128_16)'!D32,0)","v":0},{"$f":"IFERROR('Ana_Tablo(128_16)'!E32,0)","v":0},{"$f":"'Ana_Tablo(128_16)'!B33","v":"IRMAK BÜŞRA UNCU (KST)"}]
[12,{"$f":"IFERROR(On_Eleme!E38,0)","v":"ELİF ASYA HOCAOĞLU (RİZ)"},{"$f":"On_Eleme!F38","v":0},{"$f":"On_Eleme!F39","v":0},{"$f":"IFERROR(On_Eleme!E39,0)","v":0},null,12,{"$f":"IFERROR(Eleme!F37,0)","v":"KÜBRA YERLİKAYA (AMS)"},{"$f":"Eleme!H38","v":0},{"$f":"Eleme!I38","v":3},{"$f":"IFERROR(Eleme!F39,0)","v":"NİSA ÜZÜMCÜ (BTM)"},null,12,{"$f":"IFERROR(Ana_Tablo!I20,0)","v":""},{"$f":"IFERROR(Ana_Tablo!K22,0)","v":0},{"$f":"IFERROR(Ana_Tablo!L22,0)","v":0},{"$f":"IFERROR(Ana_Tablo!I23,0)","v":""},null,12,{"$f":"IFERROR('Ana_Tablo(128)'!B34,0)","v":"NAZLINUR AKGÜN (ANT)"},{"$f":"IFERROR('Ana_Tablo(128)'!D35,0)","v":0},{"$f":"IFERROR('Ana_Tablo(128)'!E35,0)","v":3},{"$f":"IFERROR('Ana_Tablo(128)'!B36,0)","v":"DURU KIRBAÇ (İST)"},null,12,{"$f":"'Ana_Tablo(128_16)'!B34","v":"NAZLINUR AKGÜN (ANT)"},{"$f":"IFERROR('Ana_Tablo(128_16)'!D35,0)","v":0},{"$f":"IFERROR('Ana_Tablo(128_16)'!E35,0)","v":0},{"$f":"'Ana_Tablo(128_16)'!B36","v":"DURU KIRBAÇ (İST)"}]
[13,{"$f":"IFERROR(On_Eleme!E41,0)","v":"EYLÜL KENANOĞLU (KST)"},{"$f":"On_Eleme!F41","v":0},{"$f":"On_Eleme!F42","v":0},{"$f":"IFERROR(On_Eleme!E42,0)","v":0},null,13,{"$f":"IFERROR(Eleme!F40,0)","v":"ESİLA SU YALÇIN (SKR)"},{"$f":"Eleme!H41","v":3},{"$f":"Eleme!I41","v":1},{"$f":"IFERROR(Eleme!F42,0)","v":"İDİL TOSUN (ADN)"},null,13,{"$f":"IFERROR(Ana_Tablo!I26,0)","v":""},{"$f":"IFERROR(Ana_Tablo!K27,0)","v":0},{"$f":"IFERROR(Ana_Tablo!L27,0)","v":0},{"$f":"IFERROR(Ana_Tablo!I28,0)","v":""},null,13,{"$f":"IFERROR('Ana_Tablo(128)'!B37,0)","v":"ZEYNEP ADA ER (ANK)"},{"$f":"IFERROR('Ana_Tablo(128)'!D38,0)","v":3},{"$f":"IFERROR('Ana_Tablo(128)'!E38,0)","v":2},{"$f":"IFERROR('Ana_Tablo(128)'!B39,0)","v":"ELVİN KALE (YLV)"},null,13,{"$f":"'Ana_Tablo(128_16)'!B37","v":"ZEYNEP ADA ER (ANK)"},{"$f":"IFERROR('Ana_Tablo(128_16)'!D38,0)","v":0},{"$f":"IFERROR('Ana_Tablo(128_16)'!E38,0)","v":0},{"$f":"'Ana_Tablo(128_16)'!B39","v":"ELVİN KALE (YLV)"}]
[14,{"$f":"IFERROR(On_Eleme!E44,0)","v":"İLGİ İPEK TUNÇ (ANK)"},{"$f":"On_Eleme!F44","v":0},{"$f":"On_Eleme!F45","v":0},{"$f":"IFERROR(On_Eleme!E45,0)","v":0},null,14,{"$f":"IFERROR(Eleme!F43,0)","v":"ELİF ASYA HOCAOĞLU (RİZ)"},{"$f":"Eleme!H44","v":3},{"$f":"Eleme!I44","v":0},{"$f":"IFERROR(Eleme!F45,0)","v":"MİRAÇ DENİZ AKAR (TKD)"},null,14,{"$f":"IFERROR(Ana_Tablo!I30,0)","v":""},{"$f":"IFERROR(Ana_Tablo!K31,0)","v":0},{"$f":"IFERROR(Ana_Tablo!L31,0)","v":0},{"$f":"IFERROR(Ana_Tablo!I32,0)","v":""},null,14,{"$f":"IFERROR('Ana_Tablo(128)'!B40,0)","v":"DAMLA AVŞAR (VAN)"},{"$f":"IFERROR('Ana_Tablo(128)'!D41,0)","v":0},{"$f":"IFERROR('Ana_Tablo(128)'!E41,0)","v":3},{"$f":"IFERROR('Ana_Tablo(128)'!B42,0)","v":"BUSE KOÇAK (ANK)"},null,14,{"$f":"'Ana_Tablo(128_16)'!B40","v":"DAMLA AVŞAR (VAN)"},{"$f":"IFERROR('Ana_Tablo(128_16)'!D41,0)","v":0},{"$f":"IFERROR('Ana_Tablo(128_16)'!E41,0)","v":0},{"$f":"'Ana_Tablo(128_16)'!B42","v":"BUSE KOÇAK (ANK)"}]
[15,{"$f":"IFERROR(On_Eleme!E47,0)","v":0},{"$f":"On_Eleme!F47","v":0},{"$f":"On_Eleme!F48","v":0},{"$f":"IFERROR(On_Eleme!E48,0)","v":0},null,15,{"$f":"IFERROR(Eleme!F46,0)","v":0},{"$f":"Eleme!H47","v":0},{"$f":"Eleme!I47","v":0},{"$f":"IFERROR(Eleme!F48,0)","v":0},null,15,{"$f":"IFERROR(Ana_Tablo!I34,0)","v":""},{"$f":"IFERROR(Ana_Tablo!K35,0)","v":0},{"$f":"IFERROR(Ana_Tablo!L35,0)","v":0},{"$f":"IFERROR(Ana_Tablo!I36,0)","v":""},null,15,{"$f":"IFERROR('Ana_Tablo(128)'!B43,0)","v":"ÖZLEM KÖSEOĞLU (RİZ)"},{"$f":"IFERROR('Ana_Tablo(128)'!D44,0)","v":2},{"$f":"IFERROR('Ana_Tablo(128)'!E44,0)","v":3},{"$f":"IFERROR('Ana_Tablo(128)'!B45,0)","v":"ELİF BEYZA AKDEMİR (BTM)"},null,15,{"$f":"'Ana_Tablo(128_16)'!B43","v":"ÖZLEM KÖSEOĞLU (RİZ)"},{"$f":"IFERROR('Ana_Tablo(128_16)'!D44,0)","v":0},{"$f":"IFERROR('Ana_Tablo(128_16)'!E44,0)","v":0},{"$f":"'Ana_Tablo(128_16)'!B45","v":"ELİF BEYZA AKDEMİR (BTM)"}]
[16,{"$f":"IFERROR(On_Eleme!E50,0)","v":"FİRDEVSNUR BİNGÖL (YLV)"},{"$f":"On_Eleme!F50","v":0},{"$f":"On_Eleme!F51","v":0},{"$f":"IFERROR(On_Eleme!E51,0)","v":0},null,16,{"$f":"IFERROR(Eleme!F49,0)","v":0},{"$f":"Eleme!H50","v":0},{"$f":"Eleme!I50","v":3},{"$f":"IFERROR(Eleme!F51,0)","v":"DURU ŞENDOĞAN (RİZ)"},null,16,{"$f":"IFERROR(Ana_Tablo!I38,0)","v":""},{"$f":"IFERROR(Ana_Tablo!K39,0)","v":0},{"$f":"IFERROR(Ana_Tablo!L39,0)","v":0},{"$f":"IFERROR(Ana_Tablo!I40,0)","v":""},null,16,{"$f":"IFERROR('Ana_Tablo(128)'!B46,0)","v":"ARMİN AYDIN (İST)"},{"$f":"IFERROR('Ana_Tablo(128)'!D47,0)","v":1},{"$f":"IFERROR('Ana_Tablo(128)'!E47,0)","v":3},{"$f":"IFERROR('Ana_Tablo(128)'!B48,0)","v":"GÜLCE DÖNMEZ (KNY)"},null,16,{"$f":"'Ana_Tablo(128_16)'!B46","v":"ARMİN AYDIN (İST)"},{"$f":"IFERROR('Ana_Tablo(128_16)'!D47,0)","v":0},{"$f":"IFERROR('Ana_Tablo(128_16)'!E47,0)","v":0},{"$f":"'Ana_Tablo(128_16)'!B48","v":"GÜLCE DÖNMEZ (KNY)"}]
[17,{"$f":"IFERROR(On_Eleme!E53,0)","v":"NİSANUR AYTEN (VAN)"},{"$f":"On_Eleme!F53","v":0},{"$f":"On_Eleme!F54","v":0},{"$f":"IFERROR(On_Eleme!E54,0)","v":0},null,17,{"$f":"IFERROR(Eleme!F52,0)","v":"EYLÜL ŞEVVAL AYDIN (İST)"},{"$f":"Eleme!H53","v":3},{"$f":"Eleme!I53","v":0},{"$f":"IFERROR(Eleme!F54,0)","v":0},null,17,{"$f":"IFERROR(Ana_Tablo!P4,0)","v":""},{"$f":"IFERROR(Ana_Tablo!R7,0)","v":0},{"$f":"IFERROR(Ana_Tablo!S7,0)","v":0},{"$f":"IFERROR(Ana_Tablo!P9,0)","v":""},null,17,{"$f":"IFERROR('Ana_Tablo(128)'!I2,0)","v":"NİL BAŞARAN (İST)"},{"$f":"IFERROR('Ana_Tablo(128)'!K4,0)","v":3},{"$f":"IFERROR('Ana_Tablo(128)'!L4,0)","v":2},{"$f":"IFERROR('Ana_Tablo(128)'!I5,0)","v":"ELA SU YÖNTER (ANK)"},null,17,{"$f":"'Ana_Tablo(128_16)'!I2","v":""},{"$f":"IFERROR('Ana_Tablo(128_16)'!K4,0)","v":0},{"$f":"IFERROR('Ana_Tablo(128_16)'!L4,0)","v":0},{"$f":"'Ana_Tablo(128_16)'!I5","v":""}]
[18,{"$f":"IFERROR(On_Eleme!E56,0)","v":"ŞEVVAL CİMBEK (AMS)"},{"$f":"On_Eleme!F56","v":0},{"$f":"On_Eleme!F57","v":0},{"$f":"IFERROR(On_Eleme!E57,0)","v":0},null,18,{"$f":"IFERROR(Eleme!F55,0)","v":0},{"$f":"Eleme!H56","v":0},{"$f":"Eleme!I56","v":0},{"$f":"IFERROR(Eleme!F57,0)","v":0},null,18,{"$f":"IFERROR(Ana_Tablo!P16,0)","v":""},{"$f":"IFERROR(Ana_Tablo!R19,0)","v":0},{"$f":"IFERROR(Ana_Tablo!S19,0)","v":0},{"$f":"IFERROR(Ana_Tablo!P21,0)","v":""},null,18,{"$f":"IFERROR('Ana_Tablo(128)'!I8,0)","v":"ELİZAN BAŞAR (ANK)"},{"$f":"IFERROR('Ana_Tablo(128)'!K10,0)","v":3},{"$f":"IFERROR('Ana_Tablo(128)'!L10,0)","v":1},{"$f":"IFERROR('Ana_Tablo(128)'!I11,0)","v":"ESİLA SU YALÇIN (SKR)"},null,18,{"$f":"'Ana_Tablo(128_16)'!I8","v":""},{"$f":"IFERROR('Ana_Tablo(128_16)'!K10,0)","v":0},{"$f":"IFERROR('Ana_Tablo(128_16)'!L10,0)","v":0},{"$f":"'Ana_Tablo(128_16)'!I11","v":""}]
[19,{"$f":"IFERROR(On_Eleme!E59,0)","v":"BAHAR TUNÇOK (ANK)"},{"$f":"On_Eleme!F59","v":0},{"$f":"On_Eleme!F60","v":0},{"$f":"IFERROR(On_Eleme!E60,0)","v":0},null,19,{"$f":"IFERROR(Eleme!F58,0)","v":"ELANUR YILMAZ (BRS)"},{"$f":"Eleme!H59","v":3},{"$f":"Eleme!I59","v":2},{"$f":"IFERROR(Eleme!F60,0)","v":"ECRİN ZEYNEP ERCİYAS (ORD)"},null,19,{"$f":"IFERROR(Ana_Tablo!P25,0)","v":""},{"$f":"IFERROR(Ana_Tablo!R26,0)","v":0},{"$f":"IFERROR(Ana_Tablo!S26,0)","v":0},{"$f":"IFERROR(Ana_Tablo!P27,0)","v":""},null,19,{"$f":"IFERROR('Ana_Tablo(128)'!I14,0)","v":"EYLÜL ŞEVVAL AYDIN (İST)"},{"$f":"IFERROR('Ana_Tablo(128)'!K16,0)","v":3},{"$f":"IFERROR('Ana_Tablo(128)'!L16,0)","v":0},{"$f":"IFERROR('Ana_Tablo(128)'!I17,0)","v":"DİLAY BALABAN (RİZ)"},null,19,{"$f":"'Ana_Tablo(128_16)'!I14","v":""},{"$f":"IFERROR('Ana_Tablo(128_16)'!K16,0)","v":0},{"$f":"IFERROR('Ana_Tablo(128_16)'!L16,0)","v":0},{"$f":"'Ana_Tablo(128_16)'!I17","v":""}]
[20,{"$f":"IFERROR(On_Eleme!E62,0)","v":"ZEYNEP BERRA GÜLOĞLU (VAN)"},{"$f":"On_Eleme!F62","v":0},{"$f":"On_Eleme!F63","v":0},{"$f":"IFERROR(On_Eleme!E63,0)","v":0},null,20,{"$f":"IFERROR(Eleme!F61,0)","v":"MERYEM ECRİN ŞENTÜRK (KCL)"},{"$f":"Eleme!H62","v":2},{"$f":"Eleme!I62","v":3},{"$f":"IFERROR(Eleme!F63,0)","v":"AYŞE DURU DOĞAN (ANK)"},null,20,{"$f":"IFERROR(Ana_Tablo!P29,0)","v":""},{"$f":"IFERROR(Ana_Tablo!R30,0)","v":0},{"$f":"IFERROR(Ana_Tablo!S30,0)","v":0},{"$f":"IFERROR(Ana_Tablo!P31,0)","v":""},null,20,{"$f":"IFERROR('Ana_Tablo(128)'!I20,0)","v":"MASAL ERYILMAZ (İST)"},{"$f":"IFERROR('Ana_Tablo(128)'!K22,0)","v":0},{"$f":"IFERROR('Ana_Tablo(128)'!L22,0)","v":3},{"$f":"IFERROR('Ana_Tablo(128)'!I23,0)","v":"HATİCE ELİF GÜVELİ (İST)"},null,20,{"$f":"'Ana_Tablo(128_16)'!I20","v":""},{"$f":"IFERROR('Ana_Tablo(128_16)'!K22,0)","v":0},{"$f":"IFERROR('Ana_Tablo(128_16)'!L22,0)","v":0},{"$f":"'Ana_Tablo(128_16)'!I23","v":""}]
[21,{"$f":"IFERROR(On_Eleme!E65,0)","v":"ELANUR ALAÇAM (AMS)"},{"$f":"On_Eleme!F65","v":0},{"$f":"On_Eleme!F66","v":0},{"$f":"IFERROR(On_Eleme!E66,0)","v":0},null,21,{"$f":"IFERROR(Eleme!F64,0)","v":"DİLAY BALABAN (RİZ)"},{"$f":"Eleme!H65","v":3},{"$f":"Eleme!I65","v":0},{"$f":"IFERROR(Eleme!F66,0)","v":"NAZLISU OKKAN (KRL)"},null,21,{"$f":"IFERROR(Ana_Tablo!P33,0)","v":""},{"$f":"IFERROR(Ana_Tablo!R34,0)","v":0},{"$f":"IFERROR(Ana_Tablo!S34,0)","v":0},{"$f":"IFERROR(Ana_Tablo!P35,0)","v":""},null,21,{"$f":"IFERROR('Ana_Tablo(128)'!I26,0)","v":"ELİF ECE AKYÜREK (ADN)"},{"$f":"IFERROR('Ana_Tablo(128)'!K28,0)","v":3},{"$f":"IFERROR('Ana_Tablo(128)'!L28,0)","v":0},{"$f":"IFERROR('Ana_Tablo(128)'!I29,0)","v":"ESMA SULTAN SARI (SKR)"},null,21,{"$f":"'Ana_Tablo(128_16)'!I26","v":""},{"$f":"IFERROR('Ana_Tablo(128_16)'!K28,0)","v":0},{"$f":"IFERROR('Ana_Tablo(128_16)'!L28,0)","v":0},{"$f":"'Ana_Tablo(128_16)'!I29","v":""}]
[22,{"$f":"IFERROR(On_Eleme!E68,0)","v":"ASUDE AKSOY (GZT)"},{"$f":"On_Eleme!F68","v":0},{"$f":"On_Eleme!F69","v":0},{"$f":"IFERROR(On_Eleme!E69,0)","v":0},null,22,{"$f":"IFERROR(Eleme!F67,0)","v":"ECE ECRİN MELEN (VAN)"},{"$f":"Eleme!H68","v":0},{"$f":"Eleme!I68","v":3},{"$f":"IFERROR(Eleme!F69,0)","v":"ESMA KAMER SÜT (KYS)"},null,22,{"$f":"IFERROR(Ana_Tablo!P37,0)","v":""},{"$f":"IFERROR(Ana_Tablo!R38,0)","v":0},{"$f":"IFERROR(Ana_Tablo!S38,0)","v":0},{"$f":"IFERROR(Ana_Tablo!P39,0)","v":""},null,22,{"$f":"IFERROR('Ana_Tablo(128)'!I32,0)","v":"AYTEN CEREN KAHRAMAN (KYS)"},{"$f":"IFERROR('Ana_Tablo(128)'!K34,0)","v":3},{"$f":"IFERROR('Ana_Tablo(128)'!L34,0)","v":1},{"$f":"IFERROR('Ana_Tablo(128)'!I35,0)","v":"DURU KIRBAÇ (İST)"},null,22,{"$f":"'Ana_Tablo(128_16)'!I32","v":""},{"$f":"IFERROR('Ana_Tablo(128_16)'!K34,0)","v":0},{"$f":"IFERROR('Ana_Tablo(128_16)'!L34,0)","v":0},{"$f":"'Ana_Tablo(128_16)'!I35","v":""}]
[23,{"$f":"IFERROR(On_Eleme!E71,0)","v":0},{"$f":"On_Eleme!F71","v":0},{"$f":"On_Eleme!F72","v":0},{"$f":"IFERROR(On_Eleme!E72,0)","v":0},null,23,{"$f":"IFERROR(Eleme!F70,0)","v":"BERRA AKICI (SKR)"},{"$f":"Eleme!H71","v":3},{"$f":"Eleme!I71","v":0},{"$f":"IFERROR(Eleme!F72,0)","v":"ŞEVVAL CİMBEK (AMS)"},null,23,{"$f":"IFERROR(Ana_Tablo!P53,0)","v":""},{"$f":"IFERROR(Ana_Tablo!R54,0)","v":0},{"$f":"IFERROR(Ana_Tablo!S54,0)","v":0},{"$f":"IFERROR(Ana_Tablo!P55,0)","v":""},null,23,{"$f":"IFERROR('Ana_Tablo(128)'!I38,0)","v":"ZEYNEP ADA ER (ANK)"},{"$f":"IFERROR('Ana_Tablo(128)'!K40,0)","v":2},{"$f":"IFERROR('Ana_Tablo(128)'!L40,0)","v":3},{"$f":"IFERROR('Ana_Tablo(128)'!I41,0)","v":"BUSE KOÇAK (ANK)"},null,23,{"$f":"'Ana_Tablo(128_16)'!I38","v":""},{"$f":"IFERROR('Ana_Tablo(128_16)'!K40,0)","v":0},{"$f":"IFERROR('Ana_Tablo(128_16)'!L40,0)","v":0},{"$f":"'Ana_Tablo(128_16)'!I41","v":""}]
[24,{"$f":"IFERROR(On_Eleme!E74,0)","v":"AYNUR CANGİR (BTM)"},{"$f":"On_Eleme!F74","v":0},{"$f":"On_Eleme!F75","v":0},{"$f":"IFERROR(On_Eleme!E75,0)","v":0},null,24,{"$f":"IFERROR(Eleme!F73,0)","v":"ECEM SUNA KALDIRIM (ANK)"},{"$f":"Eleme!H74","v":0},{"$f":"Eleme!I74","v":3},{"$f":"IFERROR(Eleme!F75,0)","v":"ZEYNEP NAZ EKER (KRL)"},null,24,{"$f":"IFERROR(Ana_Tablo!P57,0)","v":""},{"$f":"IFERROR(Ana_Tablo!R58,0)","v":0},{"$f":"IFERROR(Ana_Tablo!S58,0)","v":0},{"$f":"IFERROR(Ana_Tablo!P59,0)","v":""},null,24,{"$f":"IFERROR('Ana_Tablo(128)'!I44,0)","v":"ELİF BEYZA AKDEMİR (BTM)"},{"$f":"IFERROR('Ana_Tablo(128)'!K46,0)","v":0},{"$f":"IFERROR('Ana_Tablo(128)'!L46,0)","v":3},{"$f":"IFERROR('Ana_Tablo(128)'!I47,0)","v":"GÜLCE DÖNMEZ (KNY)"},null,24,{"$f":"'Ana_Tablo(128_16)'!I44","v":""},{"$f":"IFERROR('Ana_Tablo(128_16)'!K46,0)","v":0},{"$f":"IFERROR('Ana_Tablo(128_16)'!L46,0)","v":0},{"$f":"'Ana_Tablo(128_16)'!I47","v":""}]
[25,{"$f":"IFERROR(On_Eleme!E77,0)","v":"ZEYNEP HÜMA YILMAZ (SMS)"},{"$f":"On_Eleme!F77","v":0},{"$f":"On_Eleme!F78","v":0},{"$f":"IFERROR(On_Eleme!E78,0)","v":0},null,25,{"$f":"IFERROR(Eleme!F76,0)","v":"İPEK ERTUNA (ANK)"},{"$f":"Eleme!H77","v":3},{"$f":"Eleme!I77","v":0},{"$f":"IFERROR(Eleme!F78,0)","v":"RÜYA EMİR (SMS)"},null,25,{"$f":"IFERROR(Ana_Tablo!W7,0)","v":""},{"$f":"IFERROR(Ana_Tablo!AF13,0)","v":0},{"$f":"IFERROR(Ana_Tablo!AG13,0)","v":0},{"$f":"IFERROR(Ana_Tablo!W18,0)","v":""},null,25,{"$f":"IFERROR('Ana_Tablo(128)'!I51,0)","v":"ŞEVVAL ALAŞ (BTM)"},{"$f":"IFERROR('Ana_Tablo(128)'!K52,0)","v":0},{"$f":"IFERROR('Ana_Tablo(128)'!L52,0)","v":3},{"$f":"IFERROR('Ana_Tablo(128)'!I53,0)","v":"CEYLİN AKDANALI (ÇRM)"},null,25,{"$f":"'Ana_Tablo(128_16)'!P4","v":""},{"$f":"IFERROR('Ana_Tablo(128_16)'!R7,0)","v":0},{"$f":"IFERROR('Ana_Tablo(128_16)'!S7,0)","v":0}]
[26,{"$f":"IFERROR(On_Eleme!E80,0)","v":"İDİL TOSUN (ADN)"},{"$f":"On_Eleme!F80","v":0},{"$f":"On_Eleme!F81","v":0},{"$f":"IFERROR(On_Eleme!E81,0)","v":0},null,26,{"$f":"IFERROR(Eleme!F79,0)","v":"ASUDE AKSOY (GZT)"},{"$f":"Eleme!H80","v":0},{"$f":"Eleme!I80","v":3},{"$f":"IFERROR(Eleme!F81,0)","v":"BAHAR GÜL (ZNG)"},null,26,{"$f":"IFERROR(Ana_Tablo!W26,0)","v":""},{"$f":"IFERROR(Ana_Tablo!Y28,0)","v":0},{"$f":"IFERROR(Ana_Tablo!Z28,0)","v":0},{"$f":"IFERROR(Ana_Tablo!W30,0)","v":""},null,26,{"$f":"IFERROR('Ana_Tablo(128)'!I55,0)","v":"NİSA ÜZÜMCÜ (BTM)"},{"$f":"IFERROR('Ana_Tablo(128)'!K56,0)","v":1},{"$f":"IFERROR('Ana_Tablo(128)'!L56,0)","v":3},{"$f":"IFERROR('Ana_Tablo(128)'!I57,0)","v":"DURU ŞENDOĞAN (RİZ)"},null,26,{"$f":"'Ana_Tablo(128_16)'!P16","v":""},{"$f":"IFERROR('Ana_Tablo(128_16)'!R19,0)","v":0},{"$f":"IFERROR('Ana_Tablo(128_16)'!S19,0)","v":0}]
[27,{"$f":"IFERROR(On_Eleme!E83,0)","v":"RÜYA EMİR (SMS)"},{"$f":"On_Eleme!F83","v":0},{"$f":"On_Eleme!F84","v":0},{"$f":"IFERROR(On_Eleme!E84,0)","v":0},null,27,{"$f":"IFERROR(Eleme!F82,0)","v":"DURU BERİL TOK (YLV)"},{"$f":"Eleme!H83","v":3},{"$f":"Eleme!I83","v":1},{"$f":"IFERROR(Eleme!F84,0)","v":"BERİL ECE ÇARKÇI (ORD)"},null,27,{"$f":"IFERROR(Ana_Tablo!W34,0)","v":""},{"$f":"IFERROR(Ana_Tablo!AF36,0)","v":0},{"$f":"IFERROR(Ana_Tablo!AG36,0)","v":0},{"$f":"IFERROR(Ana_Tablo!W38,0)","v":""},null,27,{"$f":"IFERROR('Ana_Tablo(128)'!I59,0)","v":"ELANUR YILMAZ (BRS)"},{"$f":"IFERROR('Ana_Tablo(128)'!K60,0)","v":0},{"$f":"IFERROR('Ana_Tablo(128)'!L60,0)","v":3},{"$f":"IFERROR('Ana_Tablo(128)'!I61,0)","v":"ZEYNEP NAZ EKER (KRL)"},null,27,{"$f":"'Ana_Tablo(128_16)'!P28","v":""},{"$f":"IFERROR('Ana_Tablo(128_16)'!R31,0)","v":0},{"$f":"IFERROR('Ana_Tablo(128_16)'!S31,0)","v":0}]
[28,{"$f":"IFERROR(On_Eleme!E86,0)","v":"RÜMEYSA MAYDA (BRS)"},{"$f":"On_Eleme!F86","v":0},{"$f":"On_Eleme!F87","v":0},{"$f":"IFERROR(On_Eleme!E87,0)","v":0},null,28,{"$f":"IFERROR(Eleme!F85,0)","v":"AYŞE MELİS ÖZER (TKD)"},{"$f":"Eleme!H86","v":0},{"$f":"Eleme!I86","v":3},{"$f":"IFERROR(Eleme!F87,0)","v":"MASAL ERYILMAZ (İST)"},null,28,{"$f":"IFERROR(Ana_Tablo!W44,0)","v":""},{"$f":"IFERROR(Ana_Tablo!Y45,0)","v":0},{"$f":"IFERROR(Ana_Tablo!Z45,0)","v":0},{"$f":"IFERROR(Ana_Tablo!W46,0)","v":""},null,28,{"$f":"IFERROR('Ana_Tablo(128)'!I63,0)","v":"İPEK ERTUNA (ANK)"},{"$f":"IFERROR('Ana_Tablo(128)'!K64,0)","v":3},{"$f":"IFERROR('Ana_Tablo(128)'!L64,0)","v":1},{"$f":"IFERROR('Ana_Tablo(128)'!I65,0)","v":"ZEYNEP DURAN (İST)"},null,28,{"$f":"'Ana_Tablo(128_16)'!P40","v":""},{"$f":"IFERROR('Ana_Tablo(128_16)'!R43,0)","v":0},{"$f":"IFERROR('Ana_Tablo(128_16)'!S43,0)","v":0}]
[29,{"$f":"IFERROR(On_Eleme!E89,0)","v":"FATMANUR DEMİRCİ (KMŞ)"},{"$f":"On_Eleme!F89","v":0},{"$f":"On_Eleme!F90","v":0},{"$f":"IFERROR(On_Eleme!E90,0)","v":0},null,29,{"$f":"IFERROR(Eleme!F88,0)","v":"ZEYNEP DURAN (İST)"},{"$f":"Eleme!H89","v":3},{"$f":"Eleme!I89","v":0},{"$f":"IFERROR(Eleme!F90,0)","v":"ECEM DEMİR (KRL)"},null,29,{"$f":"IFERROR(Ana_Tablo!W48,0)","v":""},{"$f":"IFERROR(Ana_Tablo!Y49,0)","v":0},{"$f":"IFERROR(Ana_Tablo!Z49,0)","v":0},{"$f":"IFERROR(Ana_Tablo!W50,0)","v":""},null,29,{"$f":"IFERROR('Ana_Tablo(128)'!I67,0)","v":"EYLÜL KENANOĞLU (KST)"},{"$f":"IFERROR('Ana_Tablo(128)'!K68,0)","v":0},{"$f":"IFERROR('Ana_Tablo(128)'!L68,0)","v":3},{"$f":"IFERROR('Ana_Tablo(128)'!I69,0)","v":"ELANUR ALAÇAM (AMS)"},null,29,{"$f":"'Ana_Tablo(128_16)'!P51","v":""},{"$f":"IFERROR('Ana_Tablo(128_16)'!R52,0)","v":0},{"$f":"IFERROR('Ana_Tablo(128_16)'!R52,0)","v":0}]
[30,{"$f":"IFERROR(On_Eleme!E92,0)","v":"NAZLISU OKKAN (KRL)"},{"$f":"On_Eleme!F92","v":0},{"$f":"On_Eleme!F93","v":0},{"$f":"IFERROR(On_Eleme!E93,0)","v":0},null,30,{"$f":"IFERROR(Eleme!F91,0)","v":"İLGİ İPEK TUNÇ (ANK)"},{"$f":"Eleme!H92","v":3},{"$f":"Eleme!I92","v":0},{"$f":"IFERROR(Eleme!F93,0)","v":"ÖZGE ARI (KRL)"},null,30,{"$f":"IFERROR(Ana_Tablo!W54,0)","v":""},{"$f":"IFERROR(Ana_Tablo!Y56,0)","v":0},{"$f":"IFERROR(Ana_Tablo!Z56,0)","v":0},{"$f":"IFERROR(Ana_Tablo!W58,0)","v":""},null,30,{"$f":"IFERROR('Ana_Tablo(128)'!I71,0)","v":"IRMAK BÜŞRA UNCU (KST)"},{"$f":"IFERROR('Ana_Tablo(128)'!K72,0)","v":3},{"$f":"IFERROR('Ana_Tablo(128)'!L72,0)","v":0},{"$f":"IFERROR('Ana_Tablo(128)'!I73,0)","v":"NAZLINUR AKGÜN (ANT)"},null,30,{"$f":"'Ana_Tablo(128_16)'!P55","v":""},{"$f":"IFERROR('Ana_Tablo(128_16)'!R56,0)","v":0},{"$f":"IFERROR('Ana_Tablo(128_16)'!R56,0)","v":0}]
[31,{"$f":"IFERROR(On_Eleme!E95,0)","v":"HAZAL ERSOY (AMS)"},{"$f":"On_Eleme!F95","v":0},{"$f":"On_Eleme!F96","v":0},{"$f":"IFERROR(On_Eleme!E96,0)","v":0},null,31,{"$f":"IFERROR(Eleme!F94,0)","v":0},{"$f":"Eleme!H95","v":0},{"$f":"Eleme!I95","v":0},{"$f":"IFERROR(Eleme!F96,0)","v":0},null,31,{"$f":"IFERROR(Ana_Tablo!W60,0)","v":""},{"$f":"IFERROR(Ana_Tablo!Y61,0)","v":0},{"$f":"IFERROR(Ana_Tablo!Z61,0)","v":0},{"$f":"IFERROR(Ana_Tablo!W62,0)","v":""},null,31,{"$f":"IFERROR('Ana_Tablo(128)'!I75,0)","v":"ELVİN KALE (YLV)"},{"$f":"IFERROR('Ana_Tablo(128)'!K76,0)","v":3},{"$f":"IFERROR('Ana_Tablo(128)'!L76,0)","v":0},{"$f":"IFERROR('Ana_Tablo(128)'!I77,0)","v":"DAMLA AVŞAR (VAN)"},null,31,{"$f":"'Ana_Tablo(128_16)'!P59","v":""},{"$f":"IFERROR('Ana_Tablo(128_16)'!R60,0)","v":0},{"$f":"IFERROR('Ana_Tablo(128_16)'!R60,0)","v":0}]
[32,{"$f":"IFERROR(On_Eleme!E98,0)","v":"DEFNE DEMİR (ORD)"},{"$f":"On_Eleme!F98","v":0},{"$f":"On_Eleme!F99","v":0},{"$f":"IFERROR(On_Eleme!E99,0)","v":0},null,32,{"$f":"IFERROR(Eleme!F97,0)","v":0},{"$f":"Eleme!H98","v":0},{"$f":"Eleme!I98","v":3},{"$f":"IFERROR(Eleme!F99,0)","v":"HATİCE ELİF GÜVELİ (İST)"},null,32,{"$f":"IFERROR(Ana_Tablo!AD24,0)","v":""},{"$f":"IFERROR(Ana_Tablo!AF26,0)","v":0},{"$f":"IFERROR(Ana_Tablo!AG26,0)","v":0},{"$f":"IFERROR(Ana_Tablo!AD28,0)","v":""},null,32,{"$f":"IFERROR('Ana_Tablo(128)'!I79,0)","v":"ÖZLEM KÖSEOĞLU (RİZ)"},{"$f":"IFERROR('Ana_Tablo(128)'!K80,0)","v":2},{"$f":"IFERROR('Ana_Tablo(128)'!L80,0)","v":3},{"$f":"IFERROR('Ana_Tablo(128)'!I81,0)","v":"ARMİN AYDIN (İST)"},null,32,{"$f":"'Ana_Tablo(128_16)'!P63","v":""},{"$f":"IFERROR('Ana_Tablo(128_16)'!R64,0)","v":0},{"$f":"IFERROR('Ana_Tablo(128_16)'!R64,0)","v":0}]
[33,{"$f":"IFERROR(On_Eleme!E101,0)","v":0},{"$f":"On_Eleme!F101","v":0},{"$f":"On_Eleme!F102","v":0},{"$f":"IFERROR(On_Eleme!E102,0)","v":0},null,33,{"$f":"IFERROR(Eleme!F100,0)","v":"ELİF ECE AKYÜREK (ADN)"},{"$f":"Eleme!H101","v":3},{"$f":"Eleme!I101","v":0},{"$f":"IFERROR(Eleme!F102,0)","v":0},null,33,{"$f":"IFERROR(Ana_Tablo!AD32,0)","v":""},{"$f":"IFERROR(Ana_Tablo!#REF!,0)","v":0},{"$f":"IFERROR(Ana_Tablo!#REF!,0)","v":0},{"$f":"IFERROR(Ana_Tablo!AD36,0)","v":""},null,33,{"$f":"IFERROR('Ana_Tablo(128)'!P4,0)","v":"NİL BAŞARAN (İST)"},{"$f":"IFERROR('Ana_Tablo(128)'!R7,0)","v":3},{"$f":"IFERROR('Ana_Tablo(128)'!S7,0)","v":0},{"$f":"IFERROR('Ana_Tablo(128)'!P9,0)","v":"ELİZAN BAŞAR (ANK)"},null,33,{"$f":"'Ana_Tablo(128_16)'!W50","v":""},{"$f":"IFERROR('Ana_Tablo(128_16)'!Y51,0)","v":0},{"$f":"IFERROR('Ana_Tablo(128_16)'!Z51,0)","v":0}]
[34,{"$f":"IFERROR(On_Eleme!E104,0)","v":"ECEM SUNA KALDIRIM (ANK)"},{"$f":"On_Eleme!F104","v":0},{"$f":"On_Eleme!F105","v":0},{"$f":"IFERROR(On_Eleme!E105,0)","v":0},null,34,{"$f":"IFERROR(Eleme!F103,0)","v":0},{"$f":"Eleme!H104","v":0},{"$f":"Eleme!I104","v":0},{"$f":"IFERROR(Eleme!F105,0)","v":0},null,34,{"$f":"IFERROR(Ana_Tablo!AD41,0)","v":""},{"$f":"IFERROR(Ana_Tablo!#REF!,0)","v":0},{"$f":"IFERROR(Ana_Tablo!#REF!,0)","v":0},{"$f":"IFERROR(Ana_Tablo!AD43,0)","v":""},null,34,{"$f":"IFERROR('Ana_Tablo(128)'!P16,0)","v":"EYLÜL ŞEVVAL AYDIN (İST)"},{"$f":"IFERROR('Ana_Tablo(128)'!R19,0)","v":1},{"$f":"IFERROR('Ana_Tablo(128)'!S19,0)","v":3},{"$f":"IFERROR('Ana_Tablo(128)'!P21,0)","v":"HATİCE ELİF GÜVELİ (İST)"},null,34,{"$f":"'Ana_Tablo(128_16)'!W54","v":""},{"$f":"IFERROR('Ana_Tablo(128_16)'!Y55,0)","v":0},{"$f":"IFERROR('Ana_Tablo(128_16)'!Z55,0)","v":0},{"$f":"'Ana_Tablo(128_16)'!W56","v":""}]
[35,{"$f":"IFERROR(On_Eleme!E107,0)","v":"MERYEM ECRİN ŞENTÜRK (KCL)"},{"$f":"On_Eleme!F107","v":0},{"$f":"On_Eleme!F108","v":0},{"$f":"IFERROR(On_Eleme!E108,0)","v":0},null,35,{"$f":"IFERROR(Eleme!F106,0)","v":"ESLEM SENA ERCİYAS (ORD)"},{"$f":"Eleme!H107","v":0},{"$f":"Eleme!I107","v":3},{"$f":"IFERROR(Eleme!F108,0)","v":"EYLÜL KENANOĞLU (KST)"},null,35,{"$f":"IFERROR(Ana_Tablo!AD45,0)","v":""},{"$f":"IFERROR(Ana_Tablo!AF47,0)","v":0},{"$f":"IFERROR(Ana_Tablo!AG47,0)","v":0},{"$f":"IFERROR(Ana_Tablo!AD49,0)","v":""},null,35,{"$f":"IFERROR('Ana_Tablo(128)'!P28,0)","v":"ELİF ECE AKYÜREK (ADN)"},{"$f":"IFERROR('Ana_Tablo(128)'!R31,0)","v":3},{"$f":"IFERROR('Ana_Tablo(128)'!S31,0)","v":1},{"$f":"IFERROR('Ana_Tablo(128)'!P33,0)","v":"AYTEN CEREN KAHRAMAN (KYS)"},null,35,{"$f":"'Ana_Tablo(128_16)'!W58","v":""},{"$f":"IFERROR('Ana_Tablo(128_16)'!Y59,0)","v":0},{"$f":"IFERROR('Ana_Tablo(128_16)'!Z59,0)","v":0},{"$f":"'Ana_Tablo(128_16)'!W60","v":""}]
[36,{"$f":"IFERROR(On_Eleme!E110,0)","v":"MİYASE ESLEM ÖZDEN (KNY)"},{"$f":"On_Eleme!F110","v":0},{"$f":"On_Eleme!F111","v":0},{"$f":"IFERROR(On_Eleme!E111,0)","v":0},null,36,{"$f":"IFERROR(Eleme!F109,0)","v":"MİYASE ESLEM ÖZDEN (KNY)"},{"$f":"Eleme!H110","v":1},{"$f":"Eleme!I110","v":2},{"$f":"IFERROR(Eleme!F111,0)","v":"ELİF ÇELİK (MLT)"},null,36,{"$f":"IFERROR(Ana_Tablo!AD51,0)","v":""},{"$f":"IFERROR(Ana_Tablo!AF52,0)","v":0},{"$f":"IFERROR(Ana_Tablo!AG52,0)","v":0},{"$f":"IFERROR(Ana_Tablo!AD53,0)","v":""},null,36,{"$f":"IFERROR('Ana_Tablo(128)'!P40,0)","v":"BUSE KOÇAK (ANK)"},{"$f":"IFERROR('Ana_Tablo(128)'!R43,0)","v":3},{"$f":"IFERROR('Ana_Tablo(128)'!S43,0)","v":0},{"$f":"IFERROR('Ana_Tablo(128)'!P45,0)","v":"GÜLCE DÖNMEZ (KNY)"},null,36,{"$f":"'Ana_Tablo(128_16)'!W62","v":""},{"$f":"IFERROR('Ana_Tablo(128_16)'!Y63,0)","v":0},{"$f":"IFERROR('Ana_Tablo(128_16)'!Z63,0)","v":0},{"$f":"'Ana_Tablo(128_16)'!W64","v":""}]
[37,{"$f":"IFERROR(On_Eleme!E113,0)","v":"ELİF KABAAHMETOĞLU (KST)"},{"$f":"On_Eleme!F113","v":0},{"$f":"On_Eleme!F114","v":0},{"$f":"IFERROR(On_Eleme!E114,0)","v":0},null,37,{"$f":"IFERROR(Eleme!F112,0)","v":"NAZLI ŞAHAN (ÇRM)"},{"$f":"Eleme!H113","v":3},{"$f":"Eleme!I113","v":0},{"$f":"IFERROR(Eleme!F114,0)","v":"RÜMEYSA MAYDA (BRS)"},null,37,{"$f":"IFERROR(Ana_Tablo!AK26,0)","v":""},{"$f":"IFERROR(Ana_Tablo!AM30,0)","v":0},{"$f":"IFERROR(Ana_Tablo!AN30,0)","v":0},{"$f":"IFERROR(Ana_Tablo!AK34,0)","v":""},null,37,{"$f":"IFERROR('Ana_Tablo(128)'!P50,0)","v":"ELİF BEYZA AKDEMİR (BTM)"},{"$f":"IFERROR('Ana_Tablo(128)'!R51,0)","v":0},{"$f":"IFERROR('Ana_Tablo(128)'!S51,0)","v":3},{"$f":"IFERROR('Ana_Tablo(128)'!P52,0)","v":"CEYLİN AKDANALI (ÇRM)"},null,37,{"$f":"'Ana_Tablo(128_16)'!W78","v":""},{"$f":"IFERROR('Ana_Tablo(128_16)'!Y79,0)","v":0},{"$f":"IFERROR('Ana_Tablo(128_16)'!Z79,0)","v":0},{"$f":"'Ana_Tablo(128_16)'!W80","v":""}]
[38,{"$f":"IFERROR(On_Eleme!E116,0)","v":"TUANA GÜLER (KRL)"},{"$f":"On_Eleme!F116","v":0},{"$f":"On_Eleme!F117","v":0},{"$f":"IFERROR(On_Eleme!E117,0)","v":0},null,38,{"$f":"IFERROR(Eleme!F115,0)","v":"CEREN KOÇAK (KYS)"},{"$f":"Eleme!H116","v":0},{"$f":"Eleme!I116","v":3},{"$f":"IFERROR(Eleme!F117,0)","v":"ESMA SULTAN SARI (SKR)"},null,38,{"$f":"IFERROR(Ana_Tablo!AK37,0)","v":""},{"$f":"IFERROR(Ana_Tablo!AM38,0)","v":0},{"$f":"IFERROR(Ana_Tablo!AN38,0)","v":0},{"$f":"IFERROR(Ana_Tablo!AK39,0)","v":""},null,38,{"$f":"IFERROR('Ana_Tablo(128)'!P54,0)","v":"ZEYNEP ADA ER (ANK)"},{"$f":"IFERROR('Ana_Tablo(128)'!R55,0)","v":2},{"$f":"IFERROR('Ana_Tablo(128)'!S55,0)","v":3},{"$f":"IFERROR('Ana_Tablo(128)'!P56,0)","v":"DURU ŞENDOĞAN (RİZ)"},null,38,{"$f":"'Ana_Tablo(128_16)'!W82","v":""},{"$f":"IFERROR('Ana_Tablo(128_16)'!Y83,0)","v":0},{"$f":"IFERROR('Ana_Tablo(128_16)'!Z83,0)","v":0},{"$f":"'Ana_Tablo(128_16)'!W84","v":""}]
[39,{"$f":"IFERROR(On_Eleme!E119,0)","v":"KÜBRA YERLİKAYA (AMS)"},{"$f":"On_Eleme!F119","v":0},{"$f":"On_Eleme!F120","v":0},{"$f":"IFERROR(On_Eleme!E120,0)","v":0},null,39,{"$f":"IFERROR(Eleme!F118,0)","v":"ESMA ÇUKUR (RİZ)"},{"$f":"Eleme!H119","v":0},{"$f":"Eleme!I119","v":3},{"$f":"IFERROR(Eleme!F120,0)","v":"ELANUR ALAÇAM (AMS)"},null,39,{"$f":"IFERROR(Ana_Tablo!AR20,0)","v":""},{"$f":"IFERROR(Ana_Tablo!AT25,0)","v":0},{"$f":"IFERROR(Ana_Tablo!AU25,0)","v":0},{"$f":"IFERROR(Ana_Tablo!AR30,0)","v":""},null,39,{"$f":"IFERROR('Ana_Tablo(128)'!P58,0)","v":"DURU KIRBAÇ (İST)"},{"$f":"IFERROR('Ana_Tablo(128)'!R59,0)","v":3},{"$f":"IFERROR('Ana_Tablo(128)'!S59,0)","v":1},{"$f":"IFERROR('Ana_Tablo(128)'!P60,0)","v":"ZEYNEP NAZ EKER (KRL)"},null,39,{"$f":"'Ana_Tablo(128_16)'!AD7","v":""},{"$f":"IFERROR('Ana_Tablo(128_16)'!AF13,0)","v":0},{"$f":"IFERROR('Ana_Tablo(128_16)'!AG13,0)","v":0},{"$f":"'Ana_Tablo(128_16)'!AD18","v":""}]
[40,{"$f":"IFERROR(On_Eleme!E122,0)","v":"ECEM DEMİR (KRL)"},{"$f":"On_Eleme!F122","v":0},{"$f":"On_Eleme!F123","v":0},{"$f":"IFERROR(On_Eleme!E123,0)","v":0},null,40,{"$f":"IFERROR(Eleme!F121,0)","v":"HAZAL ERSOY (AMS)"},{"$f":"Eleme!H122","v":0},{"$f":"Eleme!I122","v":3},{"$f":"IFERROR(Eleme!F123,0)","v":"NEHİR DUYURAN (ANK)"},null,40,{"$f":"IFERROR(Ana_Tablo!AY13,0)","v":""},{"$f":"IFERROR(Ana_Tablo!BA25,0)","v":0},{"$f":"IFERROR(Ana_Tablo!BB25,0)","v":0},{"$f":"IFERROR(Ana_Tablo!AY25,0)","v":""},null,40,{"$f":"IFERROR('Ana_Tablo(128)'!P62,0)","v":"ESMA SULTAN SARI (SKR)"},{"$f":"IFERROR('Ana_Tablo(128)'!R63,0)","v":2},{"$f":"IFERROR('Ana_Tablo(128)'!S63,0)","v":3},{"$f":"IFERROR('Ana_Tablo(128)'!P64,0)","v":"İPEK ERTUNA (ANK)"},null,40,{"$f":"'Ana_Tablo(128_16)'!AD32","v":""},{"$f":"IFERROR('Ana_Tablo(128_16)'!AF38,0)","v":0},{"$f":"IFERROR('Ana_Tablo(128_16)'!AG38,0)","v":0},{"$f":"'Ana_Tablo(128_16)'!AD43","v":""}]
[41,{"$f":"IFERROR(On_Eleme!E125,0)","v":"ELİF DURU BECER (ÇRM)"},{"$f":"On_Eleme!F125","v":0},{"$f":"On_Eleme!F126","v":0},{"$f":"IFERROR(On_Eleme!E126,0)","v":0},null,41,{"$f":"IFERROR(Eleme!F124,0)","v":"AYTEN CEREN KAHRAMAN (KYS)"},{"$f":"Eleme!H125","v":3},{"$f":"Eleme!I125","v":1},{"$f":"IFERROR(Eleme!F126,0)","v":"NEHİR GÖHER SALTÜRK (BRS)"},null,null,null,null,null,null,null,41,{"$f":"IFERROR('Ana_Tablo(128)'!P66,0)","v":"MASAL ERYILMAZ (İST)"},{"$f":"IFERROR('Ana_Tablo(128)'!R67,0)","v":3},{"$f":"IFERROR('Ana_Tablo(128)'!S67,0)","v":0},{"$f":"IFERROR('Ana_Tablo(128)'!P68,0)","v":"ELANUR ALAÇAM (AMS)"},null,41,{"$f":"'Ana_Tablo(128_16)'!AD51","v":""},{"$f":"IFERROR('Ana_Tablo(128_16)'!AF53,0)","v":0},{"$f":"IFERROR('Ana_Tablo(128_16)'!AG53,0)","v":0},{"$f":"'Ana_Tablo(128_16)'!AD55","v":""}]
[42,{"$f":"IFERROR(On_Eleme!E128,0)","v":"EBRAR NİSA TORU (AMS)"},{"$f":"On_Eleme!F128","v":0},{"$f":"On_Eleme!F129","v":0},{"$f":"IFERROR(On_Eleme!E129,0)","v":0},null,42,{"$f":"IFERROR(Eleme!F127,0)","v":"NİSANUR AYTEN (VAN)"},{"$f":"Eleme!H128","v":0},{"$f":"Eleme!I128","v":3},{"$f":"IFERROR(Eleme!F129,0)","v":"ELANUR DEMİR (İST)"},null,null,null,null,null,null,null,42,{"$f":"IFERROR('Ana_Tablo(128)'!P70,0)","v":"DİLAY BALABAN (RİZ)"},{"$f":"IFERROR('Ana_Tablo(128)'!R71,0)","v":1},{"$f":"IFERROR('Ana_Tablo(128)'!S71,0)","v":3},{"$f":"IFERROR('Ana_Tablo(128)'!P72,0)","v":"IRMAK BÜŞRA UNCU (KST)"},null,42,{"$f":"'Ana_Tablo(128_16)'!AD59","v":""},{"$f":"IFERROR('Ana_Tablo(128_16)'!AF61,0)","v":0},{"$f":"IFERROR('Ana_Tablo(128_16)'!AG61,0)","v":0},{"$f":"'Ana_Tablo(128_16)'!AD63","v":""}]
[43,{"$f":"IFERROR(On_Eleme!E131,0)","v":"EDA TUNA (ANT)"},{"$f":"On_Eleme!F131","v":0},{"$f":"On_Eleme!F132","v":0},{"$f":"IFERROR(On_Eleme!E132,0)","v":0},null,43,{"$f":"IFERROR(Eleme!F130,0)","v":"BERRA BAHTİYAR (SKR)"},{"$f":"Eleme!H131","v":3},{"$f":"Eleme!I131","v":0},{"$f":"IFERROR(Eleme!F132,0)","v":"NİSA GÜN (AMS)"},null,null,null,null,null,null,null,43,{"$f":"IFERROR('Ana_Tablo(128)'!P74,0)","v":"ESİLA SU YALÇIN (SKR)"},{"$f":"IFERROR('Ana_Tablo(128)'!R75,0)","v":0},{"$f":"IFERROR('Ana_Tablo(128)'!S75,0)","v":3},{"$f":"IFERROR('Ana_Tablo(128)'!P76,0)","v":"ELVİN KALE (YLV)"},null,43,{"$f":"'Ana_Tablo(128_16)'!AD69","v":""},{"$f":"IFERROR('Ana_Tablo(128_16)'!AF70,0)","v":0},{"$f":"IFERROR('Ana_Tablo(128_16)'!AG70,0)","v":0},{"$f":"'Ana_Tablo(128_16)'!AD71","v":""}]
[44,{"$f":"IFERROR(On_Eleme!E134,0)","v":"AYSEL SENA GÜN (AMS)"},{"$f":"On_Eleme!F134","v":0},{"$f":"On_Eleme!F135","v":0},{"$f":"IFERROR(On_Eleme!E135,0)","v":0},null,44,{"$f":"IFERROR(Eleme!F133,0)","v":"EBRAR NİSA TORU (AMS)"},{"$f":"Eleme!H134","v":0},{"$f":"Eleme!I134","v":3},{"$f":"IFERROR(Eleme!F135,0)","v":"IRMAK BÜŞRA UNCU (KST)"},null,null,null,null,null,null,null,44,{"$f":"IFERROR('Ana_Tablo(128)'!P78,0)","v":"ELA SU YÖNTER (ANK)"},{"$f":"IFERROR('Ana_Tablo(128)'!R79,0)","v":3},{"$f":"IFERROR('Ana_Tablo(128)'!S79,0)","v":2},{"$f":"IFERROR('Ana_Tablo(128)'!P80,0)","v":"ARMİN AYDIN (İST)"},null,44,{"$f":"'Ana_Tablo(128_16)'!AD73","v":""},{"$f":"IFERROR('Ana_Tablo(128_16)'!AF74,0)","v":0},{"$f":"IFERROR('Ana_Tablo(128_16)'!AG74,0)","v":0},{"$f":"'Ana_Tablo(128_16)'!AD75","v":""}]
[45,{"$f":"IFERROR(On_Eleme!E137,0)","v":"MEDİNE İREM TÜRKAN (BTM)"},{"$f":"On_Eleme!F137","v":0},{"$f":"On_Eleme!F138","v":0},{"$f":"IFERROR(On_Eleme!E138,0)","v":0},null,45,{"$f":"IFERROR(Eleme!F136,0)","v":"ECEMSU ÇİÇEK (İZM)"},{"$f":"Eleme!H137","v":3},{"$f":"Eleme!I137","v":1},{"$f":"IFERROR(Eleme!F138,0)","v":"ELİF DURU BECER (ÇRM)"},null,null,null,null,null,null,null,45,{"$f":"IFERROR('Ana_Tablo(128)'!W51,0)","v":"CEYLİN AKDANALI (ÇRM)"},{"$f":"IFERROR('Ana_Tablo(128)'!Z53,0)","v":0},{"$f":"IFERROR('Ana_Tablo(128)'!AA53,0)","v":3},{"$f":"IFERROR('Ana_Tablo(128)'!W55,0)","v":"DURU ŞENDOĞAN (RİZ)"},null,45,{"$f":"'Ana_Tablo(128_16)'!AD79","v":""},{"$f":"IFERROR('Ana_Tablo(128_16)'!AF81,0)","v":0},{"$f":"IFERROR('Ana_Tablo(128_16)'!AG81,0)","v":0},{"$f":"'Ana_Tablo(128_16)'!AD83","v":""}]
[46,{"$f":"IFERROR(On_Eleme!E140,0)","v":"AYŞE MELİS ÖZER (TKD)"},{"$f":"On_Eleme!F140","v":0},{"$f":"On_Eleme!F141","v":0},{"$f":"IFERROR(On_Eleme!E141,0)","v":0},null,46,{"$f":"IFERROR(Eleme!F139,0)","v":"ZEYNEB KOÇ (ZNG)"},{"$f":"Eleme!H140","v":0},{"$f":"Eleme!I140","v":3},{"$f":"IFERROR(Eleme!F141,0)","v":"NAZLINUR AKGÜN (ANT)"},null,null,null,null,null,null,null,46,{"$f":"IFERROR('Ana_Tablo(128)'!W59,0)","v":"DURU KIRBAÇ (İST)"},{"$f":"IFERROR('Ana_Tablo(128)'!Z61,0)","v":3},{"$f":"IFERROR('Ana_Tablo(128)'!AA61,0)","v":1},{"$f":"IFERROR('Ana_Tablo(128)'!W63,0)","v":"İPEK ERTUNA (ANK)"},null,46,{"$f":"'Ana_Tablo(128_16)'!AD85","v":""},{"$f":"IFERROR('Ana_Tablo(128_16)'!AF86,0)","v":0},{"$f":"IFERROR('Ana_Tablo(128_16)'!AG86,0)","v":0},{"$f":"'Ana_Tablo(128_16)'!AD87","v":""}]
[47,{"$f":"IFERROR(On_Eleme!E143,0)","v":0},{"$f":"On_Eleme!F143","v":0},{"$f":"On_Eleme!F144","v":0},{"$f":"IFERROR(On_Eleme!E144,0)","v":0},null,47,{"$f":"IFERROR(Eleme!F142,0)","v":0},{"$f":"Eleme!H143","v":0},{"$f":"Eleme!I143","v":0},{"$f":"IFERROR(Eleme!F144,0)","v":0},null,null,null,null,null,null,null,47,{"$f":"IFERROR('Ana_Tablo(128)'!W67,0)","v":"MASAL ERYILMAZ (İST)"},{"$f":"IFERROR('Ana_Tablo(128)'!Z69,0)","v":3},{"$f":"IFERROR('Ana_Tablo(128)'!AA69,0)","v":2},{"$f":"IFERROR('Ana_Tablo(128)'!W71,0)","v":"IRMAK BÜŞRA UNCU (KST)"},null,47,{"$f":"'Ana_Tablo(128_16)'!AK49","v":""},{"$f":"IFERROR('Ana_Tablo(128_16)'!AM51,0)","v":0},{"$f":"IFERROR('Ana_Tablo(128_16)'!AN51,0)","v":0},{"$f":"'Ana_Tablo(128_16)'!AK53","v":""}]
[48,{"$f":"IFERROR(On_Eleme!E146,0)","v":"NEHİR GÖHER SALTÜRK (BRS)"},{"$f":"On_Eleme!F146","v":0},{"$f":"On_Eleme!F147","v":0},{"$f":"IFERROR(On_Eleme!E147,0)","v":0},null,48,{"$f":"IFERROR(Eleme!F145,0)","v":0},{"$f":"Eleme!H146","v":0},{"$f":"Eleme!I146","v":3},{"$f":"IFERROR(Eleme!F147,0)","v":"DURU KIRBAÇ (İST)"},null,null,null,null,null,null,null,48,{"$f":"IFERROR('Ana_Tablo(128)'!W75,0)","v":"ELVİN KALE (YLV)"},{"$f":"IFERROR('Ana_Tablo(128)'!Z77,0)","v":3},{"$f":"IFERROR('Ana_Tablo(128)'!AA77,0)","v":2},{"$f":"IFERROR('Ana_Tablo(128)'!W79,0)","v":"ELA SU YÖNTER (ANK)"},null,48,{"$f":"'Ana_Tablo(128_16)'!AK57","v":""},{"$f":"IFERROR('Ana_Tablo(128_16)'!AM59,0)","v":0},{"$f":"IFERROR('Ana_Tablo(128_16)'!AN59,0)","v":0},{"$f":"'Ana_Tablo(128_16)'!AK61","v":""}]
[49,{"$f":"IFERROR(On_Eleme!E149,0)","v":"ŞEVVAL ALAŞ (BTM)"},{"$f":"On_Eleme!F149","v":0},{"$f":"On_Eleme!F150","v":0},{"$f":"IFERROR(On_Eleme!E150,0)","v":0},null,49,{"$f":"IFERROR(Eleme!F148,0)","v":"ZEYNEP ADA ER (ANK)"},{"$f":"Eleme!H149","v":3},{"$f":"Eleme!I149","v":0},{"$f":"IFERROR(Eleme!F150,0)","v":0},null,null,null,null,null,null,null,49,{"$f":"IFERROR('Ana_Tablo(128)'!AD7,0)","v":"NİL BAŞARAN (İST)"},{"$f":"IFERROR('Ana_Tablo(128)'!AF13,0)","v":3},{"$f":"IFERROR('Ana_Tablo(128)'!AG13,0)","v":0},{"$f":"IFERROR('Ana_Tablo(128)'!AD18,0)","v":"HATİCE ELİF GÜVELİ (İST)"},null,49,{"$f":"'Ana_Tablo(128_16)'!AK66","v":""},{"$f":"IFERROR('Ana_Tablo(128_16)'!AM67,0)","v":0},{"$f":"IFERROR('Ana_Tablo(128_16)'!AN67,0)","v":0},{"$f":"'Ana_Tablo(128_16)'!AK68","v":""}]
[50,{"$f":"IFERROR(On_Eleme!E152,0)","v":0},{"$f":"On_Eleme!F152","v":0},{"$f":"On_Eleme!F153","v":0},{"$f":"IFERROR(On_Eleme!E153,0)","v":0},null,50,{"$f":"IFERROR(Eleme!F151,0)","v":0},{"$f":"Eleme!H152","v":0},{"$f":"Eleme!I152","v":0},{"$f":"IFERROR(Eleme!F153,0)","v":0},null,null,null,null,null,null,null,50,{"$f":"IFERROR('Ana_Tablo(128)'!AD32,0)","v":"ELİF ECE AKYÜREK (ADN)"},{"$f":"IFERROR('Ana_Tablo(128)'!AF38,0)","v":3},{"$f":"IFERROR('Ana_Tablo(128)'!AG38,0)","v":1},{"$f":"IFERROR('Ana_Tablo(128)'!AD43,0)","v":"BUSE KOÇAK (ANK)"},null,50,{"$f":"'Ana_Tablo(128_16)'!AK70","v":""},{"$f":"IFERROR('Ana_Tablo(128_16)'!AM72,0)","v":0},{"$f":"IFERROR('Ana_Tablo(128_16)'!AN72,0)","v":0},{"$f":"'Ana_Tablo(128_16)'!AK74","v":""}]
[51,{"$f":"IFERROR(On_Eleme!E155,0)","v":"ESMA ÇUKUR (RİZ)"},{"$f":"On_Eleme!F155","v":0},{"$f":"On_Eleme!F156","v":0},{"$f":"IFERROR(On_Eleme!E156,0)","v":0},null,51,{"$f":"IFERROR(Eleme!F154,0)","v":"HİLAL ECEM MUSLU (ZNG)"},{"$f":"Eleme!H155","v":0},{"$f":"Eleme!I155","v":3},{"$f":"IFERROR(Eleme!F156,0)","v":"ASLINUR USLU (BRS)"},null,null,null,null,null,null,null,51,{"$f":"IFERROR('Ana_Tablo(128)'!AD49,0)","v":"ELİZAN BAŞAR (ANK)"},{"$f":"IFERROR('Ana_Tablo(128)'!AF51,0)","v":0},{"$f":"IFERROR('Ana_Tablo(128)'!AG51,0)","v":3},{"$f":"IFERROR('Ana_Tablo(128)'!AD53,0)","v":"DURU ŞENDOĞAN (RİZ)"},null,51,{"$f":"'Ana_Tablo(128_16)'!AK76","v":""},{"$f":"IFERROR('Ana_Tablo(128_16)'!AM77,0)","v":0},{"$f":"IFERROR('Ana_Tablo(128_16)'!AN77,0)","v":0},{"$f":"'Ana_Tablo(128_16)'!AK78","v":""}]
[52,{"$f":"IFERROR(On_Eleme!E158,0)","v":"ELANUR YILMAZ (BRS)"},{"$f":"On_Eleme!F158","v":0},{"$f":"On_Eleme!F159","v":0},{"$f":"IFERROR(On_Eleme!E159,0)","v":0},null,52,{"$f":"IFERROR(Eleme!F157,0)","v":"ZEYNEP HÜMA YILMAZ (SMS)"},{"$f":"Eleme!H158","v":0},{"$f":"Eleme!I158","v":3},{"$f":"IFERROR(Eleme!F159,0)","v":"ELVİN KALE (YLV)"},null,null,null,null,null,null,null,52,{"$f":"IFERROR('Ana_Tablo(128)'!AD57,0)","v":"EYLÜL ŞEVVAL AYDIN (İST)"},{"$f":"IFERROR('Ana_Tablo(128)'!AF59,0)","v":0},{"$f":"IFERROR('Ana_Tablo(128)'!AG59,0)","v":3},{"$f":"IFERROR('Ana_Tablo(128)'!AD61,0)","v":"DURU KIRBAÇ (İST)"},null,52,{"$f":"'Ana_Tablo(128_16)'!AR51","v":""},{"$f":"IFERROR('Ana_Tablo(128_16)'!AT55,0)","v":0},{"$f":"IFERROR('Ana_Tablo(128_16)'!AU55,0)","v":0},{"$f":"'Ana_Tablo(128_16)'!AR59","v":""}]
[53,{"$f":"IFERROR(On_Eleme!E161,0)","v":"ESLEM SENA ERCİYAS (ORD)"},{"$f":"On_Eleme!F161","v":0},{"$f":"On_Eleme!F162","v":0},{"$f":"IFERROR(On_Eleme!E162,0)","v":0},null,53,{"$f":"IFERROR(Eleme!F160,0)","v":"DAMLA AVŞAR (VAN)"},{"$f":"Eleme!H161","v":3},{"$f":"Eleme!I161","v":0},{"$f":"IFERROR(Eleme!F162,0)","v":"AYSEL SENA GÜN (AMS)"},null,null,null,null,null,null,null,53,{"$f":"IFERROR('Ana_Tablo(128)'!AD65,0)","v":"AYTEN CEREN KAHRAMAN (KYS)"},{"$f":"IFERROR('Ana_Tablo(128)'!AF67,0)","v":3},{"$f":"IFERROR('Ana_Tablo(128)'!AG67,0)","v":0},{"$f":"IFERROR('Ana_Tablo(128)'!AD69,0)","v":"MASAL ERYILMAZ (İST)"},null,53,{"$f":"'Ana_Tablo(128_16)'!AR62","v":""},{"$f":"IFERROR('Ana_Tablo(128_16)'!AT63,0)","v":0},{"$f":"IFERROR('Ana_Tablo(128_16)'!AU63,0)","v":0},{"$f":"'Ana_Tablo(128_16)'!AR64","v":""}]
[54,{"$f":"IFERROR(On_Eleme!E164,0)","v":"ESMA KAMER SÜT (KYS)"},{"$f":"On_Eleme!F164","v":0},{"$f":"On_Eleme!F165","v":0},{"$f":"IFERROR(On_Eleme!E165,0)","v":0},null,54,{"$f":"IFERROR(Eleme!F163,0)","v":"BUSE NUR ÖNDER (BTM)"},{"$f":"Eleme!H164","v":3},{"$f":"Eleme!I164","v":0},{"$f":"IFERROR(Eleme!F165,0)","v":"ECRİN FİDAN (BRS)"},null,null,null,null,null,null,null,54,{"$f":"IFERROR('Ana_Tablo(128)'!AD73,0)","v":"GÜLCE DÖNMEZ (KNY)"},{"$f":"IFERROR('Ana_Tablo(128)'!AF75,0)","v":3},{"$f":"IFERROR('Ana_Tablo(128)'!AG75,0)","v":1},{"$f":"IFERROR('Ana_Tablo(128)'!AD77,0)","v":"ELVİN KALE (YLV)"},null,54,{"$f":"'Ana_Tablo(128_16)'!AY13","v":""},{"$f":"IFERROR('Ana_Tablo(128_16)'!BA25,0)","v":0},{"$f":"IFERROR('Ana_Tablo(128_16)'!BB25,0)","v":0},{"$f":"'Ana_Tablo(128_16)'!AY38","v":""}]
[55,{"$f":"IFERROR(On_Eleme!E167,0)","v":"KAREN GÜRBÜZ (ADN)"},{"$f":"On_Eleme!F167","v":0},{"$f":"On_Eleme!F168","v":0},{"$f":"IFERROR(On_Eleme!E168,0)","v":0},null,55,{"$f":"IFERROR(Eleme!F166,0)","v":"NEVA NUR KALKAN (AMS)"},{"$f":"Eleme!H167","v":3},{"$f":"Eleme!I167","v":0},{"$f":"IFERROR(Eleme!F168,0)","v":"BAHAR TUNÇOK (ANK)"},null,null,null,null,null,null,null,55,{"$f":"IFERROR('Ana_Tablo(128)'!AD89,0)","v":"CEYLİN AKDANALI (ÇRM)"},{"$f":"IFERROR('Ana_Tablo(128)'!AF90,0)","v":3},{"$f":"IFERROR('Ana_Tablo(128)'!AG90,0)","v":0},{"$f":"IFERROR('Ana_Tablo(128)'!AD91,0)","v":"İPEK ERTUNA (ANK)"},null,55,{"$f":"'Ana_Tablo(128_16)'!AY48","v":""},{"$f":"IFERROR('Ana_Tablo(128_16)'!BA52,0)","v":0},{"$f":"IFERROR('Ana_Tablo(128_16)'!BB52,0)","v":0},{"$f":"'Ana_Tablo(128_16)'!AY55","v":""}]
[56,{"$f":"IFERROR(On_Eleme!E170,0)","v":"MİRAÇ DENİZ AKAR (TKD)"},{"$f":"On_Eleme!F170","v":0},{"$f":"On_Eleme!F171","v":0},{"$f":"IFERROR(On_Eleme!E171,0)","v":0},null,56,{"$f":"IFERROR(Eleme!F169,0)","v":"EDA TUNA (ANT)"},{"$f":"Eleme!H170","v":0},{"$f":"Eleme!I170","v":3},{"$f":"IFERROR(Eleme!F171,0)","v":"BUSE KOÇAK (ANK)"},null,null,null,null,null,null,null,56,{"$f":"IFERROR('Ana_Tablo(128)'!AD92,0)","v":"IRMAK BÜŞRA UNCU (KST)"},{"$f":"IFERROR('Ana_Tablo(128)'!AF93,0)","v":0},{"$f":"IFERROR('Ana_Tablo(128)'!AG93,0)","v":3},{"$f":"IFERROR('Ana_Tablo(128)'!AD94,0)","v":"ELA SU YÖNTER (ANK)"},null,56,{"$f":"'Ana_Tablo(128_16)'!BF25","v":""},{"$f":"IFERROR('Ana_Tablo(128_16)'!BH38,0)","v":0},{"$f":"IFERROR('Ana_Tablo(128_16)'!BI38,0)","v":0},{"$f":"'Ana_Tablo(128_16)'!BF51","v":""}]
[57,{"$f":"IFERROR(On_Eleme!E173,0)","v":"NAZLINUR AKGÜN (ANT)"},{"$f":"On_Eleme!F173","v":0},{"$f":"On_Eleme!F174","v":0},{"$f":"IFERROR(On_Eleme!E174,0)","v":0},null,57,{"$f":"IFERROR(Eleme!F172,0)","v":"ÖZLEM KÖSEOĞLU (RİZ)"},{"$f":"Eleme!H173","v":3},{"$f":"Eleme!I173","v":0},{"$f":"IFERROR(Eleme!F174,0)","v":"DEFNE DEMİR (ORD)"},null,null,null,null,null,null,null,57,{"$f":"IFERROR('Ana_Tablo(128)'!AK51,0)","v":"DURU ŞENDOĞAN (RİZ)"},{"$f":"IFERROR('Ana_Tablo(128)'!AM56,0)","v":0},{"$f":"IFERROR('Ana_Tablo(128)'!AN56,0)","v":3},{"$f":"IFERROR('Ana_Tablo(128)'!AK59,0)","v":"DURU KIRBAÇ (İST)"}]
[58,{"$f":"IFERROR(On_Eleme!E176,0)","v":"BERRA BAHTİYAR (SKR)"},{"$f":"On_Eleme!F176","v":0},{"$f":"On_Eleme!F177","v":0},{"$f":"IFERROR(On_Eleme!E177,0)","v":0},null,58,{"$f":"IFERROR(Eleme!F175,0)","v":0},{"$f":"Eleme!H176","v":0},{"$f":"Eleme!I176","v":0},{"$f":"IFERROR(Eleme!F177,0)","v":0},null,null,null,null,null,null,null,58,{"$f":"IFERROR('Ana_Tablo(128)'!AK67,0)","v":"AYTEN CEREN KAHRAMAN (KYS)"},{"$f":"IFERROR('Ana_Tablo(128)'!AM72,0)","v":0},{"$f":"IFERROR('Ana_Tablo(128)'!AN72,0)","v":3},{"$f":"IFERROR('Ana_Tablo(128)'!AK75,0)","v":"GÜLCE DÖNMEZ (KNY)"}]
[59,{"$f":"IFERROR(On_Eleme!E179,0)","v":"BERRA AKICI (SKR)"},{"$f":"On_Eleme!F179","v":0},{"$f":"On_Eleme!F180","v":0},{"$f":"IFERROR(On_Eleme!E180,0)","v":0},null,59,{"$f":"IFERROR(Eleme!F178,0)","v":"ELİF BEYZA AKDEMİR (BTM)"},{"$f":"Eleme!H179","v":3},{"$f":"Eleme!I179","v":0},{"$f":"IFERROR(Eleme!F180,0)","v":0},null,null,null,null,null,null,null,59,{"$f":"IFERROR('Ana_Tablo(128)'!AK81,0)","v":"ELİZAN BAŞAR (ANK)"},{"$f":"IFERROR('Ana_Tablo(128)'!AM82,0)","v":3},{"$f":"IFERROR('Ana_Tablo(128)'!AN82,0)","v":2},{"$f":"IFERROR('Ana_Tablo(128)'!AK83,0)","v":"EYLÜL ŞEVVAL AYDIN (İST)"}]
[60,{"$f":"IFERROR(On_Eleme!E182,0)","v":"HİLAL ECEM MUSLU (ZNG)"},{"$f":"On_Eleme!F182","v":0},{"$f":"On_Eleme!F183","v":0},{"$f":"IFERROR(On_Eleme!E183,0)","v":0},null,60,{"$f":"IFERROR(Eleme!F181,0)","v":0},{"$f":"Eleme!H182","v":0},{"$f":"Eleme!I182","v":3},{"$f":"IFERROR(Eleme!F183,0)","v":"MERVE MENGENE (RİZ)"},null,null,null,null,null,null,null,60,{"$f":"IFERROR('Ana_Tablo(128)'!AK84,0)","v":"MASAL ERYILMAZ (İST)"},{"$f":"IFERROR('Ana_Tablo(128)'!AM85,0)","v":1},{"$f":"IFERROR('Ana_Tablo(128)'!AN85,0)","v":3},{"$f":"IFERROR('Ana_Tablo(128)'!AK86,0)","v":"ELVİN KALE (YLV)"}]
[61,{"$f":"IFERROR(On_Eleme!E185,0)","v":"ESMA SULTAN SARI (SKR)"},{"$f":"On_Eleme!F185","v":0},{"$f":"On_Eleme!F186","v":0},{"$f":"IFERROR(On_Eleme!E186,0)","v":0},null,61,{"$f":"IFERROR(Eleme!F184,0)","v":"ARMİN AYDIN (İST)"},{"$f":"Eleme!H185","v":3},{"$f":"Eleme!I185","v":0},{"$f":"IFERROR(Eleme!F186,0)","v":0},null,null,null,null,null,null,null,61,{"$f":"IFERROR('Ana_Tablo(128)'!AK90,0)","v":"CEYLİN AKDANALI (ÇRM)"},{"$f":"IFERROR('Ana_Tablo(128)'!AM92,0)","v":0},{"$f":"IFERROR('Ana_Tablo(128)'!AN92,0)","v":3},{"$f":"IFERROR('Ana_Tablo(128)'!AK93,0)","v":"ELA SU YÖNTER (ANK)"}]
[62,{"$f":"IFERROR(On_Eleme!E188,0)","v":"ECRİN FİDAN (BRS)"},{"$f":"On_Eleme!F188","v":0},{"$f":"On_Eleme!F189","v":0},{"$f":"IFERROR(On_Eleme!E189,0)","v":0},null,62,{"$f":"IFERROR(Eleme!F187,0)","v":0},{"$f":"Eleme!H188","v":0},{"$f":"Eleme!I188","v":0},{"$f":"IFERROR(Eleme!F189,0)","v":0},null,null,null,null,null,null,null,62,{"$f":"IFERROR('Ana_Tablo(128)'!AK95,0)","v":"İPEK ERTUNA (ANK)"},{"$f":"IFERROR('Ana_Tablo(128)'!AM96,0)","v":1},{"$f":"IFERROR('Ana_Tablo(128)'!AN96,0)","v":3},{"$f":"IFERROR('Ana_Tablo(128)'!AK97,0)","v":"IRMAK BÜŞRA UNCU (KST)"}]
[63,{"$f":"IFERROR(On_Eleme!E191,0)","v":"ELANUR DEMİR (İST)"},{"$f":"On_Eleme!F191","v":0},{"$f":"On_Eleme!F192","v":0},{"$f":"IFERROR(On_Eleme!E192,0)","v":0},null,63,{"$f":"IFERROR(Eleme!F190,0)","v":0},{"$f":"Eleme!H191","v":0},{"$f":"Eleme!I191","v":0},{"$f":"IFERROR(Eleme!F192,0)","v":0},null,null,null,null,null,null,null,63,{"$f":"IFERROR('Ana_Tablo(128)'!AR49,0)","v":"BUSE KOÇAK (ANK)"},{"$f":"IFERROR('Ana_Tablo(128)'!AT53,0)","v":3},{"$f":"IFERROR('Ana_Tablo(128)'!AU53,0)","v":0},{"$f":"IFERROR('Ana_Tablo(128)'!AR55,0)","v":"DURU KIRBAÇ (İST)"}]
[64,{"$f":"IFERROR(On_Eleme!E194,0)","v":"ÖZGE ARI (KRL)"},{"$f":"On_Eleme!F194","v":0},{"$f":"On_Eleme!F195","v":0},{"$f":"IFERROR(On_Eleme!E195,0)","v":0},null,64,{"$f":"IFERROR(Eleme!F193,0)","v":0},{"$f":"Eleme!H194","v":0},{"$f":"Eleme!I194","v":3},{"$f":"IFERROR(Eleme!F195,0)","v":"GÜLCE DÖNMEZ (KNY)"},null,null,null,null,null,null,null,64,{"$f":"IFERROR('Ana_Tablo(128)'!AR65,0)","v":"HATİCE ELİF GÜVELİ (İST)"},{"$f":"IFERROR('Ana_Tablo(128)'!AT69,0)","v":3},{"$f":"IFERROR('Ana_Tablo(128)'!AU69,0)","v":0},{"$f":"IFERROR('Ana_Tablo(128)'!AR72,0)","v":"GÜLCE DÖNMEZ (KNY)"}]
[null,null,null,null,null,null,65,{"$f":"IFERROR(Eleme!T5,0)","v":"NİL BAŞARAN (İST)"},{"$f":"Eleme!V7","v":3},{"$f":"Eleme!W7","v":0},{"$f":"IFERROR(Eleme!T8,0)","v":""},null,null,null,null,null,null,null,65,{"$f":"IFERROR('Ana_Tablo(128)'!AR78,0)","v":"DURU ŞENDOĞAN (RİZ)"},{"$f":"IFERROR('Ana_Tablo(128)'!AT79,0)","v":1},{"$f":"IFERROR('Ana_Tablo(128)'!AU79,0)","v":3},{"$f":"IFERROR('Ana_Tablo(128)'!AR80,0)","v":"AYTEN CEREN KAHRAMAN (KYS)"}]
[null,null,null,null,null,null,66,{"$f":"IFERROR(Eleme!T11,0)","v":"ŞEVVAL ALAŞ (BTM)"},{"$f":"Eleme!V13","v":3},{"$f":"Eleme!W13","v":1},{"$f":"IFERROR(Eleme!T14,0)","v":"HATİCE RAVZA GÜLCE (KYS)"},null,null,null,null,null,null,null,66,{"$f":"IFERROR('Ana_Tablo(128)'!AR82,0)","v":"ELİZAN BAŞAR (ANK)"},{"$f":"IFERROR('Ana_Tablo(128)'!AT83,0)","v":0},{"$f":"IFERROR('Ana_Tablo(128)'!AU83,0)","v":0},{"$f":"IFERROR('Ana_Tablo(128)'!AR85,0)","v":"ELVİN KALE (YLV)"}]
[null,null,null,null,null,null,67,{"$f":"IFERROR(Eleme!T17,0)","v":"ELA SU YÖNTER (ANK)"},{"$f":"Eleme!V19","v":3},{"$f":"Eleme!W19","v":2},{"$f":"IFERROR(Eleme!T20,0)","v":"EMİNE AYDINAY (BRS)"},null,null,null,null,null,null,null,67,{"$f":"IFERROR('Ana_Tablo(128)'!AR87,0)","v":"EYLÜL ŞEVVAL AYDIN (İST)"},{"$f":"IFERROR('Ana_Tablo(128)'!AT88,0)","v":1},{"$f":"IFERROR('Ana_Tablo(128)'!AU88,0)","v":3},{"$f":"IFERROR('Ana_Tablo(128)'!AR89,0)","v":"MASAL ERYILMAZ (İST)"}]
[null,null,null,null,null,null,68,{"$f":"IFERROR(Eleme!T23,0)","v":"BERRA ARIKAN (ADN)"},{"$f":"Eleme!V25","v":0},{"$f":"Eleme!W25","v":3},{"$f":"IFERROR(Eleme!T26,0)","v":"CEYLİN AKDANALI (ÇRM)"},null,null,null,null,null,null,null,68,{"$f":"IFERROR('Ana_Tablo(128)'!AY13,0)","v":"NİL BAŞARAN (İST)"},{"$f":"IFERROR('Ana_Tablo(128)'!BA25,0)","v":0},{"$f":"IFERROR('Ana_Tablo(128)'!BB25,0)","v":3},{"$f":"IFERROR('Ana_Tablo(128)'!AY38,0)","v":"ELİF ECE AKYÜREK (ADN)"}]
[null,null,null,null,null,null,69,{"$f":"IFERROR(Eleme!T29,0)","v":"ELİZAN BAŞAR (ANK)"},{"$f":"Eleme!V31","v":3},{"$f":"Eleme!W31","v":0},{"$f":"IFERROR(Eleme!T32,0)","v":"KAREN GÜRBÜZ (ADN)"},null,null,null,null,null,null,null,69,{"$f":"IFERROR('Ana_Tablo(128)'!AY52,0)","v":"BUSE KOÇAK (ANK)"},{"$f":"IFERROR('Ana_Tablo(128)'!BA61,0)","v":0},{"$f":"IFERROR('Ana_Tablo(128)'!BB61,0)","v":3},{"$f":"IFERROR('Ana_Tablo(128)'!AY69,0)","v":"HATİCE ELİF GÜVELİ (İST)"}]
[null,null,null,null,null,null,70,{"$f":"IFERROR(Eleme!T35,0)","v":"AYÇA SAVAŞ (KST)"},{"$f":"Eleme!V37","v":0},{"$f":"Eleme!W37","v":3},{"$f":"IFERROR(Eleme!T38,0)","v":"NİSA ÜZÜMCÜ (BTM)"},null,null,null,null,null,null,null,70,{"$f":"IFERROR('Ana_Tablo(128)'!AY74,0)","v":"DURU KIRBAÇ (İST)"},{"$f":"IFERROR('Ana_Tablo(128)'!BA75,0)","v":1},{"$f":"IFERROR('Ana_Tablo(128)'!BB75,0)","v":3},{"$f":"IFERROR('Ana_Tablo(128)'!AY76,0)","v":"GÜLCE DÖNMEZ (KNY)"}]
[null,null,null,null,null,null,71,{"$f":"IFERROR(Eleme!T41,0)","v":"ESİLA SU YALÇIN (SKR)"},{"$f":"Eleme!V43","v":3},{"$f":"Eleme!W43","v":0},{"$f":"IFERROR(Eleme!T44,0)","v":"ELİF ASYA HOCAOĞLU (RİZ)"},null,null,null,null,null,null,null,71,{"$f":"IFERROR('Ana_Tablo(128)'!BF49,0)","v":"NİL BAŞARAN (İST)"},{"$f":"IFERROR('Ana_Tablo(128)'!BI55,0)","v":3},{"$f":"IFERROR('Ana_Tablo(128)'!BJ55,0)","v":0},{"$f":"IFERROR('Ana_Tablo(128)'!BF61,0)","v":"HATİCE ELİF GÜVELİ (İST)"}]
[null,null,null,null,null,null,72,{"$f":"IFERROR(Eleme!T47,0)","v":""},{"$f":"Eleme!V49","v":0},{"$f":"Eleme!W49","v":3},{"$f":"IFERROR(Eleme!T50,0)","v":"DURU ŞENDOĞAN (RİZ)"},null,null,null,null,null,null,null,72,{"$f":"IFERROR('Ana_Tablo(128)'!BM25,0)","v":"ELİF ECE AKYÜREK (ADN)"},{"$f":"IFERROR('Ana_Tablo(128)'!BO39,0)","v":1},{"$f":"IFERROR('Ana_Tablo(128)'!BP39,0)","v":3},{"$f":"IFERROR('Ana_Tablo(128)'!BM55,0)","v":"NİL BAŞARAN (İST)"}]
[null,null,null,null,null,null,73,{"$f":"IFERROR(Eleme!T53,0)","v":"EYLÜL ŞEVVAL AYDIN (İST)"},{"$f":"Eleme!V55","v":3},{"$f":"Eleme!W55","v":0},{"$f":"IFERROR(Eleme!T56,0)","v":""}]
[null,null,null,null,null,null,74,{"$f":"IFERROR(Eleme!T59,0)","v":"ELANUR YILMAZ (BRS)"},{"$f":"Eleme!V61","v":3},{"$f":"Eleme!W61","v":0},{"$f":"IFERROR(Eleme!T62,0)","v":"AYŞE DURU DOĞAN (ANK)"}]
[null,null,null,null,null,null,75,{"$f":"IFERROR(Eleme!T65,0)","v":"DİLAY BALABAN (RİZ)"},{"$f":"Eleme!V67","v":3},{"$f":"Eleme!W67","v":0},{"$f":"IFERROR(Eleme!T68,0)","v":"ESMA KAMER SÜT (KYS)"}]
[null,null,null,null,null,null,76,{"$f":"IFERROR(Eleme!T71,0)","v":"BERRA AKICI (SKR)"},{"$f":"Eleme!V73","v":0},{"$f":"Eleme!W73","v":3},{"$f":"IFERROR(Eleme!T74,0)","v":"ZEYNEP NAZ EKER (KRL)"}]
[null,null,null,null,null,null,77,{"$f":"IFERROR(Eleme!T77,0)","v":"İPEK ERTUNA (ANK)"},{"$f":"Eleme!V79","v":3},{"$f":"Eleme!W79","v":1},{"$f":"IFERROR(Eleme!T80,0)","v":"BAHAR GÜL (ZNG)"}]
[null,null,null,null,null,null,78,{"$f":"IFERROR(Eleme!T83,0)","v":"DURU BERİL TOK (YLV)"},{"$f":"Eleme!V85","v":1},{"$f":"Eleme!W85","v":3},{"$f":"IFERROR(Eleme!T86,0)","v":"MASAL ERYILMAZ (İST)"}]
[null,null,null,null,null,null,79,{"$f":"IFERROR(Eleme!T89,0)","v":"ZEYNEP DURAN (İST)"},{"$f":"Eleme!V91","v":3},{"$f":"Eleme!W91","v":0},{"$f":"IFERROR(Eleme!T92,0)","v":"İLGİ İPEK TUNÇ (ANK)"}]
[null,null,null,null,null,null,80,{"$f":"IFERROR(Eleme!T95,0)","v":""},{"$f":"Eleme!V97","v":0},{"$f":"Eleme!W97","v":3},{"$f":"IFERROR(Eleme!T98,0)","v":"HATİCE ELİF GÜVELİ (İST)"}]
[null,null,null,null,null,null,81,{"$f":"IFERROR(Eleme!T101,0)","v":"ELİF ECE AKYÜREK (ADN)"},{"$f":"Eleme!V103","v":3},{"$f":"Eleme!W103","v":0},{"$f":"IFERROR(Eleme!T104,0)","v":""}]
[null,null,null,null,null,null,82,{"$f":"IFERROR(Eleme!T107,0)","v":"EYLÜL KENANOĞLU (KST)"},{"$f":"Eleme!V109","v":3},{"$f":"Eleme!W109","v":0},{"$f":"IFERROR(Eleme!T110,0)","v":"ELİF ÇELİK (MLT)"}]
[null,null,null,null,null,null,83,{"$f":"IFERROR(Eleme!T113,0)","v":"NAZLI ŞAHAN (ÇRM)"},{"$f":"Eleme!V115","v":1},{"$f":"Eleme!W115","v":3},{"$f":"IFERROR(Eleme!T116,0)","v":"ESMA SULTAN SARI (SKR)"}]
[null,null,null,null,null,null,84,{"$f":"IFERROR(Eleme!T119,0)","v":"ELANUR ALAÇAM (AMS)"},{"$f":"Eleme!V121","v":3},{"$f":"Eleme!W121","v":1},{"$f":"IFERROR(Eleme!T122,0)","v":"NEHİR DUYURAN (ANK)"}]
[null,null,null,null,null,null,85,{"$f":"IFERROR(Eleme!T125,0)","v":"AYTEN CEREN KAHRAMAN (KYS)"},{"$f":"Eleme!V127","v":3},{"$f":"Eleme!W127","v":0},{"$f":"IFERROR(Eleme!T128,0)","v":"ELANUR DEMİR (İST)"}]
[null,null,null,null,null,null,86,{"$f":"IFERROR(Eleme!T131,0)","v":"BERRA BAHTİYAR (SKR)"},{"$f":"Eleme!V133","v":0},{"$f":"Eleme!W133","v":3},{"$f":"IFERROR(Eleme!T134,0)","v":"IRMAK BÜŞRA UNCU (KST)"}]
[null,null,null,null,null,null,87,{"$f":"IFERROR(Eleme!T137,0)","v":"ECEMSU ÇİÇEK (İZM)"},{"$f":"Eleme!V139","v":2},{"$f":"Eleme!W139","v":3},{"$f":"IFERROR(Eleme!T140,0)","v":"NAZLINUR AKGÜN (ANT)"}]
[null,null,null,null,null,null,88,{"$f":"IFERROR(Eleme!T143,0)","v":""},{"$f":"Eleme!V145","v":0},{"$f":"Eleme!W145","v":3},{"$f":"IFERROR(Eleme!T146,0)","v":"DURU KIRBAÇ (İST)"}]
[null,null,null,null,null,null,89,{"$f":"IFERROR(Eleme!T149,0)","v":"ZEYNEP ADA ER (ANK)"},{"$f":"Eleme!V151","v":3},{"$f":"Eleme!W151","v":0},{"$f":"IFERROR(Eleme!T152,0)","v":""}]
[null,null,null,null,null,null,90,{"$f":"IFERROR(Eleme!T155,0)","v":"ASLINUR USLU (BRS)"},{"$f":"Eleme!V157","v":0},{"$f":"Eleme!W157","v":3},{"$f":"IFERROR(Eleme!T158,0)","v":"ELVİN KALE (YLV)"}]
[null,null,null,null,null,null,91,{"$f":"IFERROR(Eleme!T161,0)","v":"DAMLA AVŞAR (VAN)"},{"$f":"Eleme!V163","v":3},{"$f":"Eleme!W163","v":1},{"$f":"IFERROR(Eleme!T164,0)","v":"BUSE NUR ÖNDER (BTM)"}]
[null,null,null,null,null,null,92,{"$f":"IFERROR(Eleme!T167,0)","v":"NEVA NUR KALKAN (AMS)"},{"$f":"Eleme!V169","v":1},{"$f":"Eleme!W169","v":3},{"$f":"IFERROR(Eleme!T170,0)","v":"BUSE KOÇAK (ANK)"}]
[null,null,null,null,null,null,93,{"$f":"IFERROR(Eleme!T173,0)","v":"ÖZLEM KÖSEOĞLU (RİZ)"},{"$f":"Eleme!V175","v":3},{"$f":"Eleme!W175","v":0},{"$f":"IFERROR(Eleme!T176,0)","v":""}]
[null,null,null,null,null,null,94,{"$f":"IFERROR(Eleme!T179,0)","v":"ELİF BEYZA AKDEMİR (BTM)"},{"$f":"Eleme!V181","v":3},{"$f":"Eleme!W181","v":1},{"$f":"IFERROR(Eleme!T182,0)","v":"MERVE MENGENE (RİZ)"}]
[null,null,null,null,null,null,95,{"$f":"IFERROR(Eleme!T185,0)","v":"ARMİN AYDIN (İST)"},{"$f":"Eleme!V187","v":3},{"$f":"Eleme!W187","v":0},{"$f":"IFERROR(Eleme!T188,0)","v":""}]
[null,null,null,null,null,null,96,{"$f":"IFERROR(Eleme!T191,0)","v":""},{"$f":"Eleme!V193","v":0},{"$f":"Eleme!W193","v":3},{"$f":"IFERROR(Eleme!T194,0)","v":"GÜLCE DÖNMEZ (KNY)"}]
[null,null,null,null,null,null,97,{"$f":"IFERROR(Eleme!AH6,0)","v":"NİL BAŞARAN (İST)"},{"$f":"Eleme!AJ10","v":0},{"$f":"Eleme!AK10","v":0},{"$f":"IFERROR(Eleme!AH13,0)","v":"ŞEVVAL ALAŞ (BTM)"}]
[null,null,null,null,null,null,98,{"$f":"IFERROR(Eleme!AH18,0)","v":"ELA SU YÖNTER (ANK)"},{"$f":"Eleme!AJ22","v":0},{"$f":"Eleme!AK22","v":0},{"$f":"IFERROR(Eleme!AH25,0)","v":"CEYLİN AKDANALI (ÇRM)"}]
[null,null,null,null,null,null,99,{"$f":"IFERROR(Eleme!AH30,0)","v":"ELİZAN BAŞAR (ANK)"},{"$f":"Eleme!AJ34","v":0},{"$f":"Eleme!AK34","v":0},{"$f":"IFERROR(Eleme!AH37,0)","v":"NİSA ÜZÜMCÜ (BTM)"}]
[null,null,null,null,null,null,100,{"$f":"IFERROR(Eleme!AH42,0)","v":"ESİLA SU YALÇIN (SKR)"},{"$f":"Eleme!AJ46","v":0},{"$f":"Eleme!AK46","v":0},{"$f":"IFERROR(Eleme!AH49,0)","v":"DURU ŞENDOĞAN (RİZ)"}]
[null,null,null,null,null,null,101,{"$f":"IFERROR(Eleme!AH54,0)","v":"EYLÜL ŞEVVAL AYDIN (İST)"},{"$f":"Eleme!AJ58","v":0},{"$f":"Eleme!AK58","v":0},{"$f":"IFERROR(Eleme!AH61,0)","v":"ELANUR YILMAZ (BRS)"}]
[null,null,null,null,null,null,102,{"$f":"IFERROR(Eleme!AH66,0)","v":"DİLAY BALABAN (RİZ)"},{"$f":"Eleme!AJ70","v":0},{"$f":"Eleme!AK70","v":0},{"$f":"IFERROR(Eleme!AH73,0)","v":"ZEYNEP NAZ EKER (KRL)"}]
[null,null,null,null,null,null,103,{"$f":"IFERROR(Eleme!AH78,0)","v":"İPEK ERTUNA (ANK)"},{"$f":"Eleme!AJ82","v":0},{"$f":"Eleme!AK82","v":0},{"$f":"IFERROR(Eleme!AH85,0)","v":"MASAL ERYILMAZ (İST)"}]
[null,null,null,null,null,null,104,{"$f":"IFERROR(Eleme!AH90,0)","v":"ZEYNEP DURAN (İST)"},{"$f":"Eleme!AJ94","v":0},{"$f":"Eleme!AK94","v":0},{"$f":"IFERROR(Eleme!AH97,0)","v":"HATİCE ELİF GÜVELİ (İST)"}]
[null,null,null,null,null,null,105,{"$f":"IFERROR(Eleme!AH102,0)","v":"ELİF ECE AKYÜREK (ADN)"},{"$f":"Eleme!AJ106","v":0},{"$f":"Eleme!AK106","v":0},{"$f":"IFERROR(Eleme!AH109,0)","v":"EYLÜL KENANOĞLU (KST)"}]
[null,null,null,null,null,null,106,{"$f":"IFERROR(Eleme!AH114,0)","v":"ESMA SULTAN SARI (SKR)"},{"$f":"Eleme!AJ118","v":0},{"$f":"Eleme!AK118","v":0},{"$f":"IFERROR(Eleme!AH121,0)","v":"ELANUR ALAÇAM (AMS)"}]
[null,null,null,null,null,null,107,{"$f":"IFERROR(Eleme!AH126,0)","v":"AYTEN CEREN KAHRAMAN (KYS)"},{"$f":"Eleme!AJ130","v":0},{"$f":"Eleme!AK130","v":0},{"$f":"IFERROR(Eleme!AH133,0)","v":"IRMAK BÜŞRA UNCU (KST)"}]
[null,null,null,null,null,null,108,{"$f":"IFERROR(Eleme!AH138,0)","v":"NAZLINUR AKGÜN (ANT)"},{"$f":"Eleme!AJ142","v":0},{"$f":"Eleme!AK142","v":0},{"$f":"IFERROR(Eleme!AH145,0)","v":"DURU KIRBAÇ (İST)"}]
[null,null,null,null,null,null,109,{"$f":"IFERROR(Eleme!AH150,0)","v":"ZEYNEP ADA ER (ANK)"},{"$f":"Eleme!AJ154","v":0},{"$f":"Eleme!AK154","v":0},{"$f":"IFERROR(Eleme!AH157,0)","v":"ELVİN KALE (YLV)"}]
[null,null,null,null,null,null,110,{"$f":"IFERROR(Eleme!AH162,0)","v":"DAMLA AVŞAR (VAN)"},{"$f":"Eleme!AJ166","v":0},{"$f":"Eleme!AK166","v":0},{"$f":"IFERROR(Eleme!AH169,0)","v":"BUSE KOÇAK (ANK)"}]
[null,null,null,null,null,null,111,{"$f":"IFERROR(Eleme!AH174,0)","v":"ÖZLEM KÖSEOĞLU (RİZ)"},{"$f":"Eleme!AJ178","v":0},{"$f":"Eleme!AK178","v":0},{"$f":"IFERROR(Eleme!AH181,0)","v":"ELİF BEYZA AKDEMİR (BTM)"}]
[null,null,null,null,null,null,112,{"$f":"IFERROR(Eleme!AH186,0)","v":"ARMİN AYDIN (İST)"},{"$f":"Eleme!AJ190","v":0},{"$f":"Eleme!AK190","v":0},{"$f":"IFERROR(Eleme!AH193,0)","v":"GÜLCE DÖNMEZ (KNY)"}]

{"sheet":"Mac_Foy","index":8,"n_rows":30,"n_cols":59,"rows_kept":30,"cut":false,"hidden":false,"merged":[[28,19,28,22],[28,23,28,25],[29,3,29,4],[29,9,29,11],[29,17,29,18],[29,23,29,25],[25,23,26,23],[29,19,29,22],[28,1,28,2],[28,3,28,4],[28,5,28,8],[28,9,28,11],[28,15,28,16],[28,17,28,18],[25,9,26,9],[29,1,29,2],[29,5,29,8],[29,15,29,16],[25,11,26,11],[25,14,26,14],[25,17,26,17],[25,18,26,18],[23,25,24,25],[23,8,24,8],[23,10,24,10],[23,11,24,11],[23,14,24,14],[23,17,24,17],[23,18,24,18],[25,0,26,0],[25,3,26,3],[25,4,26,4],[25,5,26,5],[25,6,26,6],[25,7,26,7],[23,19,24,19],[23,20,24,20],[23,21,24,21],[25,19,26,19],[25,20,26,20],[25,21,26,21],[25,22,26,22],[25,24,26,24],[25,25,26,25],[25,8,26,8],[25,10,26,10],[21,15,22,15],[21,16,22,16],[21,17,21,22],[21,23,21,24],[23,0,24,0],[23,3,24,3],[23,4,24,4],[23,5,24,5],[23,6,24,6],[23,7,24,7],[21,0,22,0],[21,1,22,1],[21,2,22,2],[21,3,21,8],[21,9,21,10],[21,14,22,14],[23,22,24,22],[23,24,24,24],[23,9,24,9],[23,23,24,23],[18,22,18,23],[18,24,18,25],[19,1,19,5],[19,6,19,7],[19,8,19,9],[19,10,19,11],[19,15,19,19],[19,20,19,21],[19,22,19,23],[19,24,19,25],[18,1,18,5],[18,6,18,7],[18,8,18,9],[18,10,18,11],[18,15,18,19],[18,20,18,21],[13,9,13,11],[13,17,13,18],[13,23,13,25],[12,1,12,2],[12,3,12,4],[12,5,12,8],[12,9,12,11],[12,15,12,16],[12,17,12,18],[13,5,13,8],[13,1,13,2],[13,15,13,16],[13,19,13,22],[17,0,17,11],[17,14,17,25],[9,22,10,22],[9,24,10,24],[9,25,10,25],[9,8,10,8],[9,10,10,10],[9,11,10,11],[9,14,10,14],[9,17,10,17],[9,18,10,18],[9,9,10,9],[9,23,10,23],[9,0,10,0],[9,3,10,3],[9,4,10,4],[9,5,10,5],[9,6,10,6],[9,7,10,7],[16,0,16,11],[16,14,16,25],[12,19,12,22],[12,23,12,25],[13,3,13,4],[9,19,10,19],[9,20,10,20],[9,21,10,21],[7,9,8,9],[7,0,8,0],[7,3,8,3],[7,4,8,4],[7,5,8,5],[7,6,8,6],[7,7,8,7],[7,22,8,22],[7,24,8,24],[7,25,8,25],[7,8,8,8],[7,10,8,10],[7,11,8,11],[7,14,8,14],[7,17,8,17],[7,18,8,18],[7,23,8,23],[7,19,8,19],[7,20,8,20],[7,21,8,21],[5,0,6,0],[5,1,6,1],[5,2,6,2],[5,3,5,8],[3,1,3,5],[3,6,3,7],[3,8,3,9],[3,10,3,11],[3,15,3,19],[3,20,3,21],[3,22,3,23],[3,24,3,25],[5,15,6,15],[5,16,6,16],[5,17,5,22],[5,23,5,24],[5,9,5,10],[5,14,6,14],[0,0,0,11],[0,14,0,25],[2,1,2,5],[2,6,2,7],[2,8,2,9],[2,10,2,11],[2,15,2,19],[2,20,2,21],[2,22,2,23],[2,24,2,25],[1,0,1,11],[1,14,1,25]]}
[{"$f":"+Kura!A1","v":"TÜRKİYE MASA TENİSİ FEDERASYONU\nKÜÇÜKLER FEDERASYON KUPASI"},null,null,null,null,null,null,null,null,null,null,null,null,null,{"$f":"+A1","v":"TÜRKİYE MASA TENİSİ FEDERASYONU\nKÜÇÜKLER FEDERASYON KUPASI"},null,null,null,null,null,null,null,null,null,null,null,null,"Manuel print alınacak ise !",null,null,null,null,null,null,null,null,null,null,null,null,null,null,null,null,null,null,null,null,null,null,null,null,null,null,null,null,null,"Ön_Eleme",4]
[{"$f":"+Kura!A2","v":"TEK KIZ [15-16 Nisan Amasya]"},null,null,null,null,null,null,null,null,null,null,null,null,null,{"$f":"+A2","v":"TEK KIZ [15-16 Nisan Amasya]"},null,null,null,null,null,null,null,null,null,null,null,null,null,null,null,null,null,null,null,null,null,null,null,null,null,null,null,null,null,null,null,null,null,null,null,null,null,null,null,null,null,null,"Eleme"]
["No","Yarışma",null,null,null,null,"Tarih",null,"Saat",null,"Masa",null,null,null,"No","Yarışma",null,null,null,null,"Tarih",null,"Saat",null,"Masa",null,null,null,null,null,null,null,null,null,null,null,null,null,null,null,null,null,null,null,null,null,null,null,null,null,null,null,null,null,null,null,null,"Ana_Tablo"]
[68,"Ana Tablo 33-44",null,null,null,null,{"$f":"TODAY()","v":"2023-04-18"},null,null,null,null,null,null,null,{"$f":"IF(A4=0,0,A4+1)","v":69},{"$f":"B4","v":"Ana Tablo 33-44"},null,null,null,null,{"$f":"IF(G4=0,\"\",G4)","v":"2023-04-18"},null,null,null,null,null,null,null,null,null,null,null,null,null,null,null,null,null,null,null,null,null,null,null,null,null,null,null,null,null,null,null,null,null,null,null,null,"Ana_Tablo(128)"]
[{"$f":"A4&\".\"&A4","v":"68.68"},null,null,null,null,null,null,null,null,null,null,null,null,null,{"$f":"O4&\".\"&O4","v":"69.69"},null,null,null,null,null,null,null,null,null,null,null,null,null,null,null,null,null,null,null,null,null,null,null,null,null,null,null,null,null,null,null,null,null,null,null,null,null,null,null,null,null,null,"Ana_Tablo(128_16)"]
["K","Nr",null,"SETLER",null,null,null,null,null,"Sporcu",null,"Öğ.",null,null,"K","Nr",null,"SETLER",null,null,null,null,null,"Sporcu",null,"Öğ."]
[null,null,null,1,2,3,4,5,"N","M","SKK","SK",null,null,null,null,null,1,2,3,4,5,"N","M","SKK","SK"]
["A","",{"$f":"VLOOKUP(A4,Maclar!S2:W75,2,0)","v":"NİL BAŞARAN (İST)"},null,null,null,null,null,null,null,null,null,null,null,"A","",{"$f":"VLOOKUP(O4,Maclar!S2:W75,2,0)","v":"BUSE KOÇAK (ANK)"}]
[null,"FR",null,null,null,null,null,null,null,null,null,null,null,null,null,"FR"]
["X","",{"$f":"VLOOKUP(A4,Maclar!S2:W75,5,0)","v":"ELİF ECE AKYÜREK (ADN)"},null,null,null,null,null,null,null,null,null,null,null,"X","",{"$f":"VLOOKUP(O4,Maclar!S2:W75,5,0)","v":"HATİCE ELİF GÜVELİ (İST)"}]
[null,"FR",null,null,null,null,null,null,null,null,null,null,null,null,null,"FR"]
[]
["Nr.","Galip: Adı Soyadı / İmza",null,"SONUÇ",null,"Hakem: Adı Soyadı / İmza",null,null,null,"Başhakem",null,null,null,null,"Nr.","Galip: Adı Soyadı / İmza",null,"SONUÇ",null,"Hakem: Adı Soyadı / İmza",null,null,null,"Başhakem"]
[null,null,null,"3  -  2",null,null,null,null,null,null,null,null,null,null,null,null,null,"3  -  2"]
[]
[]
[{"$f":"+A1","v":"TÜRKİYE MASA TENİSİ FEDERASYONU\nKÜÇÜKLER FEDERASYON KUPASI"},null,null,null,null,null,null,null,null,null,null,null,null,null,{"$f":"+A1","v":"TÜRKİYE MASA TENİSİ FEDERASYONU\nKÜÇÜKLER FEDERASYON KUPASI"}]
[{"$f":"+A2","v":"TEK KIZ [15-16 Nisan Amasya]"},null,null,null,null,null,null,null,null,null,null,null,null,null,{"$f":"+A2","v":"TEK KIZ [15-16 Nisan Amasya]"}]
["No","Yarışma",null,null,null,null,"Tarih",null,"Saat",null,"Masa",null,null,null,"No","Yarışma",null,null,null,null,"Tarih",null,"Saat",null,"Masa"]
[{"$f":"IF(O4=0,0,O4+1)","v":70},{"$f":"+B4","v":"Ana Tablo 33-44"},null,null,null,null,{"$f":"IF(G4=0,\"\",G4)","v":"2023-04-18"},null,null,null,null,null,null,null,{"$f":"IF(A20=0,0,A20+1)","v":71},{"$f":"B4","v":"Ana Tablo 33-44"},null,null,null,null,{"$f":"IF(G4=0,\"\",G4)","v":"2023-04-18"}]
[{"$f":"A20&\".\"&A20","v":"70.70"},null,null,null,null,null,null,null,null,null,null,null,null,null,{"$f":"O20&\".\"&O20","v":"71.71"}]
["K","Nr",null,"SETLER",null,null,null,null,null,"Sporcu",null,"Öğ.",null,null,"K","Nr",null,"SETLER",null,null,null,null,null,"Sporcu",null,"Öğ."]
[null,null,null,1,2,3,4,5,"N","M","SKK","SK",null,null,null,null,null,1,2,3,4,5,"N","M","SKK","SK"]
["A","",{"$f":"VLOOKUP(A20,Maclar!S2:W75,2,0)","v":"DURU KIRBAÇ (İST)"},null,null,null,null,null,null,null,null,null,null,null,"A","",{"$f":"VLOOKUP(O20,Maclar!S2:W75,2,0)","v":"NİL BAŞARAN (İST)"}]
[null,"FR",null,null,null,null,null,null,null,null,null,null,null,null,null,"FR"]
["X","",{"$f":"VLOOKUP(A20,Maclar!S2:W75,5,0)","v":"GÜLCE DÖNMEZ (KNY)"},null,null,null,null,null,null,null,null,null,null,null,"X","",{"$f":"VLOOKUP(O20,Maclar!S2:W75,5,0)","v":"HATİCE ELİF GÜVELİ (İST)"}]
[null,"FR",null,null,null,null,null,null,null,null,null,null,null,null,null,"FR"]
[]
["Nr.","Galip: Adı Soyadı / İmza",null,"SONUÇ",null,"Hakem: Adı Soyadı / İmza",null,null,null,"Başhakem",null,null,null,null,"Nr.","Galip: Adı Soyadı / İmza",null,"SONUÇ",null,"Hakem: Adı Soyadı / İmza",null,null,null,"Başhakem"]
[null,null,null,"3  -  2",null,null,null,null,null,null,null,null,null,null,null,null,null,"3  -  2"]

{"sheet":"Match","index":9,"n_rows":30,"n_cols":61,"rows_kept":30,"cut":false,"hidden":false,"merged":[[0,0,0,11],[0,14,0,25],[1,0,1,11],[1,14,1,25],[2,1,2,5],[2,6,2,7],[2,8,2,9],[2,10,2,11],[2,15,2,19],[2,20,2,21],[2,22,2,23],[2,24,2,25],[3,1,3,5],[3,6,3,7],[3,8,3,9],[3,10,3,11],[3,15,3,19],[3,20,3,21],[3,22,3,23],[3,24,3,25],[5,15,6,15],[5,16,6,16],[5,17,5,22],[5,23,5,24],[5,9,5,10],[5,14,6,14],[7,0,8,0],[7,3,8,3],[7,4,8,4],[7,5,8,5],[7,6,8,6],[7,7,8,7],[5,0,6,0],[5,1,6,1],[5,2,6,2],[5,3,5,8],[7,24,8,24],[7,25,8,25],[9,0,10,0],[9,3,10,3],[9,4,10,4],[9,5,10,5],[9,6,10,6],[9,7,10,7],[9,8,10,8],[9,9,10,9],[7,18,8,18],[7,19,8,19],[7,20,8,20],[7,21,8,21],[7,22,8,22],[7,23,8,23],[7,8,8,8],[7,9,8,9],[7,10,8,10],[7,11,8,11],[7,14,8,14],[7,17,8,17],[9,20,10,20],[9,21,10,21],[9,22,10,22],[9,23,10,23],[9,24,10,24],[9,25,10,25],[9,10,10,10],[9,11,10,11],[9,14,10,14],[9,17,10,17],[9,18,10,18],[9,19,10,19],[12,19,12,22],[12,23,12,25],[13,1,13,2],[13,3,13,4],[13,5,13,8],[13,9,13,11],[13,15,13,16],[13,17,13,18],[13,19,13,22],[13,23,13,25],[12,1,12,2],[12,3,12,4],[12,5,12,8],[12,9,12,11],[12,15,12,16],[12,17,12,18],[16,0,16,11],[16,14,16,25],[17,0,17,11],[17,14,17,25],[18,1,18,5],[18,6,18,7],[18,8,18,9],[18,10,18,11],[18,15,18,19],[18,20,18,21],[18,22,18,23],[18,24,18,25],[19,1,19,5],[19,6,19,7],[19,8,19,9],[19,10,19,11],[19,15,19,19],[19,20,19,21],[19,22,19,23],[19,24,19,25],[21,15,22,15],[21,16,22,16],[21,17,21,22],[21,23,21,24],[21,9,21,10],[21,14,22,14],[23,0,24,0],[23,3,24,3],[23,4,24,4],[23,5,24,5],[23,6,24,6],[23,7,24,7],[21,0,22,0],[21,1,22,1],[21,2,22,2],[21,3,21,8],[23,24,24,24],[23,25,24,25],[25,0,26,0],[25,3,26,3],[25,4,26,4],[25,5,26,5],[25,6,26,6],[25,7,26,7],[25,8,26,8],[25,9,26,9],[23,18,24,18],[23,19,24,19],[23,20,24,20],[23,21,24,21],[23,22,24,22],[23,23,24,23],[23,8,24,8],[23,9,24,9],[23,10,24,10],[23,11,24,11],[23,14,24,14],[23,17,24,17],[25,20,26,20],[25,21,26,21],[25,22,26,22],[25,23,26,23],[25,24,26,24],[25,25,26,25],[25,10,26,10],[25,11,26,11],[25,14,26,14],[25,17,26,17],[25,18,26,18],[25,19,26,19],[28,19,28,22],[28,23,28,25],[29,1,29,2],[29,3,29,4],[29,5,29,8],[29,9,29,11],[29,15,29,16],[29,17,29,18],[29,19,29,22],[29,23,29,25],[28,1,28,2],[28,3,28,4],[28,5,28,8],[28,9,28,11],[28,15,28,16],[28,17,28,18]]}
["TÜRKİYE MASA TENİSİ FEDERASYONU\nMİNİKLER FEDERASYON KUPASI",null,null,null,null,null,null,null,null,null,null,null,null,null,"TÜRKİYE MASA TENİSİ FEDERASYONU\nMİNİKLER FEDERASYON KUPASI",null,null,null,null,null,null,null,null,null,null,null,null,null,null,null,null,null,null,null,"Ön Eleme",null,null,null,null,null,null,null,null,null,null,null,null,null,null,null,null,null,null,null,null,null,null,null,null,"Ön_Eleme",1]
["TEK ERKEK [15-16 Nisan Amasya]",null,null,null,null,null,null,null,null,null,null,null,null,null,"TEK ERKEK [15-16 Nisan Amasya]",null,null,null,null,null,null,null,null,null,null,null,null,null,null,null,null,null,null,null,"Eleme",null,null,null,null,null,null,null,null,null,null,null,null,null,null,null,null,null,null,null,null,null,null,null,null,"Eleme"]
["No","Yarışma",null,null,null,null,"Tarih",null,"Saat",null,"Masa",null,null,null,"No","Yarışma",null,null,null,null,"Tarih",null,"Saat",null,"Masa",null,null,null,null,null,null,null,null,null,"Ana Tablo",null,null,null,null,null,null,null,null,null,null,null,null,null,null,null,null,null,null,null,null,null,null,null,null,"Ana_Tablo"]
[{"$f":"AD7","v":1},{"$f":"+AI7","v":"Ön Eleme"},null,null,null,null,{"$f":"TODAY()","v":"2023-04-18"},null,null,null,null,null,null,null,{"$f":"+A4+1","v":2},{"$f":"B4","v":"Ön Eleme"},null,null,null,null,{"$f":"TODAY()","v":"2023-04-18"},null,null,null,null,null,null,null,null,null,null,null,null,null,null,null,null,null,null,null,null,null,null,null,null,null,null,null,null,null,null,null,null,null,null,null,null,null,null,"Ana_Tablo(128)"]
[".",null,null,null,null,null,null,null,null,null,null,null,null,null,"0.0",null,null,null,null,null,null,null,null,null,null,null,null,null,null,null,null,null,null,null,null,null,null,null,null,null,null,null,null,null,null,null,null,null,null,null,null,null,null,null,null,null,null,null,null,"Ana_Tablo(128_16)"]
["K","Nr",null,"SETLER",null,null,null,null,null,"Sporcu",null,"Öğ.",null,null,"K","Nr",null,"SETLER",null,null,null,null,null,"Sporcu",null,"Öğ."]
[null,null,null,1,2,3,4,5,"N","M","SKK","SK",null,null,null,null,null,1,2,3,4,5,"N","M","SKK","SK",null,null,null,1,null,null,null,null,"Ön Eleme"]
["A","",{"$f":"AE7","v":0},null,null,null,null,null,null,null,null,null,null,null,"A","",{"$f":"AE8","v":0},null,null,null,null,null,null,null,null,null,null,null,null,{"$f":"+AD7+1","v":2}]
[null,"FR",null,null,null,null,null,null,null,null,null,null,null,null,null,"FR",null,null,null,null,null,null,null,null,null,null,null,null,null,{"$f":"+AD8+1","v":3}]
["X","",{"$f":"AH7","v":0},null,null,null,null,null,null,null,null,null,null,null,"X","",{"$f":"AH8","v":0},null,null,null,null,null,null,null,null,null,null,null,null,4]
[null,"FR",null,null,null,null,null,null,null,null,null,null,null,null,null,"FR"]
[]
["Nr.","Galip: Adı Soyadı / İmza",null,"SONUÇ",null,"Hakem: Adı Soyadı / İmza",null,null,null,"Başhakem",null,null,null,null,"Nr.","Galip: Adı Soyadı / İmza",null,"SONUÇ",null,"Hakem: Adı Soyadı / İmza",null,null,null,"Başhakem"]
[null,null,null,"3  -  2",null,null,null,null,null,null,null,null,null,null,null,null,null,"3  -  2"]
[]
[]
["TÜRKİYE MASA TENİSİ FEDERASYONU\nMİNİKLER FEDERASYON KUPASI",null,null,null,null,null,null,null,null,null,null,null,null,null,"TÜRKİYE MASA TENİSİ FEDERASYONU\nMİNİKLER FEDERASYON KUPASI"]
["TEK ERKEK [15-16 Nisan Amasya]",null,null,null,null,null,null,null,null,null,null,null,null,null,"TEK ERKEK [15-16 Nisan Amasya]"]
["No","Yarışma",null,null,null,null,"Tarih",null,"Saat",null,"Masa",null,null,null,"No","Yarışma",null,null,null,null,"Tarih",null,"Saat",null,"Masa"]
[{"$f":"+O4+1","v":3},{"$f":"B4","v":"Ön Eleme"},null,null,null,null,{"$f":"TODAY()","v":"2023-04-18"},null,null,null,null,null,null,null,{"$f":"+A20+1","v":4},{"$f":"B4","v":"Ön Eleme"},null,null,null,null,{"$f":"TODAY()","v":"2023-04-18"}]
["0.0",null,null,null,null,null,null,null,null,null,null,null,null,null,"0.0"]
["K","Nr",null,"SETLER",null,null,null,null,null,"Sporcu",null,"Öğ.",null,null,"K","Nr",null,"SETLER",null,null,null,null,null,"Sporcu",null,"Öğ."]
[null,null,null,1,2,3,4,5,"N","M","SKK","SK",null,null,null,null,null,1,2,3,4,5,"N","M","SKK","SK"]
["A","",{"$f":"AE9","v":0},null,null,null,null,null,null,null,null,null,null,null,"A","",{"$f":"AE10","v":0}]
[null,"FR",null,null,null,null,null,null,null,null,null,null,null,null,null,"FR"]
["X","",{"$f":"AH9","v":0},null,null,null,null,null,null,null,null,null,null,null,"X","",{"$f":"AH10","v":0}]
[null,"FR",null,null,null,null,null,null,null,null,null,null,null,null,null,"FR"]
[]
["Nr.","Galip: Adı Soyadı / İmza",null,"SONUÇ",null,"Hakem: Adı Soyadı / İmza",null,null,null,"Başhakem",null,null,null,null,"Nr.","Galip: Adı Soyadı / İmza",null,"SONUÇ",null,"Hakem: Adı Soyadı / İmza",null,null,null,"Başhakem"]
[null,null,null,"3  -  2",null,null,null,null,null,null,null,null,null,null,null,null,null,"3  -  2"]

{"sheet":"Sıralama","index":10,"n_rows":39,"n_cols":5,"rows_kept":39,"cut":false,"hidden":false,"merged":[[1,0,1,6],[2,0,2,6],[4,0,4,6]]}
[]
[{"$f":"+Kura!A1","v":"TÜRKİYE MASA TENİSİ FEDERASYONU\nKÜÇÜKLER FEDERASYON KUPASI"}]
[{"$f":"+Kura!A2","v":"TEK KIZ [15-16 Nisan Amasya]"}]
[]
["ERKEK FERDİ SIRALAMA"]
[null,"Sıra","Sporcu Adı-Soyadı","Kulübü","İli"]
[null,"1.","NİL BAŞARAN (İST)"]
[null,"2.","ELİF ECE AKYÜREK (ADN)"]
[null,"3.","HATİCE ELİF GÜVELİ (İST)"]
[null,"4.","BUSE KOÇAK (ANK)"]
[null,"5.","GÜLCE DÖNMEZ (KNY)"]
[null,"6.","DURU KIRBAÇ (İST)"]
[null,"7.","AYTEN CEREN KAHRAMAN (KYS)"]
[null,"8.","DURU ŞENDOĞAN (RİZ)"]
[null,"9.","ELVİN KALE (YLV)"]
[null,"10.","ELİZAN BAŞAR (ANK)"]
[null,"11.","MASAL ERYILMAZ (İST)"]
[null,"12.","EYLÜL ŞEVVAL AYDIN (İST)"]
[null,"13.","ELA SU YÖNTER (ANK)"]
[null,"14.","CEYLİN AKDANALI (ÇRM)"]
[null,"15.","IRMAK BÜŞRA UNCU (KST)"]
[null,"16.","İPEK ERTUNA (ANK)"]
[null,"17."]
[null,"17."]
[null,"17."]
[null,"17."]
[null,"17."]
[null,"17."]
[null,"17."]
[null,"17."]
[null,"17."]
[null,"17."]
[null,"17."]
[null,"17."]
[null,"17."]
[null,"17."]
[null,"17."]
[null,"17."]
[null,"17."]