{"text_format":"1","workbook":"xlsx","n_sheets":5,"sheets":["Katılım","On_Eleme","Eleme","Ana_Tablo","Sıralama"],"not_rendered":{"charts":0,"images":8,"macros":1,"external_links":0,"defined_names":5,"comments":0,"pivot_tables":0},"unopened":[],"bounds":{"document_bytes":16777216,"sheet_cells":100000,"rows_first":2000,"rows_last":500,"rows_between":2000,"halvings":0,"cell_chars":16384,"cell_head_chars":4096},"cells_cut":0,"cells_raw":0,"read":"whole","date_system":"1900"}

{"sheet":"Katılım","index":0,"n_rows":259,"n_cols":50,"rows_kept":259,"cut":false,"hidden":false,"merged":[[0,0,0,6],[1,0,1,6],[1,34,2,35]]}
["TÜRKİYE MASA TENİSİ FEDERASYONU\nKÜÇÜKLER FEDERASYON KUPASI",null,null,null,null,null,null,null,null,null,null,null,null,null,null,null,null,null,null,null,null,null,null,null,null,null,null,null,{"$f":"A1","v":"TÜRKİYE MASA TENİSİ FEDERASYONU\nKÜÇÜKLER FEDERASYON KUPASI"},null,null,null,null,null,null,null,null,null,null,null,null,null,null,null,null,null,null,"Eleme (128)",1,2]
["TEK ERKEK [17-18 Nisan 2023 Amasya]",null,null,null,null,null,null,null,null,null,null,null,null,null,null,null,null,null,null,null,null,null,null,null,null,null,null,null,{"$f":"A2","v":"TEK ERKEK [17-18 Nisan 2023 Amasya]"},null,null,null,null,null,null,null,null,null,null,null,null,null,null,null,null,null,null,"Eleme (64)",{"$f":"LOOKUP(AW1,{1,2,3,4,5,6},{128,64,32,16,8,128})","v":128}]
["No","Puan","Sporcu Adı","İl","Takım Adı","İl","D.Tarihi",null,null,null,null,null,null,null,null,null,null,null,null,null,null,null,null,null,null,null,null,null,"[ Ön Eleme ]","[ Eleme ]","[ Ana Tablo ]",null,null,null,null,null,null,null,null,null,null,null,null,null,null,null,null,"Eleme (32)"]
[1,332,"GÖRKEM ÖÇAL","ADN","ÇİLTAR MTİ","ADANA","2011-09-04",null,null,null,null,null,null,null,null,null,null,null,null,null,null,null,null,null,null,{"$f":"IF(C4=\"\",0,C4&\" (\"&D4&\")\")","v":"GÖRKEM ÖÇAL (ADN)"},null,null,null,null,null,null,null,null,null,null,null,null,null,null,null,null,null,null,null,null,null,"Eleme (16)"]
[2,307,"KENAN EREN KAHRAMAN","KYS","KOCASİNAN BELEDİYESİ SPOR","KAYSERİ","2010-06-12",null,null,null,null,null,null,null,null,null,null,null,null,null,null,null,null,null,null,"KENAN EREN KAHRAMAN (KYS)",null,null,null,null,null,null,null,null,null,null,null,null,null,null,null,null,null,null,null,null,null,"Eleme (8)"]
[3,281,"KUZEY GÜNDOĞDU","KST","KASTAMONU MASATENİSİ SK","KASTAMONU","2011-01-28",null,0.22686600685119629,null,null,null,null,null,null,null,null,null,null,null,null,null,null,null,null,"KUZEY GÜNDOĞDU (KST)",null,null,null,null,null,null,null,null,null,null,null,null,null,null,null,null,null,null,null,null,null,"Eleme (128_Çift)"]
[4,255,"YİĞİT CAN KAYA","İST","PENDİK BELEDİYESPOR","İSTANBUL","2010-01-17",null,0.2439313530921936,null,null,null,null,null,null,null,null,null,null,null,null,null,null,null,null,"YİĞİT CAN KAYA (İST)",null,null,null,null,null,null,null,null,null,null,null,null,null,null,null,null,null,null,null,null,null,"Eleme (128_Çift16)"]
[5,249,"MEHMET EYMEN KILIÇ","KCL","B.B.KAĞITSPOR KULÜBÜ","KOCAELİ","2010-07-13",null,1.4017641544342041E-2,null,null,null,null,null,null,null,null,null,null,null,null,null,null,null,null,"MEHMET EYMEN KILIÇ (KCL)"]
[6,249,"MUHAMMED ÖLMEZ","KNY","SELÇUKLU BELEDİYE SPOR KULÜBÜ","KONYA","2010-03-05",null,0.76072359085083008,null,null,null,null,null,null,null,null,null,null,null,null,null,null,null,null,"MUHAMMED ÖLMEZ (KNY)"]
[7,247,"AHMET ŞAHAN","ISP","ISPARTES SPOR KULÜBÜ","ISPARTA","2010-01-05",null,0.69511550664901733,null,null,null,null,null,null,null,null,null,null,null,null,null,null,null,null,"AHMET ŞAHAN (ISP)"]
{"$rows_left_out":250}
{"sheet":"On_Eleme","index":1,"n_rows":195,"n_cols":29,"rows_kept":195,"cut":false,"hidden":false,"merged":[[0,4,1,6],[2,4,2,6]]}
[null,null,null,null,{"$f":"Katılım!AC1","v":"TÜRKİYE MASA TENİSİ FEDERASYONU\nKÜÇÜKLER FEDERASYON KUPASI"},null,null,null,null,null,null,null,null,null,null,null,null,null,null,null,null,null,null,null,null,null,4,null,{"$f":"SUM(AA5:AA500)","v":2}]
[]
[null,null,null,null,{"$f":"Katılım!A2&\" \"&Katılım!AC3","v":"TEK ERKEK [17-18 Nisan 2023 Amasya] [ Ön Eleme ]"}]
[null,null,null,null,"Sporcu","Skor","Galip",null,"Külüp Adı",null,null,"Eleme tablosu ilk turda denk gelip gelmediğinin kontrolü yapılır"]
[1,"E1",84,null,{"$f":"IFERROR(VLOOKUP(C5,Katılım!$A$4:$Z$301,26,0),0)","v":"MEHMET VARCAN (ESK)"},3,{"$f":"IF(AND(F5=0,F6=0),\"\",IF(F5>F6,E5,E6))","v":"MEHMET VARCAN (ESK)"},null,{"$f":"IFERROR(VLOOKUP(C5,Katılım!$A$4:$G$301,5,0),0)","v":"ESKİŞEHİR BÜYÜKŞEHİR GENÇLİK VE SPOR"},null,null,"E1",1,{"$f":"OFFSET(#REF!,M5,Katılım!$AW$1)","v":{"$error":"#REF!"}},{"$f":"IFERROR(VLOOKUP(N5,Katılım!$A$4:$Z$301,26,0),0)","v":0},{"$f":"IFERROR(VLOOKUP(N5,Katılım!$A$4:$G$301,5,0),0)","v":0},null,null,null,null,null,null,null,null,null,null,{"$f":"IF(AND(E5<>0,E6<>0),1,0)","v":1}]
["1.1",null,105,null,{"$f":"IFERROR(VLOOKUP(C6,Katılım!$A$4:$Z$301,26,0),0)","v":"RECEP HAMZA KAYA (SMS)"},null,null,null,{"$f":"IFERROR(VLOOKUP(C6,Katılım!$A$4:$G$301,5,0),0)","v":"19 MAYIS ENGİZ SPOR KULÜBÜ"}]
[]
[2,"E2",61,null,{"$f":"IFERROR(VLOOKUP(C8,Katılım!$A$4:$Z$301,26,0),0)","v":"YAĞIZ EMRE ÇELİK (MLT)"},null,{"$f":"IF(AND(F8=0,F9=0),\"\",IF(F8>F9,E8,E9))","v":"ALİ ARSLAN (KNY)"},null,{"$f":"IFERROR(VLOOKUP(C8,Katılım!$A$4:$G$301,5,0),0)","v":"MALATYA B. ŞEH. BLD. SPOR"},null,null,"E2",2,{"$f":"OFFSET(#REF!,M8,Katılım!$AW$1)","v":{"$error":"#REF!"}},{"$f":"IFERROR(VLOOKUP(N8,Katılım!$A$4:$Z$301,26,0),0)","v":0},{"$f":"IFERROR(VLOOKUP(N8,Katılım!$A$4:$G$301,5,0),0)","v":0},null,null,null,null,null,null,null,null,null,null,{"$f":"IF(AND(E8<>0,E9<>0),1,0)","v":1}]
["2.2",null,106,null,{"$f":"IFERROR(VLOOKUP(C9,Katılım!$A$4:$Z$301,26,0),0)","v":"ALİ ARSLAN (KNY)"},3,null,null,{"$f":"IFERROR(VLOOKUP(C9,Katılım!$A$4:$G$301,5,0),0)","v":"KARATAY BELEDİYE SPOR KÜLÜBÜ"}]
[]
{"$rows_left_out":186}
{"sheet":"Eleme","index":2,"n_rows":195,"n_cols":78,"rows_kept":195,"cut":false,"hidden":false,"merged":[[117,40,117,46],[129,40,129,46],[141,40,141,46],[153,40,153,46],[165,40,165,46],[177,40,177,46],[189,40,189,46],[113,33,113,39],[120,33,120,39],[125,33,125,39],[9,40,9,46],[21,40,21,46],[33,40,33,46],[45,40,45,46],[57,40,57,46],[69,40,69,46],[81,40,81,46],[93,40,93,46],[105,40,105,46],[180,26,180,32],[186,26,186,32],[192,26,192,32],[144,26,144,32],[132,33,132,39],[137,33,137,39],[144,33,144,39],[149,33,149,39],[156,33,156,39],[161,33,161,39],[150,26,150,32],[156,26,156,32],[162,26,162,32],[168,33,168,39],[173,33,173,39],[180,33,180,39],[185,33,185,39],[192,33,192,39],[17,33,17,39],[24,33,24,39],[29,33,29,39],[36,33,36,39],[41,33,41,39],[48,33,48,39],[53,33,53,39],[60,33,60,39],[126,26,126,32],[65,33,65,39],[72,33,72,39],[77,33,77,39],[84,33,84,39],[89,33,89,39],[96,33,96,39],[101,33,101,39],[72,26,72,32],[78,26,78,32],[84,26,84,32],[114,26,114,32],[120,26,120,32],[18,26,18,32],[24,26,24,32],[30,26,30,32],[36,26,36,32],[42,26,42,32],[48,26,48,32],[54,26,54,32],[60,26,60,32],[66,26,66,32],[169,12,169,18],[172,12,172,18],[175,12,175,18],[157,19,157,25],[160,19,160,25],[163,19,163,25],[166,19,166,25],[157,12,157,18],[160,12,160,18],[163,12,163,18],[118,19,118,25],[109,12,109,18],[112,12,112,18],[100,19,100,25],[132,26,132,32],[138,26,138,32],[168,26,168,32],[174,26,174,32],[178,12,178,18],[181,12,181,18],[184,12,184,18],[187,12,187,18],[190,12,190,18],[193,12,193,18],[169,19,169,25],[172,19,172,25],[175,19,175,25],[178,19,178,25],[181,19,181,25],[184,19,184,25],[187,19,187,25],[190,19,190,25],[193,19,193,25],[191,5,191,11],[192,5,192,11],[194,5,194,11],[4,19,4,25],[7,19,7,25],[10,19,10,25],[13,19,13,25],[16,19,16,25],[19,19,19,25],[22,19,22,25],[25,19,25,25],[28,19,28,25],[31,19,31,25],[34,19,34,25],[37,19,37,25],[40,19,40,25],[43,19,43,25],[46,19,46,25],[49,19,49,25],[52,19,52,25],[55,19,55,25],[58,19,58,25],[61,19,61,25],[64,19,64,25],[3,5,3,11],[5,5,5,11],[6,5,6,11],[8,5,8,11],[9,5,9,11],[11,5,11,11],[12,5,12,11],[5,33,5,39],[4,12,4,18],[7,12,7,18],[10,12,10,18],[6,26,6,32],[12,26,12,32],[12,33,12,39],[0,5,0,32],[1,5,1,32],[180,5,180,11],[182,5,182,11],[183,5,183,11],[185,5,185,11],[186,5,186,11],[188,5,188,11],[189,5,189,11],[158,5,158,11],[159,5,159,11],[161,5,161,11],[162,5,162,11],[164,5,164,11],[165,5,165,11],[167,5,167,11],[168,5,168,11],[170,5,170,11],[171,5,171,11],[173,5,173,11],[174,5,174,11],[176,5,176,11],[177,5,177,11],[179,5,179,11],[149,5,149,11],[150,5,150,11],[152,5,152,11],[153,5,153,11],[155,5,155,11],[156,5,156,11],[166,12,166,18],[148,19,148,25],[151,19,151,25],[154,19,154,25],[148,12,148,18],[151,12,151,18],[154,12,154,18],[138,5,138,11],[140,5,140,11],[141,5,141,11],[143,5,143,11],[144,5,144,11],[146,5,146,11],[147,5,147,11],[139,19,139,25],[142,19,142,25],[145,19,145,25],[142,12,142,18],[145,12,145,18],[139,12,139,18],[129,5,129,11],[131,5,131,11],[132,5,132,11],[134,5,134,11],[135,5,135,11],[137,5,137,11],[130,19,130,25],[133,19,133,25],[136,19,136,25],[130,12,130,18],[133,12,133,18],[136,12,136,18],[119,5,119,11],[120,5,120,11],[122,5,122,11],[123,5,123,11],[125,5,125,11],[126,5,126,11],[128,5,128,11],[121,19,121,25],[124,19,124,25],[127,19,127,25],[121,12,121,18],[124,12,124,18],[127,12,127,18],[114,5,114,11],[116,5,116,11],[117,5,117,11],[109,19,109,25],[112,19,112,25],[115,19,115,25],[103,12,103,18],[115,12,115,18],[118,12,118,18],[103,19,103,25],[106,19,106,25],[106,12,106,18],[104,5,104,11],[105,5,105,11],[107,5,107,11],[108,5,108,11],[110,5,110,11],[111,5,111,11],[113,5,113,11],[108,33,108,39],[90,5,90,11],[92,5,92,11],[93,5,93,11],[95,5,95,11],[96,5,96,11],[98,5,98,11],[99,5,99,11],[91,19,91,25],[94,19,94,25],[97,19,97,25],[91,12,91,18],[94,12,94,18],[97,12,97,18],[100,12,100,18],[90,26,90,32],[96,26,96,32],[102,26,102,32],[108,26,108,32],[101,5,101,11],[102,5,102,11],[81,5,81,11],[83,5,83,11],[84,5,84,11],[86,5,86,11],[87,5,87,11],[89,5,89,11],[82,19,82,25],[85,19,85,25],[88,19,88,25],[82,12,82,18],[85,12,85,18],[88,12,88,18],[71,5,71,11],[72,5,72,11],[74,5,74,11],[75,5,75,11],[77,5,77,11],[78,5,78,11],[80,5,80,11],[73,19,73,25],[76,19,76,25],[79,19,79,25],[73,12,73,18],[76,12,76,18],[79,12,79,18],[62,5,62,11],[63,5,63,11],[65,5,65,11],[66,5,66,11],[68,5,68,11],[69,5,69,11],[67,19,67,25],[70,19,70,25],[61,12,61,18],[64,12,64,18],[67,12,67,18],[70,12,70,18],[53,5,53,11],[54,5,54,11],[56,5,56,11],[57,5,57,11],[59,5,59,11],[60,5,60,11],[52,12,52,18],[55,12,55,18],[58,12,58,18],[42,5,42,11],[44,5,44,11],[45,5,45,11],[47,5,47,11],[48,5,48,11],[50,5,50,11],[51,5,51,11],[43,12,43,18],[46,12,46,18],[49,12,49,18],[33,5,33,11],[35,5,35,11],[36,5,36,11],[38,5,38,11],[39,5,39,11],[41,5,41,11],[34,12,34,18],[37,12,37,18],[40,12,40,18],[23,5,23,11],[24,5,24,11],[26,5,26,11],[27,5,27,11],[29,5,29,11],[30,5,30,11],[32,5,32,11],[25,12,25,18],[28,12,28,18],[31,12,31,18],[22,12,22,18],[14,5,14,11],[15,5,15,11],[17,5,17,11],[18,5,18,11],[20,5,20,11],[21,5,21,11],[13,12,13,18],[16,12,16,18],[19,12,19,18]]}
[null,null,null,null,null,{"$f":"Katılım!AC1","v":"TÜRKİYE MASA TENİSİ FEDERASYONU\nKÜÇÜKLER FEDERASYON KUPASI"},null,null,null,null,null,null,null,null,null,null,null,null,null,null,null,null,null,null,null,null,null,null,null,null,null,null,null,null,null,null,null,null,null,null,null,null,null,null,null,null,null,null,null,null,null,null,null,null,null,null,null,null,null,null,null,null,null,null,null,null,null,null,null,null,null,null,null,null,null,null,null,1]
[null,null,null,null,null,{"$f":"Katılım!AC2&\" \"&Katılım!AD3","v":"TEK ERKEK [17-18 Nisan 2023 Amasya] [ Eleme ]"}]
["Y","S","B","Q","#"]
[1,1,0,0,1,{"$f":"VLOOKUP(E4,Katılım!$A$4:$Z$301,26,0)","v":"GÖRKEM ÖÇAL (ADN)"},{"$f":"+Katılım!AJ4","v":0},{"$f":"+Katılım!AK4","v":0},{"$f":"+Katılım!AL4","v":0},{"$f":"+Katılım!AM4","v":0},{"$f":"+Katılım!AN4","v":0},{"$f":"+Katılım!#REF!","v":{"$error":"#REF!"}}]
[null,null,null,null,null,null,null,3,0,null,null,1,{"$f":"IF(AND(H5=0,I5=0),\"\",IF(H5>I5,F4,F6))","v":"GÖRKEM ÖÇAL (ADN)"},null,null,null,null,null,null,{"$f":"IF(AND(H5=0,I5=0),\"\",IF(H5>I5,F4,F6))","v":"GÖRKEM ÖÇAL (ADN)"}]
[2,65,1,64,999,{"$f":"VLOOKUP(E6,Katılım!$A$4:$Z$301,26,0)","v":{"$error":"#N/A"}},{"$f":"+Katılım!AJ6","v":0},{"$f":"+Katılım!AK6","v":0},{"$f":"+Katılım!AL6","v":0},{"$f":"+Katılım!AM6","v":0},{"$f":"+Katılım!AN6","v":0},{"$f":"+Katılım!#REF!","v":{"$error":"#REF!"}},null,null,null,null,null,null,null,null,null,null,null,null,null,65,null,null,null,null,null,null,null,{"$f":"IF(AND(V7=0,W7=0),\"\",IF(V7>W7,T5,T8))","v":"GÖRKEM ÖÇAL (ADN)"}]
[3,65,33,32,999,{"$f":"VLOOKUP(E7,Katılım!$A$4:$Z$301,26,0)","v":{"$error":"#N/A"}},{"$f":"+Katılım!AJ7","v":0},{"$f":"+Katılım!AK7","v":0},{"$f":"+Katılım!AL7","v":0},{"$f":"+Katılım!AM7","v":0},{"$f":"+Katılım!AN7","v":0},{"$f":"+Katılım!#REF!","v":{"$error":"#REF!"}},null,null,null,null,null,null,null,null,null,3,0,null,null,null,{"$f":"IF(AND(V7=0,W7=0),\"\",IF(V7>W7,T5,T8))","v":"GÖRKEM ÖÇAL (ADN)"},null,null,null,null,null,null,null,null,null,null,null,null,97]
[null,null,null,null,null,null,null,0,0,null,null,2,{"$f":"IF(AND(H8=0,I8=0),\"\",IF(H8>I8,F7,F9))","v":""},null,null,null,null,null,null,{"$f":"IF(AND(H8=0,I8=0),\"\",IF(H8>I8,F7,F9))","v":""}]
[4,33,0,0,999,{"$f":"VLOOKUP(E9,Katılım!$A$4:$Z$301,26,0)","v":{"$error":"#N/A"}},{"$f":"+Katılım!AJ9","v":0},{"$f":"+Katılım!AK9","v":0},{"$f":"+Katılım!AL9","v":0},{"$f":"+Katılım!AM9","v":0},{"$f":"+Katılım!AN9","v":0},{"$f":"+Katılım!#REF!","v":{"$error":"#REF!"}}]
[5,33,0,0,41,{"$f":"VLOOKUP(E10,Katılım!$A$4:$Z$301,26,0)","v":"EYMEN BAŞAR (İST)"},{"$f":"+Katılım!AJ10","v":0},{"$f":"+Katılım!AK10","v":0},{"$f":"+Katılım!AL10","v":0},{"$f":"+Katılım!AM10","v":0},{"$f":"+Katılım!AN10","v":0},{"$f":"+Katılım!#REF!","v":{"$error":"#REF!"}},null,null,null,null,null,null,null,null,null,null,null,null,null,null,null,null,null,null,null,null,null,null,null,0,0,null,null,null,{"$f":"IF(AND(AJ10=0,AK10=0),\"\",IF(AJ10>AK10,AH6,AH13))","v":""}]
{"$rows_left_out":186}
{"sheet":"Ana_Tablo","index":3,"n_rows":98,"n_cols":105,"rows_kept":98,"cut":false,"hidden":false,"merged":[[97,43,97,49],[81,43,81,49],[83,50,83,56],[87,50,87,56],[78,50,78,56],[56,71,56,77],[88,29,88,35],[91,29,91,35],[80,36,80,42],[83,36,83,42],[86,43,86,49],[80,50,80,56],[85,50,85,56],[89,50,89,56],[76,57,76,63],[70,57,70,63],[89,36,89,42],[91,43,91,49],[74,57,74,63],[93,29,93,35],[96,36,96,42],[84,43,84,49],[92,36,92,42],[90,29,90,35],[78,22,78,28],[52,29,52,35],[60,29,60,35],[68,29,68,35],[76,29,76,35],[64,29,64,35],[72,29,72,35],[75,15,75,21],[58,22,58,28],[65,15,65,21],[73,15,73,21],[77,15,77,21],[74,22,74,28],[38,71,38,77],[49,15,49,21],[51,15,51,21],[67,15,67,21],[71,15,71,21],[66,22,66,28],[48,29,48,35],[50,36,50,42],[58,36,58,42],[66,36,66,42],[54,43,54,49],[71,43,71,49],[48,43,48,49],[64,43,64,49],[51,50,51,56],[68,50,68,56],[55,15,55,21],[53,15,53,21],[54,22,54,28],[69,15,69,21],[70,22,70,28],[63,15,63,21],[59,15,59,21],[57,15,57,21],[24,64,24,70],[54,64,54,70],[74,36,74,42],[60,57,60,63],[48,57,48,63],[62,64,62,70],[94,36,94,42],[95,43,95,49],[93,43,93,49],[82,36,82,42],[85,36,85,42],[88,43,88,49],[73,50,73,56],[75,50,75,56],[77,43,77,49],[79,43,79,49],[74,8,74,14],[76,8,76,14],[78,8,78,14],[80,8,80,14],[54,8,54,14],[60,8,60,14],[66,8,66,14],[72,8,72,14],[68,8,68,14],[70,8,70,14],[64,8,64,14],[58,8,58,14],[62,8,62,14],[56,8,56,14],[79,15,79,21],[12,1,12,7],[7,8,7,14],[10,8,10,14],[13,8,13,14],[8,15,8,21],[24,1,24,7],[50,8,50,14],[52,8,52,14],[41,1,41,7],[42,1,42,7],[44,1,44,7],[45,1,45,7],[47,1,47,7],[33,1,33,7],[35,1,35,7],[36,1,36,7],[38,1,38,7],[39,1,39,7],[26,1,26,7],[27,1,27,7],[29,1,29,7],[30,1,30,7],[32,1,32,7],[18,1,18,7],[20,1,20,7],[21,1,21,7],[23,1,23,7],[19,8,19,14],[22,8,22,14],[20,15,20,21],[18,22,18,28],[14,1,14,7],[15,1,15,7],[17,1,17,7],[16,8,16,14],[15,15,15,21],[5,1,5,7],[6,1,6,7],[8,1,8,7],[9,1,9,7],[11,1,11,7],[0,24,2,46],[3,24,3,46],[4,24,4,46],[0,1,0,7],[2,1,2,7],[3,1,3,7],[1,8,1,14],[4,8,4,14],[3,15,3,21],[6,29,6,35],[27,15,27,21],[39,15,39,21],[32,15,32,21],[24,15,24,21],[31,29,31,35],[62,22,62,28],[12,50,12,56],[42,29,42,35],[25,8,25,14],[50,22,50,28],[31,8,31,14],[37,8,37,14],[28,8,28,14],[34,8,34,14],[40,8,40,14],[43,8,43,14],[44,15,44,21],[46,8,46,14],[37,50,37,56],[56,29,56,35],[17,29,17,35],[61,15,61,21]]}
[1,"GÖRKEM ÖÇAL (ADN)",null,null,null,null,null,null,null,null,null,null,null,null,null,null,null,null,null,null,null,null,null,null,"TÜRKİYE MASA TENİSİ FEDERASYONU\nKÜÇÜKLER FEDERASYON KUPASI",null,null,null,null,null,null,null,null,null,null,null,null,null,null,null,null,null,null,null,null,null,null,null,null,null,null,null,null,null,null,null,null,null,null,null,null,null,null,null,null,null,null,null,null,null,null,null,null,null,null,null,null,null,null,null,null,null,null,null,null,null,null,null,null,null,null,null,null,null,null,null,null,null,null,null,null,null,null,"1.Tur (1-16)",3]
[null,null,null,3,0,"Y1",null,1,"GÖRKEM ÖÇAL (ADN)",null,null,null,null,null,null,null,null,null,null,null,null,null,null,null,null,null,null,null,null,null,null,null,null,null,null,null,null,null,null,null,null,null,null,null,null,null,null,null,null,null,null,null,null,null,null,null,null,null,null,null,null,null,null,null,null,null,null,null,null,null,null,null,null,null,null,null,null,null,null,null,null,null,null,null,null,null,null,null,null,null,null,null,null,null,null,null,null,null,null,null,null,null,null,"2.Tur (17-32)"]
[2,"EYMEN BAŞAR (İST)",null,null,null,null,null,null,null,null,null,null,null,null,17,null,null,null,null,null,null,null,null,null,null,null,null,null,null,null,null,null,null,null,null,null,null,null,null,null,null,null,null,null,null,null,null,null,null,null,null,null,null,null,null,null,null,null,null,null,null,null,null,null,null,null,null,null,null,null,null,null,null,null,null,null,null,null,null,null,null,null,null,null,null,null,null,null,null,null,null,null,null,null,null,null,null,null,null,null,null,null,null,"3.Tur (33-44)"]
[3,"AHMET ÇELİK (GZT)",null,null,null,null,null,null,null,null,3,0,"Y17",null,null,"GÖRKEM ÖÇAL (ADN)",null,null,null,null,null,null,null,null,"TEK ERKEK [17-18 Nisan Amasya]",null,null,null,null,null,null,null,null,null,null,null,null,null,null,null,null,null,null,null,null,null,null,null,null,null,null,null,null,null,null,null,null,null,null,null,null,null,null,null,null,null,null,null,null,null,null,null,null,null,null,null,null,null,null,null,null,null,null,null,null,null,null,null,null,null,null,null,null,null,null,null,null,null,null,null,null,null,null,"4.Tur (45-48)"]
[null,null,null,0,3,"Y2",null,2,"ARAS AYDIN (İST)",null,null,null,null,null,null,null,null,null,null,null,null,33,null,null,"[ Ana Tablo ]",null,null,null,null,null,null,null,null,null,null,null,null,null,null,null,null,null,null,null,null,null,null,null,null,null,null,null,null,null,null,null,null,null,null,null,null,null,null,null,null,null,null,null,null,null,null,null,null,null,null,null,null,null,null,null,null,null,null,null,null,null,null,null,null,null,null,null,null,null,null,null,null,null,null,null,null,null,null,"5.Tur (49-56)"]
[4,"ARAS AYDIN (İST)",null,null,null,null,null,null,null,null,null,null,null,null,null,null,null,null,null,null,null,null,null,null,null,null,null,null,null,null,null,null,null,null,null,null,null,null,null,null,null,null,null,null,null,null,null,null,null,null,null,null,null,null,null,null,null,null,null,null,null,null,null,null,null,null,null,null,null,null,null,null,null,null,null,null,null,null,null,null,null,null,null,null,null,null,null,null,null,null,null,null,null,null,null,null,null,null,null,null,null,null,null,"6.Tur (57-62)"]
[5,"SALİH EREN YILDIRIM (ISP)",null,null,null,null,null,null,null,null,null,null,null,null,null,null,null,3,0,"Y25",null,null,null,null,null,null,null,null,null,"GÖRKEM ÖÇAL (ADN)",null,null,null,null,null,null,null,null,null,null,null,null,null,null,null,null,null,null,null,null,null,null,null,null,null,null,null,null,null,null,null,null,null,null,null,null,null,null,null,null,null,null,null,null,null,null,null,null,null,null,null,null,null,null,null,null,null,null,null,null,null,null,null,null,null,null,null,null,null,null,null,null,null,"7.Tur (63-67)"]
[null,null,null,3,0,"Y3",null,3,"SALİH EREN YILDIRIM (ISP)",null,null,null,null,null,null,null,null,null,null,null,null,null,null,null,null,null,null,null,null,null,null,null,null,null,null,49,null,null,null,null,null,null,null,null,null,null,null,null,null,null,null,null,null,null,null,null,null,null,null,null,null,null,null,null,null,null,null,null,null,null,null,null,null,null,null,null,null,null,null,null,null,null,null,null,null,null,null,null,null,null,null,null,null,null,null,null,null,null,null,null,null,null,null,"8.Tur (68-70)"]
[6,"TAHA KAAN DUMAN (BTM)",null,null,null,null,null,null,null,null,null,null,null,null,18,"SALİH EREN YILDIRIM (ISP)",null,null,null,null,null,null,null,null,null,null,null,null,null,null,null,null,null,null,null,null,null,null,null,null,null,null,null,null,null,null,null,null,null,null,null,null,null,null,null,null,null,null,null,null,null,null,null,null,null,null,null,null,null,null,null,null,null,null,null,null,null,null,null,null,null,null,null,null,null,null,null,null,null,null,null,null,null,null,null,null,null,null,null,null,null,null,null,"9.Tur (71)"]
[7,"AHMET YİĞİT GÜLENLER (GZT)",null,null,null,null,null,null,null,null,3,1,"Y18",null,null,null,null,null,null,null,null,null,null,null,null,null,null,null,null,null,null,null,null,null,null,null,null,null,null,null,null,null,null,null,null,null,null,null,null,null,null,null,null,null,null,null,null,null,null,null,null,null,null,null,null,null,null,null,null,null,null,null,null,null,null,null,null,null,null,null,null,null,null,null,null,null,null,null,null,null,null,null,null,null,null,null,null,null,null,null,null,null,null,"10.Tur (72)"]
{"$rows_left_out":89}
{"sheet":"Sıralama","index":4,"n_rows":38,"n_cols":3,"rows_kept":38,"cut":false,"hidden":false,"merged":[[1,0,1,6],[2,0,2,6],[4,0,4,6]]}
[]
[{"$f":"+Katılım!A1","v":"TÜRKİYE MASA TENİSİ FEDERASYONU\nKÜÇÜKLER FEDERASYON KUPASI"}]
[{"$f":"+Katılım!A2","v":"TEK ERKEK [17-18 Nisan 2023 Amasya]"}]
[]
["ERKEK FERDİ SIRALAMA"]
[null,"Sıra","Sporcu Adı-Soyadı"]
[null,"1.","KENAN EREN KAHRAMAN "]
[null,"2.","GÖRKEM ÖÇAL"]
[null,"3.","ALİ ENES SEREN"]
[null,"4.","KUZEY GÜNDOĞDU"]
{"$rows_left_out":28}